mesos-builds mailing list archives

Site index · List index
Message view « Date » · « Thread »
Top « Date » · « Thread »
From Apache Jenkins Server <jenk...@builds.apache.org>
Subject Build failed in Jenkins: Mesos-Reviewbot #17361
Date Thu, 09 Mar 2017 01:40:23 GMT
See <https://builds.apache.org/job/Mesos-Reviewbot/17361/display/redirect>

------------------------------------------
[...truncated 25.67 MB...]
I0309 01:39:45.953274 30450 containerizer.cpp:600] Recovering containerizer
I0309 01:39:45.954973 30449 provisioner.cpp:410] Provisioner recovery complete
I0309 01:39:45.955346 30447 slave.cpp:5572] Finished recovery
I0309 01:39:45.956168 30447 slave.cpp:5754] Querying resource estimator for oversubscribable
resources
I0309 01:39:45.956446 30441 slave.cpp:5768] Received oversubscribable resources {} from the
resource estimator
I0309 01:39:45.960397 30447 process.cpp:3705] Handling HTTP event for process 'slave(708)'
with path: '/slave(708)/monitor/statistics.json'
I0309 01:39:45.962203 30450 http.cpp:916] Authorizing principal 'test-principal' to GET the
'/monitor/statistics.json' endpoint
I0309 01:39:45.967891 30441 slave.cpp:808] Agent terminating
[       OK ] Endpoint/SlaveEndpointTest.AuthorizedRequest/1 (37 ms)
[ RUN      ] Endpoint/SlaveEndpointTest.AuthorizedRequest/2
I0309 01:39:45.979573 30416 containerizer.cpp:221] Using isolation: posix/cpu,posix/mem,filesystem/posix,network/cni
W0309 01:39:45.980080 30416 backend.cpp:76] Failed to create 'aufs' backend: AufsBackend requires
root privileges
W0309 01:39:45.980187 30416 backend.cpp:76] Failed to create 'bind' backend: BindBackend requires
root privileges
I0309 01:39:45.980227 30416 provisioner.cpp:249] Using default backend 'copy'
I0309 01:39:45.984688 30449 slave.cpp:215] Mesos agent started on (709)@172.17.0.2:37125
I0309 01:39:45.984725 30449 slave.cpp:216] Flags at startup: --acls="" --appc_simple_discovery_uri_prefix="http://"
--appc_store_dir="/tmp/mesos/store/appc" --authenticate_http_readonly="true" --authenticate_http_readwrite="true"
--authenticatee="crammd5" --authentication_backoff_factor="1secs" --authorizer="local" --cgroups_cpu_enable_pids_and_tids_count="false"
--cgroups_enable_cfs="false" --cgroups_hierarchy="/sys/fs/cgroup" --cgroups_limit_swap="false"
--cgroups_root="mesos" --container_disk_watch_interval="15secs" --containerizers="mesos" --credential="/tmp/Endpoint_SlaveEndpointTest_AuthorizedRequest_2_LVnfyA/credential"
--default_role="*" --disk_watch_interval="1mins" --docker="docker" --docker_kill_orphans="true"
--docker_registry="https://registry-1.docker.io" --docker_remove_delay="6hrs" --docker_socket="/var/run/docker.sock"
--docker_stop_timeout="0ns" --docker_store_dir="/tmp/mesos/store/docker" --docker_volume_checkpoint_dir="/var/run/mesos/isolators/docker/volume"
--enforce_container_disk_quota="false" --executor_registration_timeout="1mins" --executor_shutdown_grace_period="5secs"
--fetcher_cache_dir="/tmp/Endpoint_SlaveEndpointTest_AuthorizedRequest_2_LVnfyA/fetch" --fetcher_cache_size="2GB"
--frameworks_home="" --gc_delay="1weeks" --gc_disk_headroom="0.1" --hadoop_home="" --help="false"
--hostname_lookup="true" --http_authenticators="basic" --http_command_executor="false" --http_credentials="/tmp/Endpoint_SlaveEndpointTest_AuthorizedRequest_2_LVnfyA/http_credentials"
--http_heartbeat_interval="30secs" --initialize_driver_logging="true" --isolation="posix/cpu,posix/mem"
--launcher="posix" --launcher_dir="/mesos/mesos-1.3.0/_build/src" --logbufsecs="0" --logging_level="INFO"
--max_completed_executors_per_framework="150" --oversubscribed_resources_interval="15secs"
--perf_duration="10secs" --perf_interval="1mins" --qos_correction_interval_min="0ns" --quiet="false"
--recover="reconnect" --recovery_timeout="15mins" --registration_backoff_factor="10ms" --resources="cpus:2;gpus:0;mem:1024;disk:1024;ports:[31000-32000]"
--revocable_cpu_low_priority="true" --runtime_dir="/tmp/Endpoint_SlaveEndpointTest_AuthorizedRequest_2_LVnfyA"
--sandbox_directory="/mnt/mesos/sandbox" --strict="true" --switch_user="true" --systemd_enable_support="true"
--systemd_runtime_directory="/run/systemd/system" --version="false" --work_dir="/tmp/Endpoint_SlaveEndpointTest_AuthorizedRequest_2_PAMol7"
I0309 01:39:45.985463 30449 credentials.hpp:86] Loading credential for authentication from
'/tmp/Endpoint_SlaveEndpointTest_AuthorizedRequest_2_LVnfyA/credential'
I0309 01:39:45.985683 30449 slave.cpp:358] Agent using credential for: test-principal
I0309 01:39:45.985709 30449 credentials.hpp:37] Loading credentials for authentication from
'/tmp/Endpoint_SlaveEndpointTest_AuthorizedRequest_2_LVnfyA/http_credentials'
I0309 01:39:45.986001 30449 http.cpp:964] Using default 'basic' HTTP authenticator for realm
'mesos-agent-readonly'
I0309 01:39:45.986160 30449 http.cpp:964] Using default 'basic' HTTP authenticator for realm
'mesos-agent-readwrite'
I0309 01:39:45.987360 30449 slave.cpp:545] Agent resources: cpus(*):2; mem(*):1024; disk(*):1024;
ports(*):[31000-32000]
I0309 01:39:45.987438 30449 slave.cpp:553] Agent attributes: [  ]
I0309 01:39:45.987452 30449 slave.cpp:558] Agent hostname: 5c5c2be746af
I0309 01:39:45.987711 30444 status_update_manager.cpp:177] Pausing sending status updates
I0309 01:39:45.988711 30435 state.cpp:62] Recovering state from '/tmp/Endpoint_SlaveEndpointTest_AuthorizedRequest_2_PAMol7/meta'
I0309 01:39:45.989163 30437 status_update_manager.cpp:203] Recovering status update manager
I0309 01:39:45.989423 30435 containerizer.cpp:600] Recovering containerizer
I0309 01:39:45.991050 30435 provisioner.cpp:410] Provisioner recovery complete
I0309 01:39:45.991430 30436 slave.cpp:5572] Finished recovery
I0309 01:39:45.992127 30436 slave.cpp:5754] Querying resource estimator for oversubscribable
resources
I0309 01:39:45.992440 30445 slave.cpp:5768] Received oversubscribable resources {} from the
resource estimator
I0309 01:39:45.995338 30449 process.cpp:3705] Handling HTTP event for process 'slave(709)'
with path: '/slave(709)/containers'
I0309 01:39:45.997009 30435 http.cpp:916] Authorizing principal 'test-principal' to GET the
'/containers' endpoint
I0309 01:39:46.000437 30447 slave.cpp:808] Agent terminating
[       OK ] Endpoint/SlaveEndpointTest.AuthorizedRequest/2 (31 ms)
[ RUN      ] Endpoint/SlaveEndpointTest.UnauthorizedRequest/0
I0309 01:39:46.011387 30416 containerizer.cpp:221] Using isolation: posix/cpu,posix/mem,filesystem/posix,network/cni
W0309 01:39:46.011984 30416 backend.cpp:76] Failed to create 'aufs' backend: AufsBackend requires
root privileges
W0309 01:39:46.012120 30416 backend.cpp:76] Failed to create 'bind' backend: BindBackend requires
root privileges
I0309 01:39:46.012169 30416 provisioner.cpp:249] Using default backend 'copy'
I0309 01:39:46.015553 30438 slave.cpp:215] Mesos agent started on (710)@172.17.0.2:37125
I0309 01:39:46.015588 30438 slave.cpp:216] Flags at startup: --acls="" --appc_simple_discovery_uri_prefix="http://"
--appc_store_dir="/tmp/mesos/store/appc" --authenticate_http_readonly="true" --authenticate_http_readwrite="true"
--authenticatee="crammd5" --authentication_backoff_factor="1secs" --authorizer="local" --cgroups_cpu_enable_pids_and_tids_count="false"
--cgroups_enable_cfs="false" --cgroups_hierarchy="/sys/fs/cgroup" --cgroups_limit_swap="false"
--cgroups_root="mesos" --container_disk_watch_interval="15secs" --containerizers="mesos" --credential="/tmp/Endpoint_SlaveEndpointTest_UnauthorizedRequest_0_hRqhFt/credential"
--default_role="*" --disk_watch_interval="1mins" --docker="docker" --docker_kill_orphans="true"
--docker_registry="https://registry-1.docker.io" --docker_remove_delay="6hrs" --docker_socket="/var/run/docker.sock"
--docker_stop_timeout="0ns" --docker_store_dir="/tmp/mesos/store/docker" --docker_volume_checkpoint_dir="/var/run/mesos/isolators/docker/volume"
--enforce_container_disk_quota="false" --executor_registration_timeout="1mins" --executor_shutdown_grace_period="5secs"
--fetcher_cache_dir="/tmp/Endpoint_SlaveEndpointTest_UnauthorizedRequest_0_hRqhFt/fetch" --fetcher_cache_size="2GB"
--frameworks_home="" --gc_delay="1weeks" --gc_disk_headroom="0.1" --hadoop_home="" --help="false"
--hostname_lookup="true" --http_authenticators="basic" --http_command_executor="false" --http_credentials="/tmp/Endpoint_SlaveEndpointTest_UnauthorizedRequest_0_hRqhFt/http_credentials"
--http_heartbeat_interval="30secs" --initialize_driver_logging="true" --isolation="posix/cpu,posix/mem"
--launcher="posix" --launcher_dir="/mesos/mesos-1.3.0/_build/src" --logbufsecs="0" --logging_level="INFO"
--max_completed_executors_per_framework="150" --oversubscribed_resources_interval="15secs"
--perf_duration="10secs" --perf_interval="1mins" --qos_correction_interval_min="0ns" --quiet="false"
--recover="reconnect" --recovery_timeout="15mins" --registration_backoff_factor="10ms" --resources="cpus:2;gpus:0;mem:1024;disk:1024;ports:[31000-32000]"
--revocable_cpu_low_priority="true" --runtime_dir="/tmp/Endpoint_SlaveEndpointTest_UnauthorizedRequest_0_hRqhFt"
--sandbox_directory="/mnt/mesos/sandbox" --strict="true" --switch_user="true" --systemd_enable_support="true"
--systemd_runtime_directory="/run/systemd/system" --version="false" --work_dir="/tmp/Endpoint_SlaveEndpointTest_UnauthorizedRequest_0_R9udn0"
I0309 01:39:46.016288 30438 credentials.hpp:86] Loading credential for authentication from
'/tmp/Endpoint_SlaveEndpointTest_UnauthorizedRequest_0_hRqhFt/credential'
I0309 01:39:46.016533 30438 slave.cpp:358] Agent using credential for: test-principal
I0309 01:39:46.016556 30438 credentials.hpp:37] Loading credentials for authentication from
'/tmp/Endpoint_SlaveEndpointTest_UnauthorizedRequest_0_hRqhFt/http_credentials'
I0309 01:39:46.016809 30438 http.cpp:964] Using default 'basic' HTTP authenticator for realm
'mesos-agent-readonly'
I0309 01:39:46.016948 30438 http.cpp:964] Using default 'basic' HTTP authenticator for realm
'mesos-agent-readwrite'
I0309 01:39:46.018540 30438 slave.cpp:545] Agent resources: cpus(*):2; mem(*):1024; disk(*):1024;
ports(*):[31000-32000]
I0309 01:39:46.018651 30438 slave.cpp:553] Agent attributes: [  ]
I0309 01:39:46.018667 30438 slave.cpp:558] Agent hostname: 5c5c2be746af
I0309 01:39:46.018802 30444 status_update_manager.cpp:177] Pausing sending status updates
I0309 01:39:46.020319 30450 state.cpp:62] Recovering state from '/tmp/Endpoint_SlaveEndpointTest_UnauthorizedRequest_0_R9udn0/meta'
I0309 01:39:46.020730 30448 status_update_manager.cpp:203] Recovering status update manager
I0309 01:39:46.020948 30439 containerizer.cpp:600] Recovering containerizer
I0309 01:39:46.022469 30439 provisioner.cpp:410] Provisioner recovery complete
I0309 01:39:46.023257 30446 slave.cpp:5572] Finished recovery
I0309 01:39:46.023814 30446 slave.cpp:5754] Querying resource estimator for oversubscribable
resources
I0309 01:39:46.024092 30436 slave.cpp:5768] Received oversubscribable resources {} from the
resource estimator
I0309 01:39:46.027056 30445 process.cpp:3705] Handling HTTP event for process 'slave(710)'
with path: '/slave(710)/monitor/statistics'
I0309 01:39:46.028525 30441 http.cpp:916] Authorizing principal 'test-principal' to GET the
'/monitor/statistics' endpoint
I0309 01:39:46.031239 30436 slave.cpp:808] Agent terminating
[       OK ] Endpoint/SlaveEndpointTest.UnauthorizedRequest/0 (32 ms)
[ RUN      ] Endpoint/SlaveEndpointTest.UnauthorizedRequest/1
I0309 01:39:46.045128 30416 containerizer.cpp:221] Using isolation: posix/cpu,posix/mem,filesystem/posix,network/cni
W0309 01:39:46.045714 30416 backend.cpp:76] Failed to create 'aufs' backend: AufsBackend requires
root privileges
W0309 01:39:46.045819 30416 backend.cpp:76] Failed to create 'bind' backend: BindBackend requires
root privileges
I0309 01:39:46.045858 30416 provisioner.cpp:249] Using default backend 'copy'
I0309 01:39:46.048810 30442 slave.cpp:215] Mesos agent started on (711)@172.17.0.2:37125
I0309 01:39:46.048836 30442 slave.cpp:216] Flags at startup: --acls="" --appc_simple_discovery_uri_prefix="http://"
--appc_store_dir="/tmp/mesos/store/appc" --authenticate_http_readonly="true" --authenticate_http_readwrite="true"
--authenticatee="crammd5" --authentication_backoff_factor="1secs" --authorizer="local" --cgroups_cpu_enable_pids_and_tids_count="false"
--cgroups_enable_cfs="false" --cgroups_hierarchy="/sys/fs/cgroup" --cgroups_limit_swap="false"
--cgroups_root="mesos" --container_disk_watch_interval="15secs" --containerizers="mesos" --credential="/tmp/Endpoint_SlaveEndpointTest_UnauthorizedRequest_1_1D4z7m/credential"
--default_role="*" --disk_watch_interval="1mins" --docker="docker" --docker_kill_orphans="true"
--docker_registry="https://registry-1.docker.io" --docker_remove_delay="6hrs" --docker_socket="/var/run/docker.sock"
--docker_stop_timeout="0ns" --docker_store_dir="/tmp/mesos/store/docker" --docker_volume_checkpoint_dir="/var/run/mesos/isolators/docker/volume"
--enforce_container_disk_quota="false" --executor_registration_timeout="1mins" --executor_shutdown_grace_period="5secs"
--fetcher_cache_dir="/tmp/Endpoint_SlaveEndpointTest_UnauthorizedRequest_1_1D4z7m/fetch" --fetcher_cache_size="2GB"
--frameworks_home="" --gc_delay="1weeks" --gc_disk_headroom="0.1" --hadoop_home="" --help="false"
--hostname_lookup="true" --http_authenticators="basic" --http_command_executor="false" --http_credentials="/tmp/Endpoint_SlaveEndpointTest_UnauthorizedRequest_1_1D4z7m/http_credentials"
--http_heartbeat_interval="30secs" --initialize_driver_logging="true" --isolation="posix/cpu,posix/mem"
--launcher="posix" --launcher_dir="/mesos/mesos-1.3.0/_build/src" --logbufsecs="0" --logging_level="INFO"
--max_completed_executors_per_framework="150" --oversubscribed_resources_interval="15secs"
--perf_duration="10secs" --perf_interval="1mins" --qos_correction_interval_min="0ns" --quiet="false"
--recover="reconnect" --recovery_timeout="15mins" --registration_backoff_factor="10ms" --resources="cpus:2;gpus:0;mem:1024;disk:1024;ports:[31000-32000]"
--revocable_cpu_low_priority="true" --runtime_dir="/tmp/Endpoint_SlaveEndpointTest_UnauthorizedRequest_1_1D4z7m"
--sandbox_directory="/mnt/mesos/sandbox" --strict="true" --switch_user="true" --systemd_enable_support="true"
--systemd_runtime_directory="/run/systemd/system" --version="false" --work_dir="/tmp/Endpoint_SlaveEndpointTest_UnauthorizedRequest_1_XaQ8JT"
I0309 01:39:46.049559 30442 credentials.hpp:86] Loading credential for authentication from
'/tmp/Endpoint_SlaveEndpointTest_UnauthorizedRequest_1_1D4z7m/credential'
I0309 01:39:46.049748 30442 slave.cpp:358] Agent using credential for: test-principal
I0309 01:39:46.049775 30442 credentials.hpp:37] Loading credentials for authentication from
'/tmp/Endpoint_SlaveEndpointTest_UnauthorizedRequest_1_1D4z7m/http_credentials'
I0309 01:39:46.050145 30442 http.cpp:964] Using default 'basic' HTTP authenticator for realm
'mesos-agent-readonly'
I0309 01:39:46.050317 30442 http.cpp:964] Using default 'basic' HTTP authenticator for realm
'mesos-agent-readwrite'
I0309 01:39:46.052076 30442 slave.cpp:545] Agent resources: cpus(*):2; mem(*):1024; disk(*):1024;
ports(*):[31000-32000]
I0309 01:39:46.052225 30442 slave.cpp:553] Agent attributes: [  ]
I0309 01:39:46.052273 30442 slave.cpp:558] Agent hostname: 5c5c2be746af
I0309 01:39:46.052690 30444 status_update_manager.cpp:177] Pausing sending status updates
I0309 01:39:46.054514 30445 state.cpp:62] Recovering state from '/tmp/Endpoint_SlaveEndpointTest_UnauthorizedRequest_1_XaQ8JT/meta'
I0309 01:39:46.054865 30435 status_update_manager.cpp:203] Recovering status update manager
I0309 01:39:46.055124 30449 containerizer.cpp:600] Recovering containerizer
I0309 01:39:46.056478 30442 provisioner.cpp:410] Provisioner recovery complete
I0309 01:39:46.056944 30435 slave.cpp:5572] Finished recovery
I0309 01:39:46.057562 30435 slave.cpp:5754] Querying resource estimator for oversubscribable
resources
I0309 01:39:46.057869 30440 slave.cpp:5768] Received oversubscribable resources {} from the
resource estimator
I0309 01:39:46.061013 30450 process.cpp:3705] Handling HTTP event for process 'slave(711)'
with path: '/slave(711)/monitor/statistics.json'
I0309 01:39:46.062625 30441 http.cpp:916] Authorizing principal 'test-principal' to GET the
'/monitor/statistics.json' endpoint
I0309 01:39:46.065488 30442 slave.cpp:808] Agent terminating
[       OK ] Endpoint/SlaveEndpointTest.UnauthorizedRequest/1 (32 ms)
[ RUN      ] Endpoint/SlaveEndpointTest.UnauthorizedRequest/2
I0309 01:39:46.078588 30416 containerizer.cpp:221] Using isolation: posix/cpu,posix/mem,filesystem/posix,network/cni
W0309 01:39:46.079242 30416 backend.cpp:76] Failed to create 'aufs' backend: AufsBackend requires
root privileges
W0309 01:39:46.079407 30416 backend.cpp:76] Failed to create 'bind' backend: BindBackend requires
root privileges
I0309 01:39:46.079522 30416 provisioner.cpp:249] Using default backend 'copy'
I0309 01:39:46.084151 30449 slave.cpp:215] Mesos agent started on (712)@172.17.0.2:37125
I0309 01:39:46.084177 30449 slave.cpp:216] Flags at startup: --acls="" --appc_simple_discovery_uri_prefix="http://"
--appc_store_dir="/tmp/mesos/store/appc" --authenticate_http_readonly="true" --authenticate_http_readwrite="true"
--authenticatee="crammd5" --authentication_backoff_factor="1secs" --authorizer="local" --cgroups_cpu_enable_pids_and_tids_count="false"
--cgroups_enable_cfs="false" --cgroups_hierarchy="/sys/fs/cgroup" --cgroups_limit_swap="false"
--cgroups_root="mesos" --container_disk_watch_interval="15secs" --containerizers="mesos" --credential="/tmp/Endpoint_SlaveEndpointTest_UnauthorizedRequest_2_XEsvVg/credential"
--default_role="*" --disk_watch_interval="1mins" --docker="docker" --docker_kill_orphans="true"
--docker_registry="https://registry-1.docker.io" --docker_remove_delay="6hrs" --docker_socket="/var/run/docker.sock"
--docker_stop_timeout="0ns" --docker_store_dir="/tmp/mesos/store/docker" --docker_volume_checkpoint_dir="/var/run/mesos/isolators/docker/volume"
--enforce_container_disk_quota="false" --executor_registration_timeout="1mins" --executor_shutdown_grace_period="5secs"
--fetcher_cache_dir="/tmp/Endpoint_SlaveEndpointTest_UnauthorizedRequest_2_XEsvVg/fetch" --fetcher_cache_size="2GB"
--frameworks_home="" --gc_delay="1weeks" --gc_disk_headroom="0.1" --hadoop_home="" --help="false"
--hostname_lookup="true" --http_authenticators="basic" --http_command_executor="false" --http_credentials="/tmp/Endpoint_SlaveEndpointTest_UnauthorizedRequest_2_XEsvVg/http_credentials"
--http_heartbeat_interval="30secs" --initialize_driver_logging="true" --isolation="posix/cpu,posix/mem"
--launcher="posix" --launcher_dir="/mesos/mesos-1.3.0/_build/src" --logbufsecs="0" --logging_level="INFO"
--max_completed_executors_per_framework="150" --oversubscribed_resources_interval="15secs"
--perf_duration="10secs" --perf_interval="1mins" --qos_correction_interval_min="0ns" --quiet="false"
--recover="reconnect" --recovery_timeout="15mins" --registration_backoff_factor="10ms" --resources="cpus:2;gpus:0;mem:1024;disk:1024;ports:[31000-32000]"
--revocable_cpu_low_priority="true" --runtime_dir="/tmp/Endpoint_SlaveEndpointTest_UnauthorizedRequest_2_XEsvVg"
--sandbox_directory="/mnt/mesos/sandbox" --strict="true" --switch_user="true" --systemd_enable_support="true"
--systemd_runtime_directory="/run/systemd/system" --version="false" --work_dir="/tmp/Endpoint_SlaveEndpointTest_UnauthorizedRequest_2_bUBFsN"
I0309 01:39:46.084847 30449 credentials.hpp:86] Loading credential for authentication from
'/tmp/Endpoint_SlaveEndpointTest_UnauthorizedRequest_2_XEsvVg/credential'
I0309 01:39:46.085031 30449 slave.cpp:358] Agent using credential for: test-principal
I0309 01:39:46.085053 30449 credentials.hpp:37] Loading credentials for authentication from
'/tmp/Endpoint_SlaveEndpointTest_UnauthorizedRequest_2_XEsvVg/http_credentials'
I0309 01:39:46.085283 30449 http.cpp:964] Using default 'basic' HTTP authenticator for realm
'mesos-agent-readonly'
I0309 01:39:46.085420 30449 http.cpp:964] Using default 'basic' HTTP authenticator for realm
'mesos-agent-readwrite'
I0309 01:39:46.086601 30449 slave.cpp:545] Agent resources: cpus(*):2; mem(*):1024; disk(*):1024;
ports(*):[31000-32000]
I0309 01:39:46.086707 30449 slave.cpp:553] Agent attributes: [  ]
I0309 01:39:46.086724 30449 slave.cpp:558] Agent hostname: 5c5c2be746af
I0309 01:39:46.086900 30447 status_update_manager.cpp:177] Pausing sending status updates
I0309 01:39:46.088210 30450 state.cpp:62] Recovering state from '/tmp/Endpoint_SlaveEndpointTest_UnauthorizedRequest_2_bUBFsN/meta'
I0309 01:39:46.088500 30443 status_update_manager.cpp:203] Recovering status update manager
I0309 01:39:46.088757 30438 containerizer.cpp:600] Recovering containerizer
I0309 01:39:46.090243 30436 provisioner.cpp:410] Provisioner recovery complete
I0309 01:39:46.090636 30444 slave.cpp:5572] Finished recovery
I0309 01:39:46.091199 30444 slave.cpp:5754] Querying resource estimator for oversubscribable
resources
I0309 01:39:46.091454 30443 slave.cpp:5768] Received oversubscribable resources {} from the
resource estimator
I0309 01:39:46.094125 30448 process.cpp:3705] Handling HTTP event for process 'slave(712)'
with path: '/slave(712)/containers'
I0309 01:39:46.095374 30437 http.cpp:916] Authorizing principal 'test-principal' to GET the
'/containers' endpoint
I0309 01:39:46.097580 30439 slave.cpp:808] Agent terminating
[       OK ] Endpoint/SlaveEndpointTest.UnauthorizedRequest/2 (31 ms)
[ RUN      ] Endpoint/SlaveEndpointTest.NoAuthorizer/0
I0309 01:39:46.111788 30416 containerizer.cpp:221] Using isolation: posix/cpu,posix/mem,filesystem/posix,network/cni
W0309 01:39:46.112437 30416 backend.cpp:76] Failed to create 'aufs' backend: AufsBackend requires
root privileges
W0309 01:39:46.112603 30416 backend.cpp:76] Failed to create 'bind' backend: BindBackend requires
root privileges
I0309 01:39:46.112663 30416 provisioner.cpp:249] Using default backend 'copy'
I0309 01:39:46.114696 30416 cluster.cpp:446] Creating default 'local' authorizer
I0309 01:39:46.117580 30439 slave.cpp:215] Mesos agent started on (713)@172.17.0.2:37125
I0309 01:39:46.117605 30439 slave.cpp:216] Flags at startup: --acls="" --appc_simple_discovery_uri_prefix="http://"
--appc_store_dir="/tmp/mesos/store/appc" --authenticate_http_readonly="true" --authenticate_http_readwrite="true"
--authenticatee="crammd5" --authentication_backoff_factor="1secs" --authorizer="local" --cgroups_cpu_enable_pids_and_tids_count="false"
--cgroups_enable_cfs="false" --cgroups_hierarchy="/sys/fs/cgroup" --cgroups_limit_swap="false"
--cgroups_root="mesos" --container_disk_watch_interval="15secs" --containerizers="mesos" --credential="/tmp/Endpoint_SlaveEndpointTest_NoAuthorizer_0_jqzI4a/credential"
--default_role="*" --disk_watch_interval="1mins" --docker="docker" --docker_kill_orphans="true"
--docker_registry="https://registry-1.docker.io" --docker_remove_delay="6hrs" --docker_socket="/var/run/docker.sock"
--docker_stop_timeout="0ns" --docker_store_dir="/tmp/mesos/store/docker" --docker_volume_checkpoint_dir="/var/run/mesos/isolators/docker/volume"
--enforce_container_disk_quota="false" --executor_registration_timeout="1mins" --executor_shutdown_grace_period="5secs"
--fetcher_cache_dir="/tmp/Endpoint_SlaveEndpointTest_NoAuthorizer_0_jqzI4a/fetch" --fetcher_cache_size="2GB"
--frameworks_home="" --gc_delay="1weeks" --gc_disk_headroom="0.1" --hadoop_home="" --help="false"
--hostname_lookup="true" --http_authenticators="basic" --http_command_executor="false" --http_credentials="/tmp/Endpoint_SlaveEndpointTest_NoAuthorizer_0_jqzI4a/http_credentials"
--http_heartbeat_interval="30secs" --initialize_driver_logging="true" --isolation="posix/cpu,posix/mem"
--launcher="posix" --launcher_dir="/mesos/mesos-1.3.0/_build/src" --logbufsecs="0" --logging_level="INFO"
--max_completed_executors_per_framework="150" --oversubscribed_resources_interval="15secs"
--perf_duration="10secs" --perf_interval="1mins" --qos_correction_interval_min="0ns" --quiet="false"
--recover="reconnect" --recovery_timeout="15mins" --registration_backoff_factor="10ms" --resources="cpus:2;gpus:0;mem:1024;disk:1024;ports:[31000-32000]"
--revocable_cpu_low_priority="true" --runtime_dir="/tmp/Endpoint_SlaveEndpointTest_NoAuthorizer_0_jqzI4a"
--sandbox_directory="/mnt/mesos/sandbox" --strict="true" --switch_user="true" --systemd_enable_support="true"
--systemd_runtime_directory="/run/systemd/system" --version="false" --work_dir="/tmp/Endpoint_SlaveEndpointTest_NoAuthorizer_0_nVVBwH"
I0309 01:39:46.118265 30439 credentials.hpp:86] Loading credential for authentication from
'/tmp/Endpoint_SlaveEndpointTest_NoAuthorizer_0_jqzI4a/credential'
I0309 01:39:46.118453 30439 slave.cpp:358] Agent using credential for: test-principal
I0309 01:39:46.118474 30439 credentials.hpp:37] Loading credentials for authentication from
'/tmp/Endpoint_SlaveEndpointTest_NoAuthorizer_0_jqzI4a/http_credentials'
I0309 01:39:46.118705 30439 http.cpp:964] Using default 'basic' HTTP authenticator for realm
'mesos-agent-readonly'
I0309 01:39:46.118850 30439 http.cpp:964] Using default 'basic' HTTP authenticator for realm
'mesos-agent-readwrite'
I0309 01:39:46.120231 30439 slave.cpp:545] Agent resources: cpus(*):2; mem(*):1024; disk(*):1024;
ports(*):[31000-32000]
I0309 01:39:46.120314 30439 slave.cpp:553] Agent attributes: [  ]
I0309 01:39:46.120329 30439 slave.cpp:558] Agent hostname: 5c5c2be746af
I0309 01:39:46.120471 30438 status_update_manager.cpp:177] Pausing sending status updates
I0309 01:39:46.121867 30437 state.cpp:62] Recovering state from '/tmp/Endpoint_SlaveEndpointTest_NoAuthorizer_0_nVVBwH/meta'
I0309 01:39:46.122243 30448 status_update_manager.cpp:203] Recovering status update manager
I0309 01:39:46.122426 30435 containerizer.cpp:600] Recovering containerizer
I0309 01:39:46.123914 30444 provisioner.cpp:410] Provisioner recovery complete
I0309 01:39:46.124291 30445 slave.cpp:5572] Finished recovery
I0309 01:39:46.124953 30445 slave.cpp:5754] Querying resource estimator for oversubscribable
resources
I0309 01:39:46.125257 30436 slave.cpp:5768] Received oversubscribable resources {} from the
resource estimator
I0309 01:39:46.127785 30447 process.cpp:3705] Handling HTTP event for process 'slave(713)'
with path: '/slave(713)/monitor/statistics'
I0309 01:39:46.129369 30436 http.cpp:916] Authorizing principal 'test-principal' to GET the
'/monitor/statistics' endpoint
I0309 01:39:46.133746 30416 slave.cpp:808] Agent terminating
[       OK ] Endpoint/SlaveEndpointTest.NoAuthorizer/0 (35 ms)
[ RUN      ] Endpoint/SlaveEndpointTest.NoAuthorizer/1
I0309 01:39:46.145180 30416 containerizer.cpp:221] Using isolation: posix/cpu,posix/mem,filesystem/posix,network/cni
W0309 01:39:46.145848 30416 backend.cpp:76] Failed to create 'aufs' backend: AufsBackend requires
root privileges
W0309 01:39:46.145970 30416 backend.cpp:76] Failed to create 'bind' backend: BindBackend requires
root privileges
I0309 01:39:46.146018 30416 provisioner.cpp:249] Using default backend 'copy'
I0309 01:39:46.147495 30416 cluster.cpp:446] Creating default 'local' authorizer
I0309 01:39:46.149221 30441 slave.cpp:215] Mesos agent started on (714)@172.17.0.2:37125
I0309 01:39:46.149251 30441 slave.cpp:216] Flags at startup: --acls="" --appc_simple_discovery_uri_prefix="http://"
--appc_store_dir="/tmp/mesos/store/appc" --authenticate_http_readonly="true" --authenticate_http_readwrite="true"
--authenticatee="crammd5" --authentication_backoff_factor="1secs" --authorizer="local" --cgroups_cpu_enable_pids_and_tids_count="false"
--cgroups_enable_cfs="false" --cgroups_hierarchy="/sys/fs/cgroup" --cgroups_limit_swap="false"
--cgroups_root="mesos" --container_disk_watch_interval="15secs" --containerizers="mesos" --credential="/tmp/Endpoint_SlaveEndpointTest_NoAuthorizer_1_9pclA5/credential"
--default_role="*" --disk_watch_interval="1mins" --docker="docker" --docker_kill_orphans="true"
--docker_registry="https://registry-1.docker.io" --docker_remove_delay="6hrs" --docker_socket="/var/run/docker.sock"
--docker_stop_timeout="0ns" --docker_store_dir="/tmp/mesos/store/docker" --docker_volume_checkpoint_dir="/var/run/mesos/isolators/docker/volume"
--enforce_container_disk_quota="false" --executor_registration_timeout="1mins" --executor_shutdown_grace_period="5secs"
--fetcher_cache_dir="/tmp/Endpoint_SlaveEndpointTest_NoAuthorizer_1_9pclA5/fetch" --fetcher_cache_size="2GB"
--frameworks_home="" --gc_delay="1weeks" --gc_disk_headroom="0.1" --hadoop_home="" --help="false"
--hostname_lookup="true" --http_authenticators="basic" --http_command_executor="false" --http_credentials="/tmp/Endpoint_SlaveEndpointTest_NoAuthorizer_1_9pclA5/http_credentials"
--http_heartbeat_interval="30secs" --initialize_driver_logging="true" --isolation="posix/cpu,posix/mem"
--launcher="posix" --launcher_dir="/mesos/mesos-1.3.0/_build/src" --logbufsecs="0" --logging_level="INFO"
--max_completed_executors_per_framework="150" --oversubscribed_resources_interval="15secs"
--perf_duration="10secs" --perf_interval="1mins" --qos_correction_interval_min="0ns" --quiet="false"
--recover="reconnect" --recovery_timeout="15mins" --registration_backoff_factor="10ms" --resources="cpus:2;gpus:0;mem:1024;disk:1024;ports:[31000-32000]"
--revocable_cpu_low_priority="true" --runtime_dir="/tmp/Endpoint_SlaveEndpointTest_NoAuthorizer_1_9pclA5"
--sandbox_directory="/mnt/mesos/sandbox" --strict="true" --switch_user="true" --systemd_enable_support="true"
--systemd_runtime_directory="/run/systemd/system" --version="false" --work_dir="/tmp/Endpoint_SlaveEndpointTest_NoAuthorizer_1_lXjDWB"
I0309 01:39:46.149929 30441 credentials.hpp:86] Loading credential for authentication from
'/tmp/Endpoint_SlaveEndpointTest_NoAuthorizer_1_9pclA5/credential'
I0309 01:39:46.150136 30441 slave.cpp:358] Agent using credential for: test-principal
I0309 01:39:46.150167 30441 credentials.hpp:37] Loading credentials for authentication from
'/tmp/Endpoint_SlaveEndpointTest_NoAuthorizer_1_9pclA5/http_credentials'
I0309 01:39:46.150449 30441 http.cpp:964] Using default 'basic' HTTP authenticator for realm
'mesos-agent-readonly'
I0309 01:39:46.150620 30441 http.cpp:964] Using default 'basic' HTTP authenticator for realm
'mesos-agent-readwrite'
I0309 01:39:46.151990 30441 slave.cpp:545] Agent resources: cpus(*):2; mem(*):1024; disk(*):1024;
ports(*):[31000-32000]
I0309 01:39:46.152094 30441 slave.cpp:553] Agent attributes: [  ]
I0309 01:39:46.152110 30441 slave.cpp:558] Agent hostname: 5c5c2be746af
I0309 01:39:46.152266 30444 status_update_manager.cpp:177] Pausing sending status updates
I0309 01:39:46.153789 30439 state.cpp:62] Recovering state from '/tmp/Endpoint_SlaveEndpointTest_NoAuthorizer_1_lXjDWB/meta'
I0309 01:39:46.154187 30447 status_update_manager.cpp:203] Recovering status update manager
I0309 01:39:46.154418 30447 containerizer.cpp:600] Recovering containerizer
I0309 01:39:46.156119 30439 provisioner.cpp:410] Provisioner recovery complete
I0309 01:39:46.156744 30441 slave.cpp:5572] Finished recovery
I0309 01:39:46.157394 30441 slave.cpp:5754] Querying resource estimator for oversubscribable
resources
I0309 01:39:46.157788 30444 slave.cpp:5768] Received oversubscribable resources {} from the
resource estimator
I0309 01:39:46.161042 30436 process.cpp:3705] Handling HTTP event for process 'slave(714)'
with path: '/slave(714)/monitor/statistics.json'
I0309 01:39:46.162597 30445 http.cpp:916] Authorizing principal 'test-principal' to GET the
'/monitor/statistics.json' endpoint
I0309 01:39:46.166467 30416 slave.cpp:808] Agent terminating
[       OK ] Endpoint/SlaveEndpointTest.NoAuthorizer/1 (30 ms)
[ RUN      ] Endpoint/SlaveEndpointTest.NoAuthorizer/2
I0309 01:39:46.176806 30416 containerizer.cpp:221] Using isolation: posix/cpu,posix/mem,filesystem/posix,network/cni
W0309 01:39:46.177301 30416 backend.cpp:76] Failed to create 'aufs' backend: AufsBackend requires
root privileges
W0309 01:39:46.177397 30416 backend.cpp:76] Failed to create 'bind' backend: BindBackend requires
root privileges
I0309 01:39:46.177428 30416 provisioner.cpp:249] Using default backend 'copy'
I0309 01:39:46.179285 30416 cluster.cpp:446] Creating default 'local' authorizer
I0309 01:39:46.181020 30442 slave.cpp:215] Mesos agent started on (715)@172.17.0.2:37125
I0309 01:39:46.181041 30442 slave.cpp:216] Flags at startup: --acls="" --appc_simple_discovery_uri_prefix="http://"
--appc_store_dir="/tmp/mesos/store/appc" --authenticate_http_readonly="true" --authenticate_http_readwrite="true"
--authenticatee="crammd5" --authentication_backoff_factor="1secs" --authorizer="local" --cgroups_cpu_enable_pids_and_tids_count="false"
--cgroups_enable_cfs="false" --cgroups_hierarchy="/sys/fs/cgroup" --cgroups_limit_swap="false"
--cgroups_root="mesos" --container_disk_watch_interval="15secs" --containerizers="mesos" --credential="/tmp/Endpoint_SlaveEndpointTest_NoAuthorizer_2_NNdIq0/credential"
--default_role="*" --disk_watch_interval="1mins" --docker="docker" --docker_kill_orphans="true"
--docker_registry="https://registry-1.docker.io" --docker_remove_delay="6hrs" --docker_socket="/var/run/docker.sock"
--docker_stop_timeout="0ns" --docker_store_dir="/tmp/mesos/store/docker" --docker_volume_checkpoint_dir="/var/run/mesos/isolators/docker/volume"
--enforce_container_disk_quota="false" --executor_registration_timeout="1mins" --executor_shutdown_grace_period="5secs"
--fetcher_cache_dir="/tmp/Endpoint_SlaveEndpointTest_NoAuthorizer_2_NNdIq0/fetch" --fetcher_cache_size="2GB"
--frameworks_home="" --gc_delay="1weeks" --gc_disk_headroom="0.1" --hadoop_home="" --help="false"
--hostname_lookup="true" --http_authenticators="basic" --http_command_executor="false" --http_credentials="/tmp/Endpoint_SlaveEndpointTest_NoAuthorizer_2_NNdIq0/http_credentials"
--http_heartbeat_interval="30secs" --initialize_driver_logging="true" --isolation="posix/cpu,posix/mem"
--launcher="posix" --launcher_dir="/mesos/mesos-1.3.0/_build/src" --logbufsecs="0" --logging_level="INFO"
--max_completed_executors_per_framework="150" --oversubscribed_resources_interval="15secs"
--perf_duration="10secs" --perf_interval="1mins" --qos_correction_interval_min="0ns" --quiet="false"
--recover="reconnect" --recovery_timeout="15mins" --registration_backoff_factor="10ms" --resources="cpus:2;gpus:0;mem:1024;disk:1024;ports:[31000-32000]"
--revocable_cpu_low_priority="true" --runtime_dir="/tmp/Endpoint_SlaveEndpointTest_NoAuthorizer_2_NNdIq0"
--sandbox_directory="/mnt/mesos/sandbox" --strict="true" --switch_user="true" --systemd_enable_support="true"
--systemd_runtime_directory="/run/systemd/system" --version="false" --work_dir="/tmp/Endpoint_SlaveEndpointTest_NoAuthorizer_2_l3KPHw"
I0309 01:39:46.181879 30442 credentials.hpp:86] Loading credential for authentication from
'/tmp/Endpoint_SlaveEndpointTest_NoAuthorizer_2_NNdIq0/credential'
I0309 01:39:46.182068 30442 slave.cpp:358] Agent using credential for: test-principal
I0309 01:39:46.182093 30442 credentials.hpp:37] Loading credentials for authentication from
'/tmp/Endpoint_SlaveEndpointTest_NoAuthorizer_2_NNdIq0/http_credentials'
I0309 01:39:46.182364 30442 http.cpp:964] Using default 'basic' HTTP authenticator for realm
'mesos-agent-readonly'
I0309 01:39:46.182544 30442 http.cpp:964] Using default 'basic' HTTP authenticator for realm
'mesos-agent-readwrite'
I0309 01:39:46.183944 30442 slave.cpp:545] Agent resources: cpus(*):2; mem(*):1024; disk(*):1024;
ports(*):[31000-32000]
I0309 01:39:46.184021 30442 slave.cpp:553] Agent attributes: [  ]
I0309 01:39:46.184034 30442 slave.cpp:558] Agent hostname: 5c5c2be746af
I0309 01:39:46.184165 30440 status_update_manager.cpp:177] Pausing sending status updates
I0309 01:39:46.185855 30447 state.cpp:62] Recovering state from '/tmp/Endpoint_SlaveEndpointTest_NoAuthorizer_2_l3KPHw/meta'
I0309 01:39:46.186156 30450 status_update_manager.cpp:203] Recovering status update manager
I0309 01:39:46.186516 30444 containerizer.cpp:600] Recovering containerizer
I0309 01:39:46.188071 30448 provisioner.cpp:410] Provisioner recovery complete
I0309 01:39:46.188531 30450 slave.cpp:5572] Finished recovery
I0309 01:39:46.193744 30450 slave.cpp:5754] Querying resource estimator for oversubscribable
resources
I0309 01:39:46.194669 30450 slave.cpp:5768] Received oversubscribable resources {} from the
resource estimator
I0309 01:39:46.198330 30443 process.cpp:3705] Handling HTTP event for process 'slave(715)'
with path: '/slave(715)/containers'
I0309 01:39:46.200130 30443 http.cpp:916] Authorizing principal 'test-principal' to GET the
'/containers' endpoint
I0309 01:39:46.204416 30438 slave.cpp:808] Agent terminating
[       OK ] Endpoint/SlaveEndpointTest.NoAuthorizer/2 (40 ms)
[----------] 9 tests from Endpoint/SlaveEndpointTest (308 ms total)

[----------] Global test environment tear-down
[==========] 1516 tests from 169 test cases ran. (523578 ms total)
[  PASSED  ] 1514 tests.
[  FAILED  ] 2 tests, listed below:
[  FAILED  ] MasterSlaveReconciliationTest.SlaveReregisterPendingTask
[  FAILED  ] SlaveAuthorizerTest/1.FilterStateEndpoint, where TypeParam = mesos::internal::LocalAuthorizer

 2 FAILED TESTS
  YOU HAVE 12 DISABLED TESTS

make[4]: *** [check-local] Error 1
make[4]: Leaving directory `/mesos/mesos-1.3.0/_build/src'
make[3]: *** [check-am] Error 2
make[3]: Leaving directory `/mesos/mesos-1.3.0/_build/src'
make[2]: *** [check] Error 2
make[2]: Leaving directory `/mesos/mesos-1.3.0/_build/src'
make[1]: *** [check-recursive] Error 1
make[1]: Leaving directory `/mesos/mesos-1.3.0/_build'
make: *** [distcheck] Error 1
+ docker rmi mesos-1489020128-17455
Untagged: mesos-1489020128-17455:latest
Deleted: sha256:8ac9a89b2bb12215ffa76361df258f163cc9caec8763a8b4ab0dfd2ad8adb019
Deleted: sha256:3ea61665f090b7b8e9366be08dd8c5ffa829cce375e8ab680069284f1c379fe0
Deleted: sha256:a896020ae568881dee4acff9cbbd161736e261e5e2efd1dbb1a748861f12bb0a
Deleted: sha256:11481282498bc6d730bc70387fb9fd94f2daa4f25ac0a74374092d497885d828
Deleted: sha256:70a5f64c11597768c75acef5dde8f224c023e675e32577f86fbb896904347ae8
Deleted: sha256:5cb009d9c82f533f5084e4b774d8cf68edb610b5f12c35d2a425db5c1fc8895f
Deleted: sha256:bdc2a3abde8479be0f415d6c0b9dab1428a2512b60a1186878bbaeabcd5aa604
Deleted: sha256:29cc59955a0cd58a7bf936e75fcd176e40be94d1792b732e44a0e360ff8d2bee
Deleted: sha256:6c501f338215796a0faa98b5825bb068cb749601bb60636e65d821dba9d1c960
Deleted: sha256:c91dda54f1fe1d9eda98da9fbca442ada415f218a0c8ac31a44ac91dcf48d588
Deleted: sha256:852f21e34bf01faa8b3d9576c85e6d9a941e9d3a54061cbb446c70bc82e45579
Deleted: sha256:5c765fcad7274c476daf094db1e6e4586c97220718e8920020bf60b5fb168d57
Deleted: sha256:f0766a4a343167775e2fbd9d4e0a65a62c64e37a3491839fd47f7ac819cebd86
Deleted: sha256:38ab6d208af6c6674b84cd090e22fa325d6dbb398e21bc29d8109f3dc6663d44
Deleted: sha256:01227034b6e27e5a815941e7ee0cddbca4b1feeb219555c2e7215e8912813625
Deleted: sha256:d160aca4bd03e8b1dca7fa682ed77ae3de10d659041aab0323773ea8457cccb8
Deleted: sha256:28c017c04bfd7b01a2cb3b79c5715a1cc8d422279b3dea4b3379a1dccdf0b5fa
Deleted: sha256:af8e4770085e3e8c8a0fc2d9ad29f458b8d50fb12934baa0711b7fcf4d3d0ef1
Deleted: sha256:221638eeacc60d5bcb611e48ec7b2e0352457abe60d18cd8189707901464f588
Deleted: sha256:6205707bd3d8f9e76457c2140673693ef52872794bcc1606239b32456606eea1
Deleted: sha256:ffca9c9a32dbbd3dbefe7563477ab1e5256f3ac417893b4f902da216c7f52943
Deleted: sha256:eb532f728401fe3add053eec456e52b73bdd27160a7632a6654285997b6bacd0
Deleted: sha256:500239a9bc1e0a4135b981f528cc45e71480d3361afb1e28f13d7c9d78ea6105
Deleted: sha256:f884339a2f56c7cf1754808afb7c0112b7245689321c64b98026b56ccb40d775
Build step 'Execute shell' marked build as failure

Mime
View raw message