mesos-builds mailing list archives

Site index · List index
Message view « Date » · « Thread »
Top « Date » · « Thread »
From Apache Jenkins Server <jenk...@builds.apache.org>
Subject Build failed in Jenkins: Mesos-Buildbot » autotools,clang,--verbose --enable-libevent --enable-ssl,GLOG_v=1 MESOS_VERBOSE=1,ubuntu:14.04,(docker||Hadoop)&&(!ubuntu-us1)&&(!ubuntu-eu2) #3351
Date Thu, 09 Mar 2017 16:57:01 GMT
See <https://builds.apache.org/job/Mesos-Buildbot/BUILDTOOL=autotools,COMPILER=clang,CONFIGURATION=--verbose%20--enable-libevent%20--enable-ssl,ENVIRONMENT=GLOG_v=1%20MESOS_VERBOSE=1,OS=ubuntu%3A14.04,label_exp=(docker%7C%7CHadoop)&&(!ubuntu-us1)&&(!ubuntu-eu2)/3351/display/redirect?page=changes>

Changes:

[neil.conway] Fixed flaky test FaultToleranceTest.FrameworkReregister.

------------------------------------------
[...truncated 26.25 MB...]
I0309 16:55:54.228981 14011 slave.cpp:5572] Finished recovery
I0309 16:55:54.229419 14011 slave.cpp:5754] Querying resource estimator for oversubscribable
resources
I0309 16:55:54.229640 14013 slave.cpp:5768] Received oversubscribable resources {} from the
resource estimator
I0309 16:55:54.231205 14016 process.cpp:3705] Handling HTTP event for process 'slave(709)'
with path: '/slave(709)/monitor/statistics.json'
I0309 16:55:54.232259 14013 http.cpp:916] Authorizing principal 'test-principal' to GET the
'/monitor/statistics.json' endpoint
I0309 16:55:54.234848 14012 slave.cpp:808] Agent terminating
[       OK ] Endpoint/SlaveEndpointTest.AuthorizedRequest/1 (23 ms)
[ RUN      ] Endpoint/SlaveEndpointTest.AuthorizedRequest/2
I0309 16:55:54.242743 30890 containerizer.cpp:221] Using isolation: posix/cpu,posix/mem,filesystem/posix,network/cni
W0309 16:55:54.243283 30890 backend.cpp:76] Failed to create 'aufs' backend: AufsBackend requires
root privileges
W0309 16:55:54.243407 30890 backend.cpp:76] Failed to create 'bind' backend: BindBackend requires
root privileges
I0309 16:55:54.243456 30890 provisioner.cpp:249] Using default backend 'copy'
I0309 16:55:54.246048 14015 slave.cpp:215] Mesos agent started on (710)@172.17.0.3:44176
I0309 16:55:54.246098 14015 slave.cpp:216] Flags at startup: --acls="" --appc_simple_discovery_uri_prefix="http://"
--appc_store_dir="/tmp/mesos/store/appc" --authenticate_http_readonly="true" --authenticate_http_readwrite="true"
--authenticatee="crammd5" --authentication_backoff_factor="1secs" --authorizer="local" --cgroups_cpu_enable_pids_and_tids_count="false"
--cgroups_enable_cfs="false" --cgroups_hierarchy="/sys/fs/cgroup" --cgroups_limit_swap="false"
--cgroups_root="mesos" --container_disk_watch_interval="15secs" --containerizers="mesos" --credential="/tmp/Endpoint_SlaveEndpointTest_AuthorizedRequest_2_mK53jO/credential"
--default_role="*" --disk_watch_interval="1mins" --docker="docker" --docker_kill_orphans="true"
--docker_registry="https://registry-1.docker.io" --docker_remove_delay="6hrs" --docker_socket="/var/run/docker.sock"
--docker_stop_timeout="0ns" --docker_store_dir="/tmp/mesos/store/docker" --docker_volume_checkpoint_dir="/var/run/mesos/isolators/docker/volume"
--enforce_container_disk_quota="false" --executor_registration_timeout="1mins" --executor_shutdown_grace_period="5secs"
--fetcher_cache_dir="/tmp/Endpoint_SlaveEndpointTest_AuthorizedRequest_2_mK53jO/fetch" --fetcher_cache_size="2GB"
--frameworks_home="" --gc_delay="1weeks" --gc_disk_headroom="0.1" --hadoop_home="" --help="false"
--hostname_lookup="true" --http_authenticators="basic" --http_command_executor="false" --http_credentials="/tmp/Endpoint_SlaveEndpointTest_AuthorizedRequest_2_mK53jO/http_credentials"
--http_heartbeat_interval="30secs" --initialize_driver_logging="true" --isolation="posix/cpu,posix/mem"
--launcher="posix" --launcher_dir="/mesos/mesos-1.3.0/_build/src" --logbufsecs="0" --logging_level="INFO"
--max_completed_executors_per_framework="150" --oversubscribed_resources_interval="15secs"
--perf_duration="10secs" --perf_interval="1mins" --qos_correction_interval_min="0ns" --quiet="false"
--recover="reconnect" --recovery_timeout="15mins" --registration_backoff_factor="10ms" --resources="cpus:2;gpus:0;mem:1024;disk:1024;ports:[31000-32000]"
--revocable_cpu_low_priority="true" --runtime_dir="/tmp/Endpoint_SlaveEndpointTest_AuthorizedRequest_2_mK53jO"
--sandbox_directory="/mnt/mesos/sandbox" --strict="true" --switch_user="true" --systemd_enable_support="true"
--systemd_runtime_directory="/run/systemd/system" --version="false" --work_dir="/tmp/Endpoint_SlaveEndpointTest_AuthorizedRequest_2_A3k3Vj"
I0309 16:55:54.246583 14015 credentials.hpp:86] Loading credential for authentication from
'/tmp/Endpoint_SlaveEndpointTest_AuthorizedRequest_2_mK53jO/credential'
I0309 16:55:54.246708 14015 slave.cpp:358] Agent using credential for: test-principal
I0309 16:55:54.246732 14015 credentials.hpp:37] Loading credentials for authentication from
'/tmp/Endpoint_SlaveEndpointTest_AuthorizedRequest_2_mK53jO/http_credentials'
I0309 16:55:54.246927 14015 http.cpp:964] Using default 'basic' HTTP authenticator for realm
'mesos-agent-readonly'
I0309 16:55:54.247051 14015 http.cpp:964] Using default 'basic' HTTP authenticator for realm
'mesos-agent-readwrite'
I0309 16:55:54.248217 14015 slave.cpp:545] Agent resources: cpus(*):2; mem(*):1024; disk(*):1024;
ports(*):[31000-32000]
I0309 16:55:54.248292 14015 slave.cpp:553] Agent attributes: [  ]
I0309 16:55:54.248312 14015 slave.cpp:558] Agent hostname: 04d9a3250e3d
I0309 16:55:54.248435 14002 status_update_manager.cpp:177] Pausing sending status updates
I0309 16:55:54.249459 14005 state.cpp:62] Recovering state from '/tmp/Endpoint_SlaveEndpointTest_AuthorizedRequest_2_A3k3Vj/meta'
I0309 16:55:54.249733 14013 status_update_manager.cpp:203] Recovering status update manager
I0309 16:55:54.249889 14004 containerizer.cpp:600] Recovering containerizer
I0309 16:55:54.251040 14006 provisioner.cpp:410] Provisioner recovery complete
I0309 16:55:54.251394 14008 slave.cpp:5572] Finished recovery
I0309 16:55:54.251816 14008 slave.cpp:5754] Querying resource estimator for oversubscribable
resources
I0309 16:55:54.252014 14005 slave.cpp:5768] Received oversubscribable resources {} from the
resource estimator
I0309 16:55:54.253551 14014 process.cpp:3705] Handling HTTP event for process 'slave(710)'
with path: '/slave(710)/containers'
I0309 16:55:54.254781 14003 http.cpp:916] Authorizing principal 'test-principal' to GET the
'/containers' endpoint
I0309 16:55:54.257858 14003 slave.cpp:808] Agent terminating
[       OK ] Endpoint/SlaveEndpointTest.AuthorizedRequest/2 (22 ms)
[ RUN      ] Endpoint/SlaveEndpointTest.UnauthorizedRequest/0
I0309 16:55:54.265923 30890 containerizer.cpp:221] Using isolation: posix/cpu,posix/mem,filesystem/posix,network/cni
W0309 16:55:54.266324 30890 backend.cpp:76] Failed to create 'aufs' backend: AufsBackend requires
root privileges
W0309 16:55:54.266427 30890 backend.cpp:76] Failed to create 'bind' backend: BindBackend requires
root privileges
I0309 16:55:54.266466 30890 provisioner.cpp:249] Using default backend 'copy'
I0309 16:55:54.268880 14003 slave.cpp:215] Mesos agent started on (711)@172.17.0.3:44176
I0309 16:55:54.268928 14003 slave.cpp:216] Flags at startup: --acls="" --appc_simple_discovery_uri_prefix="http://"
--appc_store_dir="/tmp/mesos/store/appc" --authenticate_http_readonly="true" --authenticate_http_readwrite="true"
--authenticatee="crammd5" --authentication_backoff_factor="1secs" --authorizer="local" --cgroups_cpu_enable_pids_and_tids_count="false"
--cgroups_enable_cfs="false" --cgroups_hierarchy="/sys/fs/cgroup" --cgroups_limit_swap="false"
--cgroups_root="mesos" --container_disk_watch_interval="15secs" --containerizers="mesos" --credential="/tmp/Endpoint_SlaveEndpointTest_UnauthorizedRequest_0_GnaV4L/credential"
--default_role="*" --disk_watch_interval="1mins" --docker="docker" --docker_kill_orphans="true"
--docker_registry="https://registry-1.docker.io" --docker_remove_delay="6hrs" --docker_socket="/var/run/docker.sock"
--docker_stop_timeout="0ns" --docker_store_dir="/tmp/mesos/store/docker" --docker_volume_checkpoint_dir="/var/run/mesos/isolators/docker/volume"
--enforce_container_disk_quota="false" --executor_registration_timeout="1mins" --executor_shutdown_grace_period="5secs"
--fetcher_cache_dir="/tmp/Endpoint_SlaveEndpointTest_UnauthorizedRequest_0_GnaV4L/fetch" --fetcher_cache_size="2GB"
--frameworks_home="" --gc_delay="1weeks" --gc_disk_headroom="0.1" --hadoop_home="" --help="false"
--hostname_lookup="true" --http_authenticators="basic" --http_command_executor="false" --http_credentials="/tmp/Endpoint_SlaveEndpointTest_UnauthorizedRequest_0_GnaV4L/http_credentials"
--http_heartbeat_interval="30secs" --initialize_driver_logging="true" --isolation="posix/cpu,posix/mem"
--launcher="posix" --launcher_dir="/mesos/mesos-1.3.0/_build/src" --logbufsecs="0" --logging_level="INFO"
--max_completed_executors_per_framework="150" --oversubscribed_resources_interval="15secs"
--perf_duration="10secs" --perf_interval="1mins" --qos_correction_interval_min="0ns" --quiet="false"
--recover="reconnect" --recovery_timeout="15mins" --registration_backoff_factor="10ms" --resources="cpus:2;gpus:0;mem:1024;disk:1024;ports:[31000-32000]"
--revocable_cpu_low_priority="true" --runtime_dir="/tmp/Endpoint_SlaveEndpointTest_UnauthorizedRequest_0_GnaV4L"
--sandbox_directory="/mnt/mesos/sandbox" --strict="true" --switch_user="true" --systemd_enable_support="true"
--systemd_runtime_directory="/run/systemd/system" --version="false" --work_dir="/tmp/Endpoint_SlaveEndpointTest_UnauthorizedRequest_0_GEQ8Ch"
I0309 16:55:54.269397 14003 credentials.hpp:86] Loading credential for authentication from
'/tmp/Endpoint_SlaveEndpointTest_UnauthorizedRequest_0_GnaV4L/credential'
I0309 16:55:54.269541 14003 slave.cpp:358] Agent using credential for: test-principal
I0309 16:55:54.269562 14003 credentials.hpp:37] Loading credentials for authentication from
'/tmp/Endpoint_SlaveEndpointTest_UnauthorizedRequest_0_GnaV4L/http_credentials'
I0309 16:55:54.269758 14003 http.cpp:964] Using default 'basic' HTTP authenticator for realm
'mesos-agent-readonly'
I0309 16:55:54.269886 14003 http.cpp:964] Using default 'basic' HTTP authenticator for realm
'mesos-agent-readwrite'
I0309 16:55:54.271021 14003 slave.cpp:545] Agent resources: cpus(*):2; mem(*):1024; disk(*):1024;
ports(*):[31000-32000]
I0309 16:55:54.271093 14003 slave.cpp:553] Agent attributes: [  ]
I0309 16:55:54.271106 14003 slave.cpp:558] Agent hostname: 04d9a3250e3d
I0309 16:55:54.271217 14015 status_update_manager.cpp:177] Pausing sending status updates
I0309 16:55:54.272394 14001 state.cpp:62] Recovering state from '/tmp/Endpoint_SlaveEndpointTest_UnauthorizedRequest_0_GEQ8Ch/meta'
I0309 16:55:54.272707 14008 status_update_manager.cpp:203] Recovering status update manager
I0309 16:55:54.272918 14007 containerizer.cpp:600] Recovering containerizer
I0309 16:55:54.274094 14005 provisioner.cpp:410] Provisioner recovery complete
I0309 16:55:54.274477 14012 slave.cpp:5572] Finished recovery
I0309 16:55:54.274966 14012 slave.cpp:5754] Querying resource estimator for oversubscribable
resources
I0309 16:55:54.275189 14010 slave.cpp:5768] Received oversubscribable resources {} from the
resource estimator
I0309 16:55:54.276684 14009 process.cpp:3705] Handling HTTP event for process 'slave(711)'
with path: '/slave(711)/monitor/statistics'
I0309 16:55:54.277652 14013 http.cpp:916] Authorizing principal 'test-principal' to GET the
'/monitor/statistics' endpoint
I0309 16:55:54.279506 14016 slave.cpp:808] Agent terminating
[       OK ] Endpoint/SlaveEndpointTest.UnauthorizedRequest/0 (20 ms)
[ RUN      ] Endpoint/SlaveEndpointTest.UnauthorizedRequest/1
I0309 16:55:54.287325 30890 containerizer.cpp:221] Using isolation: posix/cpu,posix/mem,filesystem/posix,network/cni
W0309 16:55:54.287874 30890 backend.cpp:76] Failed to create 'aufs' backend: AufsBackend requires
root privileges
W0309 16:55:54.288004 30890 backend.cpp:76] Failed to create 'bind' backend: BindBackend requires
root privileges
I0309 16:55:54.288055 30890 provisioner.cpp:249] Using default backend 'copy'
I0309 16:55:54.291014 14011 slave.cpp:215] Mesos agent started on (712)@172.17.0.3:44176
I0309 16:55:54.291062 14011 slave.cpp:216] Flags at startup: --acls="" --appc_simple_discovery_uri_prefix="http://"
--appc_store_dir="/tmp/mesos/store/appc" --authenticate_http_readonly="true" --authenticate_http_readwrite="true"
--authenticatee="crammd5" --authentication_backoff_factor="1secs" --authorizer="local" --cgroups_cpu_enable_pids_and_tids_count="false"
--cgroups_enable_cfs="false" --cgroups_hierarchy="/sys/fs/cgroup" --cgroups_limit_swap="false"
--cgroups_root="mesos" --container_disk_watch_interval="15secs" --containerizers="mesos" --credential="/tmp/Endpoint_SlaveEndpointTest_UnauthorizedRequest_1_IvMJ3J/credential"
--default_role="*" --disk_watch_interval="1mins" --docker="docker" --docker_kill_orphans="true"
--docker_registry="https://registry-1.docker.io" --docker_remove_delay="6hrs" --docker_socket="/var/run/docker.sock"
--docker_stop_timeout="0ns" --docker_store_dir="/tmp/mesos/store/docker" --docker_volume_checkpoint_dir="/var/run/mesos/isolators/docker/volume"
--enforce_container_disk_quota="false" --executor_registration_timeout="1mins" --executor_shutdown_grace_period="5secs"
--fetcher_cache_dir="/tmp/Endpoint_SlaveEndpointTest_UnauthorizedRequest_1_IvMJ3J/fetch" --fetcher_cache_size="2GB"
--frameworks_home="" --gc_delay="1weeks" --gc_disk_headroom="0.1" --hadoop_home="" --help="false"
--hostname_lookup="true" --http_authenticators="basic" --http_command_executor="false" --http_credentials="/tmp/Endpoint_SlaveEndpointTest_UnauthorizedRequest_1_IvMJ3J/http_credentials"
--http_heartbeat_interval="30secs" --initialize_driver_logging="true" --isolation="posix/cpu,posix/mem"
--launcher="posix" --launcher_dir="/mesos/mesos-1.3.0/_build/src" --logbufsecs="0" --logging_level="INFO"
--max_completed_executors_per_framework="150" --oversubscribed_resources_interval="15secs"
--perf_duration="10secs" --perf_interval="1mins" --qos_correction_interval_min="0ns" --quiet="false"
--recover="reconnect" --recovery_timeout="15mins" --registration_backoff_factor="10ms" --resources="cpus:2;gpus:0;mem:1024;disk:1024;ports:[31000-32000]"
--revocable_cpu_low_priority="true" --runtime_dir="/tmp/Endpoint_SlaveEndpointTest_UnauthorizedRequest_1_IvMJ3J"
--sandbox_directory="/mnt/mesos/sandbox" --strict="true" --switch_user="true" --systemd_enable_support="true"
--systemd_runtime_directory="/run/systemd/system" --version="false" --work_dir="/tmp/Endpoint_SlaveEndpointTest_UnauthorizedRequest_1_Ccwyyf"
I0309 16:55:54.291889 14011 credentials.hpp:86] Loading credential for authentication from
'/tmp/Endpoint_SlaveEndpointTest_UnauthorizedRequest_1_IvMJ3J/credential'
I0309 16:55:54.292095 14011 slave.cpp:358] Agent using credential for: test-principal
I0309 16:55:54.292122 14011 credentials.hpp:37] Loading credentials for authentication from
'/tmp/Endpoint_SlaveEndpointTest_UnauthorizedRequest_1_IvMJ3J/http_credentials'
I0309 16:55:54.292383 14011 http.cpp:964] Using default 'basic' HTTP authenticator for realm
'mesos-agent-readonly'
I0309 16:55:54.292503 14011 http.cpp:964] Using default 'basic' HTTP authenticator for realm
'mesos-agent-readwrite'
I0309 16:55:54.294275 14011 slave.cpp:545] Agent resources: cpus(*):2; mem(*):1024; disk(*):1024;
ports(*):[31000-32000]
I0309 16:55:54.294390 14011 slave.cpp:553] Agent attributes: [  ]
I0309 16:55:54.294409 14011 slave.cpp:558] Agent hostname: 04d9a3250e3d
I0309 16:55:54.294584 14015 status_update_manager.cpp:177] Pausing sending status updates
I0309 16:55:54.296234 14016 state.cpp:62] Recovering state from '/tmp/Endpoint_SlaveEndpointTest_UnauthorizedRequest_1_Ccwyyf/meta'
I0309 16:55:54.296516 14014 status_update_manager.cpp:203] Recovering status update manager
I0309 16:55:54.296849 14005 containerizer.cpp:600] Recovering containerizer
I0309 16:55:54.298552 14015 provisioner.cpp:410] Provisioner recovery complete
I0309 16:55:54.299062 14014 slave.cpp:5572] Finished recovery
I0309 16:55:54.299836 14014 slave.cpp:5754] Querying resource estimator for oversubscribable
resources
I0309 16:55:54.300178 14005 slave.cpp:5768] Received oversubscribable resources {} from the
resource estimator
I0309 16:55:54.302683 14008 process.cpp:3705] Handling HTTP event for process 'slave(712)'
with path: '/slave(712)/monitor/statistics.json'
I0309 16:55:54.304039 14002 http.cpp:916] Authorizing principal 'test-principal' to GET the
'/monitor/statistics.json' endpoint
I0309 16:55:54.306705 14014 slave.cpp:808] Agent terminating
[       OK ] Endpoint/SlaveEndpointTest.UnauthorizedRequest/1 (30 ms)
[ RUN      ] Endpoint/SlaveEndpointTest.UnauthorizedRequest/2
I0309 16:55:54.319664 30890 containerizer.cpp:221] Using isolation: posix/cpu,posix/mem,filesystem/posix,network/cni
W0309 16:55:54.320147 30890 backend.cpp:76] Failed to create 'aufs' backend: AufsBackend requires
root privileges
W0309 16:55:54.320264 30890 backend.cpp:76] Failed to create 'bind' backend: BindBackend requires
root privileges
I0309 16:55:54.320333 30890 provisioner.cpp:249] Using default backend 'copy'
I0309 16:55:54.323271 14004 slave.cpp:215] Mesos agent started on (713)@172.17.0.3:44176
I0309 16:55:54.323374 14004 slave.cpp:216] Flags at startup: --acls="" --appc_simple_discovery_uri_prefix="http://"
--appc_store_dir="/tmp/mesos/store/appc" --authenticate_http_readonly="true" --authenticate_http_readwrite="true"
--authenticatee="crammd5" --authentication_backoff_factor="1secs" --authorizer="local" --cgroups_cpu_enable_pids_and_tids_count="false"
--cgroups_enable_cfs="false" --cgroups_hierarchy="/sys/fs/cgroup" --cgroups_limit_swap="false"
--cgroups_root="mesos" --container_disk_watch_interval="15secs" --containerizers="mesos" --credential="/tmp/Endpoint_SlaveEndpointTest_UnauthorizedRequest_2_sJudmI/credential"
--default_role="*" --disk_watch_interval="1mins" --docker="docker" --docker_kill_orphans="true"
--docker_registry="https://registry-1.docker.io" --docker_remove_delay="6hrs" --docker_socket="/var/run/docker.sock"
--docker_stop_timeout="0ns" --docker_store_dir="/tmp/mesos/store/docker" --docker_volume_checkpoint_dir="/var/run/mesos/isolators/docker/volume"
--enforce_container_disk_quota="false" --executor_registration_timeout="1mins" --executor_shutdown_grace_period="5secs"
--fetcher_cache_dir="/tmp/Endpoint_SlaveEndpointTest_UnauthorizedRequest_2_sJudmI/fetch" --fetcher_cache_size="2GB"
--frameworks_home="" --gc_delay="1weeks" --gc_disk_headroom="0.1" --hadoop_home="" --help="false"
--hostname_lookup="true" --http_authenticators="basic" --http_command_executor="false" --http_credentials="/tmp/Endpoint_SlaveEndpointTest_UnauthorizedRequest_2_sJudmI/http_credentials"
--http_heartbeat_interval="30secs" --initialize_driver_logging="true" --isolation="posix/cpu,posix/mem"
--launcher="posix" --launcher_dir="/mesos/mesos-1.3.0/_build/src" --logbufsecs="0" --logging_level="INFO"
--max_completed_executors_per_framework="150" --oversubscribed_resources_interval="15secs"
--perf_duration="10secs" --perf_interval="1mins" --qos_correction_interval_min="0ns" --quiet="false"
--recover="reconnect" --recovery_timeout="15mins" --registration_backoff_factor="10ms" --resources="cpus:2;gpus:0;mem:1024;disk:1024;ports:[31000-32000]"
--revocable_cpu_low_priority="true" --runtime_dir="/tmp/Endpoint_SlaveEndpointTest_UnauthorizedRequest_2_sJudmI"
--sandbox_directory="/mnt/mesos/sandbox" --strict="true" --switch_user="true" --systemd_enable_support="true"
--systemd_runtime_directory="/run/systemd/system" --version="false" --work_dir="/tmp/Endpoint_SlaveEndpointTest_UnauthorizedRequest_2_ObPLLd"
I0309 16:55:54.323915 14004 credentials.hpp:86] Loading credential for authentication from
'/tmp/Endpoint_SlaveEndpointTest_UnauthorizedRequest_2_sJudmI/credential'
I0309 16:55:54.324087 14004 slave.cpp:358] Agent using credential for: test-principal
I0309 16:55:54.324112 14004 credentials.hpp:37] Loading credentials for authentication from
'/tmp/Endpoint_SlaveEndpointTest_UnauthorizedRequest_2_sJudmI/http_credentials'
I0309 16:55:54.324335 14004 http.cpp:964] Using default 'basic' HTTP authenticator for realm
'mesos-agent-readonly'
I0309 16:55:54.324470 14004 http.cpp:964] Using default 'basic' HTTP authenticator for realm
'mesos-agent-readwrite'
I0309 16:55:54.325721 14004 slave.cpp:545] Agent resources: cpus(*):2; mem(*):1024; disk(*):1024;
ports(*):[31000-32000]
I0309 16:55:54.325809 14004 slave.cpp:553] Agent attributes: [  ]
I0309 16:55:54.325831 14004 slave.cpp:558] Agent hostname: 04d9a3250e3d
I0309 16:55:54.325971 14007 status_update_manager.cpp:177] Pausing sending status updates
I0309 16:55:54.327431 14003 state.cpp:62] Recovering state from '/tmp/Endpoint_SlaveEndpointTest_UnauthorizedRequest_2_ObPLLd/meta'
I0309 16:55:54.327787 14008 status_update_manager.cpp:203] Recovering status update manager
I0309 16:55:54.328066 14007 containerizer.cpp:600] Recovering containerizer
I0309 16:55:54.329319 14003 provisioner.cpp:410] Provisioner recovery complete
I0309 16:55:54.329656 14008 slave.cpp:5572] Finished recovery
I0309 16:55:54.330194 14008 slave.cpp:5754] Querying resource estimator for oversubscribable
resources
I0309 16:55:54.330472 14013 slave.cpp:5768] Received oversubscribable resources {} from the
resource estimator
I0309 16:55:54.332648 14006 process.cpp:3705] Handling HTTP event for process 'slave(713)'
with path: '/slave(713)/containers'
I0309 16:55:54.334028 14005 http.cpp:916] Authorizing principal 'test-principal' to GET the
'/containers' endpoint
I0309 16:55:54.336627 14012 slave.cpp:808] Agent terminating
[       OK ] Endpoint/SlaveEndpointTest.UnauthorizedRequest/2 (28 ms)
[ RUN      ] Endpoint/SlaveEndpointTest.NoAuthorizer/0
I0309 16:55:54.348650 30890 containerizer.cpp:221] Using isolation: posix/cpu,posix/mem,filesystem/posix,network/cni
W0309 16:55:54.349197 30890 backend.cpp:76] Failed to create 'aufs' backend: AufsBackend requires
root privileges
W0309 16:55:54.349313 30890 backend.cpp:76] Failed to create 'bind' backend: BindBackend requires
root privileges
I0309 16:55:54.349354 30890 provisioner.cpp:249] Using default backend 'copy'
I0309 16:55:54.351254 30890 cluster.cpp:446] Creating default 'local' authorizer
I0309 16:55:54.353540 14014 slave.cpp:215] Mesos agent started on (714)@172.17.0.3:44176
I0309 16:55:54.353597 14014 slave.cpp:216] Flags at startup: --acls="" --appc_simple_discovery_uri_prefix="http://"
--appc_store_dir="/tmp/mesos/store/appc" --authenticate_http_readonly="true" --authenticate_http_readwrite="true"
--authenticatee="crammd5" --authentication_backoff_factor="1secs" --authorizer="local" --cgroups_cpu_enable_pids_and_tids_count="false"
--cgroups_enable_cfs="false" --cgroups_hierarchy="/sys/fs/cgroup" --cgroups_limit_swap="false"
--cgroups_root="mesos" --container_disk_watch_interval="15secs" --containerizers="mesos" --credential="/tmp/Endpoint_SlaveEndpointTest_NoAuthorizer_0_Kc1pXG/credential"
--default_role="*" --disk_watch_interval="1mins" --docker="docker" --docker_kill_orphans="true"
--docker_registry="https://registry-1.docker.io" --docker_remove_delay="6hrs" --docker_socket="/var/run/docker.sock"
--docker_stop_timeout="0ns" --docker_store_dir="/tmp/mesos/store/docker" --docker_volume_checkpoint_dir="/var/run/mesos/isolators/docker/volume"
--enforce_container_disk_quota="false" --executor_registration_timeout="1mins" --executor_shutdown_grace_period="5secs"
--fetcher_cache_dir="/tmp/Endpoint_SlaveEndpointTest_NoAuthorizer_0_Kc1pXG/fetch" --fetcher_cache_size="2GB"
--frameworks_home="" --gc_delay="1weeks" --gc_disk_headroom="0.1" --hadoop_home="" --help="false"
--hostname_lookup="true" --http_authenticators="basic" --http_command_executor="false" --http_credentials="/tmp/Endpoint_SlaveEndpointTest_NoAuthorizer_0_Kc1pXG/http_credentials"
--http_heartbeat_interval="30secs" --initialize_driver_logging="true" --isolation="posix/cpu,posix/mem"
--launcher="posix" --launcher_dir="/mesos/mesos-1.3.0/_build/src" --logbufsecs="0" --logging_level="INFO"
--max_completed_executors_per_framework="150" --oversubscribed_resources_interval="15secs"
--perf_duration="10secs" --perf_interval="1mins" --qos_correction_interval_min="0ns" --quiet="false"
--recover="reconnect" --recovery_timeout="15mins" --registration_backoff_factor="10ms" --resources="cpus:2;gpus:0;mem:1024;disk:1024;ports:[31000-32000]"
--revocable_cpu_low_priority="true" --runtime_dir="/tmp/Endpoint_SlaveEndpointTest_NoAuthorizer_0_Kc1pXG"
--sandbox_directory="/mnt/mesos/sandbox" --strict="true" --switch_user="true" --systemd_enable_support="true"
--systemd_runtime_directory="/run/systemd/system" --version="false" --work_dir="/tmp/Endpoint_SlaveEndpointTest_NoAuthorizer_0_Wnvoic"
I0309 16:55:54.354243 14014 credentials.hpp:86] Loading credential for authentication from
'/tmp/Endpoint_SlaveEndpointTest_NoAuthorizer_0_Kc1pXG/credential'
I0309 16:55:54.354449 14014 slave.cpp:358] Agent using credential for: test-principal
I0309 16:55:54.354477 14014 credentials.hpp:37] Loading credentials for authentication from
'/tmp/Endpoint_SlaveEndpointTest_NoAuthorizer_0_Kc1pXG/http_credentials'
I0309 16:55:54.354764 14014 http.cpp:964] Using default 'basic' HTTP authenticator for realm
'mesos-agent-readonly'
I0309 16:55:54.355115 14014 http.cpp:964] Using default 'basic' HTTP authenticator for realm
'mesos-agent-readwrite'
I0309 16:55:54.356658 14014 slave.cpp:545] Agent resources: cpus(*):2; mem(*):1024; disk(*):1024;
ports(*):[31000-32000]
I0309 16:55:54.356761 14014 slave.cpp:553] Agent attributes: [  ]
I0309 16:55:54.356778 14014 slave.cpp:558] Agent hostname: 04d9a3250e3d
I0309 16:55:54.356941 14008 status_update_manager.cpp:177] Pausing sending status updates
I0309 16:55:54.358366 14011 state.cpp:62] Recovering state from '/tmp/Endpoint_SlaveEndpointTest_NoAuthorizer_0_Wnvoic/meta'
I0309 16:55:54.358680 14004 status_update_manager.cpp:203] Recovering status update manager
I0309 16:55:54.358904 14011 containerizer.cpp:600] Recovering containerizer
I0309 16:55:54.360538 14003 provisioner.cpp:410] Provisioner recovery complete
I0309 16:55:54.361017 14001 slave.cpp:5572] Finished recovery
I0309 16:55:54.361588 14001 slave.cpp:5754] Querying resource estimator for oversubscribable
resources
I0309 16:55:54.361853 14013 slave.cpp:5768] Received oversubscribable resources {} from the
resource estimator
I0309 16:55:54.363837 14012 process.cpp:3705] Handling HTTP event for process 'slave(714)'
with path: '/slave(714)/monitor/statistics'
I0309 16:55:54.365409 14014 http.cpp:916] Authorizing principal 'test-principal' to GET the
'/monitor/statistics' endpoint
I0309 16:55:54.369397 14003 slave.cpp:808] Agent terminating
[       OK ] Endpoint/SlaveEndpointTest.NoAuthorizer/0 (32 ms)
[ RUN      ] Endpoint/SlaveEndpointTest.NoAuthorizer/1
I0309 16:55:54.381474 30890 containerizer.cpp:221] Using isolation: posix/cpu,posix/mem,filesystem/posix,network/cni
W0309 16:55:54.382016 30890 backend.cpp:76] Failed to create 'aufs' backend: AufsBackend requires
root privileges
W0309 16:55:54.382133 30890 backend.cpp:76] Failed to create 'bind' backend: BindBackend requires
root privileges
I0309 16:55:54.382174 30890 provisioner.cpp:249] Using default backend 'copy'
I0309 16:55:54.383970 30890 cluster.cpp:446] Creating default 'local' authorizer
I0309 16:55:54.385851 14012 slave.cpp:215] Mesos agent started on (715)@172.17.0.3:44176
I0309 16:55:54.385907 14012 slave.cpp:216] Flags at startup: --acls="" --appc_simple_discovery_uri_prefix="http://"
--appc_store_dir="/tmp/mesos/store/appc" --authenticate_http_readonly="true" --authenticate_http_readwrite="true"
--authenticatee="crammd5" --authentication_backoff_factor="1secs" --authorizer="local" --cgroups_cpu_enable_pids_and_tids_count="false"
--cgroups_enable_cfs="false" --cgroups_hierarchy="/sys/fs/cgroup" --cgroups_limit_swap="false"
--cgroups_root="mesos" --container_disk_watch_interval="15secs" --containerizers="mesos" --credential="/tmp/Endpoint_SlaveEndpointTest_NoAuthorizer_1_2hEPTF/credential"
--default_role="*" --disk_watch_interval="1mins" --docker="docker" --docker_kill_orphans="true"
--docker_registry="https://registry-1.docker.io" --docker_remove_delay="6hrs" --docker_socket="/var/run/docker.sock"
--docker_stop_timeout="0ns" --docker_store_dir="/tmp/mesos/store/docker" --docker_volume_checkpoint_dir="/var/run/mesos/isolators/docker/volume"
--enforce_container_disk_quota="false" --executor_registration_timeout="1mins" --executor_shutdown_grace_period="5secs"
--fetcher_cache_dir="/tmp/Endpoint_SlaveEndpointTest_NoAuthorizer_1_2hEPTF/fetch" --fetcher_cache_size="2GB"
--frameworks_home="" --gc_delay="1weeks" --gc_disk_headroom="0.1" --hadoop_home="" --help="false"
--hostname_lookup="true" --http_authenticators="basic" --http_command_executor="false" --http_credentials="/tmp/Endpoint_SlaveEndpointTest_NoAuthorizer_1_2hEPTF/http_credentials"
--http_heartbeat_interval="30secs" --initialize_driver_logging="true" --isolation="posix/cpu,posix/mem"
--launcher="posix" --launcher_dir="/mesos/mesos-1.3.0/_build/src" --logbufsecs="0" --logging_level="INFO"
--max_completed_executors_per_framework="150" --oversubscribed_resources_interval="15secs"
--perf_duration="10secs" --perf_interval="1mins" --qos_correction_interval_min="0ns" --quiet="false"
--recover="reconnect" --recovery_timeout="15mins" --registration_backoff_factor="10ms" --resources="cpus:2;gpus:0;mem:1024;disk:1024;ports:[31000-32000]"
--revocable_cpu_low_priority="true" --runtime_dir="/tmp/Endpoint_SlaveEndpointTest_NoAuthorizer_1_2hEPTF"
--sandbox_directory="/mnt/mesos/sandbox" --strict="true" --switch_user="true" --systemd_enable_support="true"
--systemd_runtime_directory="/run/systemd/system" --version="false" --work_dir="/tmp/Endpoint_SlaveEndpointTest_NoAuthorizer_1_sMzr9a"
I0309 16:55:54.386642 14012 credentials.hpp:86] Loading credential for authentication from
'/tmp/Endpoint_SlaveEndpointTest_NoAuthorizer_1_2hEPTF/credential'
I0309 16:55:54.386837 14012 slave.cpp:358] Agent using credential for: test-principal
I0309 16:55:54.386867 14012 credentials.hpp:37] Loading credentials for authentication from
'/tmp/Endpoint_SlaveEndpointTest_NoAuthorizer_1_2hEPTF/http_credentials'
I0309 16:55:54.387140 14012 http.cpp:964] Using default 'basic' HTTP authenticator for realm
'mesos-agent-readonly'
I0309 16:55:54.387308 14012 http.cpp:964] Using default 'basic' HTTP authenticator for realm
'mesos-agent-readwrite'
I0309 16:55:54.388942 14012 slave.cpp:545] Agent resources: cpus(*):2; mem(*):1024; disk(*):1024;
ports(*):[31000-32000]
I0309 16:55:54.389045 14012 slave.cpp:553] Agent attributes: [  ]
I0309 16:55:54.389061 14012 slave.cpp:558] Agent hostname: 04d9a3250e3d
I0309 16:55:54.389221 14004 status_update_manager.cpp:177] Pausing sending status updates
I0309 16:55:54.390677 14006 state.cpp:62] Recovering state from '/tmp/Endpoint_SlaveEndpointTest_NoAuthorizer_1_sMzr9a/meta'
I0309 16:55:54.390945 14008 status_update_manager.cpp:203] Recovering status update manager
I0309 16:55:54.391212 14007 containerizer.cpp:600] Recovering containerizer
I0309 16:55:54.392808 14013 provisioner.cpp:410] Provisioner recovery complete
I0309 16:55:54.393296 14010 slave.cpp:5572] Finished recovery
I0309 16:55:54.393859 14010 slave.cpp:5754] Querying resource estimator for oversubscribable
resources
I0309 16:55:54.394155 14010 slave.cpp:5768] Received oversubscribable resources {} from the
resource estimator
I0309 16:55:54.396170 14006 process.cpp:3705] Handling HTTP event for process 'slave(715)'
with path: '/slave(715)/monitor/statistics.json'
I0309 16:55:54.397449 14013 http.cpp:916] Authorizing principal 'test-principal' to GET the
'/monitor/statistics.json' endpoint
I0309 16:55:54.400810 14006 slave.cpp:808] Agent terminating
[       OK ] Endpoint/SlaveEndpointTest.NoAuthorizer/1 (30 ms)
[ RUN      ] Endpoint/SlaveEndpointTest.NoAuthorizer/2
I0309 16:55:54.412035 30890 containerizer.cpp:221] Using isolation: posix/cpu,posix/mem,filesystem/posix,network/cni
W0309 16:55:54.412449 30890 backend.cpp:76] Failed to create 'aufs' backend: AufsBackend requires
root privileges
W0309 16:55:54.412538 30890 backend.cpp:76] Failed to create 'bind' backend: BindBackend requires
root privileges
I0309 16:55:54.412567 30890 provisioner.cpp:249] Using default backend 'copy'
I0309 16:55:54.413859 30890 cluster.cpp:446] Creating default 'local' authorizer
I0309 16:55:54.415221 14001 slave.cpp:215] Mesos agent started on (716)@172.17.0.3:44176
I0309 16:55:54.415262 14001 slave.cpp:216] Flags at startup: --acls="" --appc_simple_discovery_uri_prefix="http://"
--appc_store_dir="/tmp/mesos/store/appc" --authenticate_http_readonly="true" --authenticate_http_readwrite="true"
--authenticatee="crammd5" --authentication_backoff_factor="1secs" --authorizer="local" --cgroups_cpu_enable_pids_and_tids_count="false"
--cgroups_enable_cfs="false" --cgroups_hierarchy="/sys/fs/cgroup" --cgroups_limit_swap="false"
--cgroups_root="mesos" --container_disk_watch_interval="15secs" --containerizers="mesos" --credential="/tmp/Endpoint_SlaveEndpointTest_NoAuthorizer_2_y0zjaF/credential"
--default_role="*" --disk_watch_interval="1mins" --docker="docker" --docker_kill_orphans="true"
--docker_registry="https://registry-1.docker.io" --docker_remove_delay="6hrs" --docker_socket="/var/run/docker.sock"
--docker_stop_timeout="0ns" --docker_store_dir="/tmp/mesos/store/docker" --docker_volume_checkpoint_dir="/var/run/mesos/isolators/docker/volume"
--enforce_container_disk_quota="false" --executor_registration_timeout="1mins" --executor_shutdown_grace_period="5secs"
--fetcher_cache_dir="/tmp/Endpoint_SlaveEndpointTest_NoAuthorizer_2_y0zjaF/fetch" --fetcher_cache_size="2GB"
--frameworks_home="" --gc_delay="1weeks" --gc_disk_headroom="0.1" --hadoop_home="" --help="false"
--hostname_lookup="true" --http_authenticators="basic" --http_command_executor="false" --http_credentials="/tmp/Endpoint_SlaveEndpointTest_NoAuthorizer_2_y0zjaF/http_credentials"
--http_heartbeat_interval="30secs" --initialize_driver_logging="true" --isolation="posix/cpu,posix/mem"
--launcher="posix" --launcher_dir="/mesos/mesos-1.3.0/_build/src" --logbufsecs="0" --logging_level="INFO"
--max_completed_executors_per_framework="150" --oversubscribed_resources_interval="15secs"
--perf_duration="10secs" --perf_interval="1mins" --qos_correction_interval_min="0ns" --quiet="false"
--recover="reconnect" --recovery_timeout="15mins" --registration_backoff_factor="10ms" --resources="cpus:2;gpus:0;mem:1024;disk:1024;ports:[31000-32000]"
--revocable_cpu_low_priority="true" --runtime_dir="/tmp/Endpoint_SlaveEndpointTest_NoAuthorizer_2_y0zjaF"
--sandbox_directory="/mnt/mesos/sandbox" --strict="true" --switch_user="true" --systemd_enable_support="true"
--systemd_runtime_directory="/run/systemd/system" --version="false" --work_dir="/tmp/Endpoint_SlaveEndpointTest_NoAuthorizer_2_AK6Yka"
I0309 16:55:54.415724 14001 credentials.hpp:86] Loading credential for authentication from
'/tmp/Endpoint_SlaveEndpointTest_NoAuthorizer_2_y0zjaF/credential'
I0309 16:55:54.415853 14001 slave.cpp:358] Agent using credential for: test-principal
I0309 16:55:54.415874 14001 credentials.hpp:37] Loading credentials for authentication from
'/tmp/Endpoint_SlaveEndpointTest_NoAuthorizer_2_y0zjaF/http_credentials'
I0309 16:55:54.416096 14001 http.cpp:964] Using default 'basic' HTTP authenticator for realm
'mesos-agent-readonly'
I0309 16:55:54.416224 14001 http.cpp:964] Using default 'basic' HTTP authenticator for realm
'mesos-agent-readwrite'
I0309 16:55:54.417362 14001 slave.cpp:545] Agent resources: cpus(*):2; mem(*):1024; disk(*):1024;
ports(*):[31000-32000]
I0309 16:55:54.417438 14001 slave.cpp:553] Agent attributes: [  ]
I0309 16:55:54.417450 14001 slave.cpp:558] Agent hostname: 04d9a3250e3d
I0309 16:55:54.417558 14005 status_update_manager.cpp:177] Pausing sending status updates
I0309 16:55:54.418877 14005 state.cpp:62] Recovering state from '/tmp/Endpoint_SlaveEndpointTest_NoAuthorizer_2_AK6Yka/meta'
I0309 16:55:54.419235 14012 status_update_manager.cpp:203] Recovering status update manager
I0309 16:55:54.419399 14011 containerizer.cpp:600] Recovering containerizer
I0309 16:55:54.420564 14006 provisioner.cpp:410] Provisioner recovery complete
I0309 16:55:54.420904 14016 slave.cpp:5572] Finished recovery
I0309 16:55:54.421339 14016 slave.cpp:5754] Querying resource estimator for oversubscribable
resources
I0309 16:55:54.421530 14014 slave.cpp:5768] Received oversubscribable resources {} from the
resource estimator
I0309 16:55:54.423108 14013 process.cpp:3705] Handling HTTP event for process 'slave(716)'
with path: '/slave(716)/containers'
I0309 16:55:54.424216 14013 http.cpp:916] Authorizing principal 'test-principal' to GET the
'/containers' endpoint
I0309 16:55:54.426810 14004 slave.cpp:808] Agent terminating
[       OK ] Endpoint/SlaveEndpointTest.NoAuthorizer/2 (24 ms)
[----------] 9 tests from Endpoint/SlaveEndpointTest (249 ms total)

[----------] Global test environment tear-down
[==========] 1518 tests from 169 test cases ran. (524580 ms total)
[  PASSED  ] 1514 tests.
[  FAILED  ] 4 tests, listed below:
[  FAILED  ] TaskValidationTest.ExecutorInfoDiffersOnDifferentSlaves
[  FAILED  ] RegistrarTest.Admit
[  FAILED  ] ReservationTest.MasterFailover
[  FAILED  ] SlaveTest.TerminalTaskContainerizerUpdateFailsWithLost

 4 FAILED TESTS
  YOU HAVE 12 DISABLED TESTS

make[4]: *** [check-local] Error 1
make[4]: Leaving directory `/mesos/mesos-1.3.0/_build/src'
make[3]: *** [check-am] Error 2
make[3]: Leaving directory `/mesos/mesos-1.3.0/_build/src'
make[2]: *** [check] Error 2
make[2]: Leaving directory `/mesos/mesos-1.3.0/_build/src'
make[1]: *** [check-recursive] Error 1
make[1]: Leaving directory `/mesos/mesos-1.3.0/_build'
make: *** [distcheck] Error 1
+ docker rmi mesos-1489075771-17913
Untagged: mesos-1489075771-17913:latest
Deleted: sha256:03584382a92cc41a8499f42c50705a086c651113fac1f3dcd1dd2ad7bf2ce1ad
Deleted: sha256:509c3b94d9e22869e9976af2f8a154b4a68049c8fa2c17dcbbd1247e2e833563
Deleted: sha256:383e44c2940849b996128274db7b365f39f56a0e3e75cc50279467f45bbdb033
Deleted: sha256:b40c495c91d185f1488737a97b93eec16508fc2809248d1eec533d9fdbd39941
Deleted: sha256:9d698174c9fc97c4bf463dd8dc8869b0c435626d33b7a0e75448afc598fe4121
Deleted: sha256:ecb0a4df0c7edfb672d4fac71ed8efb404dca9a494ebdb465afd902d4a601e93
Deleted: sha256:62743b4afee4299d016f823d54d038348508efce99483a10ba1bc4de14dff54e
Deleted: sha256:26ec0dda08e807a243efe692b059fa5679a9be3f50b2c8e009ec9f1fc0fb7834
Deleted: sha256:d71522fc19c1afe8180214974614519ea807c301f54d8581d4d72a0fea32d9da
Deleted: sha256:34acfe1641f90ee0495fc9130e869237f92c5275138a1f6811e753d12942e7e2
Deleted: sha256:1584299573458d6d946d57ad4e2596d06eb5ca613649a06041c27481b349b59c
Deleted: sha256:9f82e0334305b00546fd02a6d64aeb06de889e3d3e4fe38f896bf58ca03c5626
Deleted: sha256:ee823234e8640cd0f9083847f0c0723a1dcebf5b355ff297ff63d27f0ad983f7
Deleted: sha256:518545d0f1beb741063d6602a6d9492ec97fbdf51903513515bedf2b78a07229
Deleted: sha256:eb8309464b94c41fc1855b0df45b7a459934a9018c6b968afad977bf13f56b81
Deleted: sha256:108c7b5e1849b2e71f9365362557bb32cc5c3f0bc733fe948c602b18b330f115
Deleted: sha256:e35ca4480e0a74e0af47b8320b85c2d9cf8ea737a9e7d9432febfce34ad481b5
Deleted: sha256:6b75470626f9dadcc42d482058000cf641c9004c01883b79d13cb6abef4fec91
Deleted: sha256:a4198fecada5cebb5ef21eed096649cc35a4a0edd8cfd1f4a1ef58a679202a1c
Deleted: sha256:1f5448d816cf73ffd64869fb50bd23020f905e6ffcb05db515b9e185ae66fa42
Deleted: sha256:5bdfb8e3e34dda709602e3e8375f136af0714046b23a0af9ca464b5e028907a0
Deleted: sha256:3d54d10541d3cf3f7a58c21d0cfcce15286c84eab95c5f10ac370fa7e5194177
Deleted: sha256:af06c8456526ff52368b30d47377b3f4c1570d64627a081c84585c78ac127a80
Deleted: sha256:f45e41896f24b061ad0381dca34ca127d66163d44ab57d1b9575dcf580ef79cc
Build step 'Execute shell' marked build as failure

Mime
View raw message