mesos-builds mailing list archives

Site index · List index
Message view « Date » · « Thread »
Top « Date » · « Thread »
From Apache Jenkins Server <jenk...@builds.apache.org>
Subject Build failed in Jenkins: Mesos-Reviewbot #17347
Date Wed, 08 Mar 2017 09:05:39 GMT
See <https://builds.apache.org/job/Mesos-Reviewbot/17347/display/redirect>

------------------------------------------
[...truncated 25.66 MB...]
I0308 09:05:18.591401 30436 status_update_manager.cpp:203] Recovering status update manager
I0308 09:05:18.591647 30434 containerizer.cpp:600] Recovering containerizer
I0308 09:05:18.593560 30442 provisioner.cpp:410] Provisioner recovery complete
I0308 09:05:18.593991 30436 slave.cpp:5572] Finished recovery
I0308 09:05:18.594671 30436 slave.cpp:5754] Querying resource estimator for oversubscribable
resources
I0308 09:05:18.595021 30433 slave.cpp:5768] Received oversubscribable resources {} from the
resource estimator
I0308 09:05:18.597409 30437 process.cpp:3705] Handling HTTP event for process 'slave(708)'
with path: '/slave(708)/monitor/statistics.json'
I0308 09:05:18.598847 30435 http.cpp:916] Authorizing principal 'test-principal' to GET the
'/monitor/statistics.json' endpoint
I0308 09:05:18.602975 30444 slave.cpp:808] Agent terminating
[       OK ] Endpoint/SlaveEndpointTest.AuthorizedRequest/1 (33 ms)
[ RUN      ] Endpoint/SlaveEndpointTest.AuthorizedRequest/2
I0308 09:05:18.615066 30413 containerizer.cpp:221] Using isolation: posix/cpu,posix/mem,filesystem/posix,network/cni
W0308 09:05:18.615682 30413 backend.cpp:76] Failed to create 'aufs' backend: AufsBackend requires
root privileges
W0308 09:05:18.615794 30413 backend.cpp:76] Failed to create 'bind' backend: BindBackend requires
root privileges
I0308 09:05:18.615834 30413 provisioner.cpp:249] Using default backend 'copy'
I0308 09:05:18.619355 30434 slave.cpp:215] Mesos agent started on (709)@172.17.0.2:51162
I0308 09:05:18.619384 30434 slave.cpp:216] Flags at startup: --acls="" --appc_simple_discovery_uri_prefix="http://"
--appc_store_dir="/tmp/mesos/store/appc" --authenticate_http_readonly="true" --authenticate_http_readwrite="true"
--authenticatee="crammd5" --authentication_backoff_factor="1secs" --authorizer="local" --cgroups_cpu_enable_pids_and_tids_count="false"
--cgroups_enable_cfs="false" --cgroups_hierarchy="/sys/fs/cgroup" --cgroups_limit_swap="false"
--cgroups_root="mesos" --container_disk_watch_interval="15secs" --containerizers="mesos" --credential="/tmp/Endpoint_SlaveEndpointTest_AuthorizedRequest_2_f5gfEp/credential"
--default_role="*" --disk_watch_interval="1mins" --docker="docker" --docker_kill_orphans="true"
--docker_registry="https://registry-1.docker.io" --docker_remove_delay="6hrs" --docker_socket="/var/run/docker.sock"
--docker_stop_timeout="0ns" --docker_store_dir="/tmp/mesos/store/docker" --docker_volume_checkpoint_dir="/var/run/mesos/isolators/docker/volume"
--enforce_container_disk_quota="false" --executor_registration_timeout="1mins" --executor_shutdown_grace_period="5secs"
--fetcher_cache_dir="/tmp/Endpoint_SlaveEndpointTest_AuthorizedRequest_2_f5gfEp/fetch" --fetcher_cache_size="2GB"
--frameworks_home="" --gc_delay="1weeks" --gc_disk_headroom="0.1" --hadoop_home="" --help="false"
--hostname_lookup="true" --http_authenticators="basic" --http_command_executor="false" --http_credentials="/tmp/Endpoint_SlaveEndpointTest_AuthorizedRequest_2_f5gfEp/http_credentials"
--http_heartbeat_interval="30secs" --initialize_driver_logging="true" --isolation="posix/cpu,posix/mem"
--launcher="posix" --launcher_dir="/mesos/mesos-1.3.0/_build/src" --logbufsecs="0" --logging_level="INFO"
--max_completed_executors_per_framework="150" --oversubscribed_resources_interval="15secs"
--perf_duration="10secs" --perf_interval="1mins" --qos_correction_interval_min="0ns" --quiet="false"
--recover="reconnect" --recovery_timeout="15mins" --registration_backoff_factor="10ms" --resources="cpus:2;gpus:0;mem:1024;disk:1024;ports:[31000-32000]"
--revocable_cpu_low_priority="true" --runtime_dir="/tmp/Endpoint_SlaveEndpointTest_AuthorizedRequest_2_f5gfEp"
--sandbox_directory="/mnt/mesos/sandbox" --strict="true" --switch_user="true" --systemd_enable_support="true"
--systemd_runtime_directory="/run/systemd/system" --version="false" --work_dir="/tmp/Endpoint_SlaveEndpointTest_AuthorizedRequest_2_ePVwoI"
I0308 09:05:18.620128 30434 credentials.hpp:86] Loading credential for authentication from
'/tmp/Endpoint_SlaveEndpointTest_AuthorizedRequest_2_f5gfEp/credential'
I0308 09:05:18.620340 30434 slave.cpp:358] Agent using credential for: test-principal
I0308 09:05:18.620368 30434 credentials.hpp:37] Loading credentials for authentication from
'/tmp/Endpoint_SlaveEndpointTest_AuthorizedRequest_2_f5gfEp/http_credentials'
I0308 09:05:18.620677 30434 http.cpp:964] Using default 'basic' HTTP authenticator for realm
'mesos-agent-readonly'
I0308 09:05:18.620951 30434 http.cpp:964] Using default 'basic' HTTP authenticator for realm
'mesos-agent-readwrite'
I0308 09:05:18.622715 30434 slave.cpp:545] Agent resources: cpus(*):2; mem(*):1024; disk(*):1024;
ports(*):[31000-32000]
I0308 09:05:18.622819 30434 slave.cpp:553] Agent attributes: [  ]
I0308 09:05:18.622833 30434 slave.cpp:558] Agent hostname: 87169337eda0
I0308 09:05:18.623054 30432 status_update_manager.cpp:177] Pausing sending status updates
I0308 09:05:18.624735 30436 state.cpp:62] Recovering state from '/tmp/Endpoint_SlaveEndpointTest_AuthorizedRequest_2_ePVwoI/meta'
I0308 09:05:18.625200 30433 status_update_manager.cpp:203] Recovering status update manager
I0308 09:05:18.625435 30439 containerizer.cpp:600] Recovering containerizer
I0308 09:05:18.627540 30439 provisioner.cpp:410] Provisioner recovery complete
I0308 09:05:18.628437 30447 slave.cpp:5572] Finished recovery
I0308 09:05:18.629174 30447 slave.cpp:5754] Querying resource estimator for oversubscribable
resources
I0308 09:05:18.629469 30442 slave.cpp:5768] Received oversubscribable resources {} from the
resource estimator
I0308 09:05:18.632366 30432 process.cpp:3705] Handling HTTP event for process 'slave(709)'
with path: '/slave(709)/containers'
I0308 09:05:18.634032 30434 http.cpp:916] Authorizing principal 'test-principal' to GET the
'/containers' endpoint
I0308 09:05:18.639581 30441 slave.cpp:808] Agent terminating
[       OK ] Endpoint/SlaveEndpointTest.AuthorizedRequest/2 (35 ms)
[ RUN      ] Endpoint/SlaveEndpointTest.UnauthorizedRequest/0
I0308 09:05:18.651346 30413 containerizer.cpp:221] Using isolation: posix/cpu,posix/mem,filesystem/posix,network/cni
W0308 09:05:18.651904 30413 backend.cpp:76] Failed to create 'aufs' backend: AufsBackend requires
root privileges
W0308 09:05:18.652015 30413 backend.cpp:76] Failed to create 'bind' backend: BindBackend requires
root privileges
I0308 09:05:18.652055 30413 provisioner.cpp:249] Using default backend 'copy'
I0308 09:05:18.655920 30446 slave.cpp:215] Mesos agent started on (710)@172.17.0.2:51162
I0308 09:05:18.655951 30446 slave.cpp:216] Flags at startup: --acls="" --appc_simple_discovery_uri_prefix="http://"
--appc_store_dir="/tmp/mesos/store/appc" --authenticate_http_readonly="true" --authenticate_http_readwrite="true"
--authenticatee="crammd5" --authentication_backoff_factor="1secs" --authorizer="local" --cgroups_cpu_enable_pids_and_tids_count="false"
--cgroups_enable_cfs="false" --cgroups_hierarchy="/sys/fs/cgroup" --cgroups_limit_swap="false"
--cgroups_root="mesos" --container_disk_watch_interval="15secs" --containerizers="mesos" --credential="/tmp/Endpoint_SlaveEndpointTest_UnauthorizedRequest_0_Nao4Yc/credential"
--default_role="*" --disk_watch_interval="1mins" --docker="docker" --docker_kill_orphans="true"
--docker_registry="https://registry-1.docker.io" --docker_remove_delay="6hrs" --docker_socket="/var/run/docker.sock"
--docker_stop_timeout="0ns" --docker_store_dir="/tmp/mesos/store/docker" --docker_volume_checkpoint_dir="/var/run/mesos/isolators/docker/volume"
--enforce_container_disk_quota="false" --executor_registration_timeout="1mins" --executor_shutdown_grace_period="5secs"
--fetcher_cache_dir="/tmp/Endpoint_SlaveEndpointTest_UnauthorizedRequest_0_Nao4Yc/fetch" --fetcher_cache_size="2GB"
--frameworks_home="" --gc_delay="1weeks" --gc_disk_headroom="0.1" --hadoop_home="" --help="false"
--hostname_lookup="true" --http_authenticators="basic" --http_command_executor="false" --http_credentials="/tmp/Endpoint_SlaveEndpointTest_UnauthorizedRequest_0_Nao4Yc/http_credentials"
--http_heartbeat_interval="30secs" --initialize_driver_logging="true" --isolation="posix/cpu,posix/mem"
--launcher="posix" --launcher_dir="/mesos/mesos-1.3.0/_build/src" --logbufsecs="0" --logging_level="INFO"
--max_completed_executors_per_framework="150" --oversubscribed_resources_interval="15secs"
--perf_duration="10secs" --perf_interval="1mins" --qos_correction_interval_min="0ns" --quiet="false"
--recover="reconnect" --recovery_timeout="15mins" --registration_backoff_factor="10ms" --resources="cpus:2;gpus:0;mem:1024;disk:1024;ports:[31000-32000]"
--revocable_cpu_low_priority="true" --runtime_dir="/tmp/Endpoint_SlaveEndpointTest_UnauthorizedRequest_0_Nao4Yc"
--sandbox_directory="/mnt/mesos/sandbox" --strict="true" --switch_user="true" --systemd_enable_support="true"
--systemd_runtime_directory="/run/systemd/system" --version="false" --work_dir="/tmp/Endpoint_SlaveEndpointTest_UnauthorizedRequest_0_GcqtDv"
I0308 09:05:18.656612 30446 credentials.hpp:86] Loading credential for authentication from
'/tmp/Endpoint_SlaveEndpointTest_UnauthorizedRequest_0_Nao4Yc/credential'
I0308 09:05:18.656800 30446 slave.cpp:358] Agent using credential for: test-principal
I0308 09:05:18.656826 30446 credentials.hpp:37] Loading credentials for authentication from
'/tmp/Endpoint_SlaveEndpointTest_UnauthorizedRequest_0_Nao4Yc/http_credentials'
I0308 09:05:18.657097 30446 http.cpp:964] Using default 'basic' HTTP authenticator for realm
'mesos-agent-readonly'
I0308 09:05:18.657249 30446 http.cpp:964] Using default 'basic' HTTP authenticator for realm
'mesos-agent-readwrite'
I0308 09:05:18.658787 30446 slave.cpp:545] Agent resources: cpus(*):2; mem(*):1024; disk(*):1024;
ports(*):[31000-32000]
I0308 09:05:18.658887 30446 slave.cpp:553] Agent attributes: [  ]
I0308 09:05:18.658900 30446 slave.cpp:558] Agent hostname: 87169337eda0
I0308 09:05:18.659109 30438 status_update_manager.cpp:177] Pausing sending status updates
I0308 09:05:18.660696 30445 state.cpp:62] Recovering state from '/tmp/Endpoint_SlaveEndpointTest_UnauthorizedRequest_0_GcqtDv/meta'
I0308 09:05:18.661124 30446 status_update_manager.cpp:203] Recovering status update manager
I0308 09:05:18.661571 30442 containerizer.cpp:600] Recovering containerizer
I0308 09:05:18.663558 30438 provisioner.cpp:410] Provisioner recovery complete
I0308 09:05:18.664095 30441 slave.cpp:5572] Finished recovery
I0308 09:05:18.664737 30441 slave.cpp:5754] Querying resource estimator for oversubscribable
resources
I0308 09:05:18.665141 30436 slave.cpp:5768] Received oversubscribable resources {} from the
resource estimator
I0308 09:05:18.667654 30440 process.cpp:3705] Handling HTTP event for process 'slave(710)'
with path: '/slave(710)/monitor/statistics'
I0308 09:05:18.669126 30439 http.cpp:916] Authorizing principal 'test-principal' to GET the
'/monitor/statistics' endpoint
I0308 09:05:18.671989 30440 slave.cpp:808] Agent terminating
[       OK ] Endpoint/SlaveEndpointTest.UnauthorizedRequest/0 (31 ms)
[ RUN      ] Endpoint/SlaveEndpointTest.UnauthorizedRequest/1
I0308 09:05:18.683174 30413 containerizer.cpp:221] Using isolation: posix/cpu,posix/mem,filesystem/posix,network/cni
W0308 09:05:18.683732 30413 backend.cpp:76] Failed to create 'aufs' backend: AufsBackend requires
root privileges
W0308 09:05:18.683840 30413 backend.cpp:76] Failed to create 'bind' backend: BindBackend requires
root privileges
I0308 09:05:18.683884 30413 provisioner.cpp:249] Using default backend 'copy'
I0308 09:05:18.687327 30443 slave.cpp:215] Mesos agent started on (711)@172.17.0.2:51162
I0308 09:05:18.687357 30443 slave.cpp:216] Flags at startup: --acls="" --appc_simple_discovery_uri_prefix="http://"
--appc_store_dir="/tmp/mesos/store/appc" --authenticate_http_readonly="true" --authenticate_http_readwrite="true"
--authenticatee="crammd5" --authentication_backoff_factor="1secs" --authorizer="local" --cgroups_cpu_enable_pids_and_tids_count="false"
--cgroups_enable_cfs="false" --cgroups_hierarchy="/sys/fs/cgroup" --cgroups_limit_swap="false"
--cgroups_root="mesos" --container_disk_watch_interval="15secs" --containerizers="mesos" --credential="/tmp/Endpoint_SlaveEndpointTest_UnauthorizedRequest_1_DdxeF0/credential"
--default_role="*" --disk_watch_interval="1mins" --docker="docker" --docker_kill_orphans="true"
--docker_registry="https://registry-1.docker.io" --docker_remove_delay="6hrs" --docker_socket="/var/run/docker.sock"
--docker_stop_timeout="0ns" --docker_store_dir="/tmp/mesos/store/docker" --docker_volume_checkpoint_dir="/var/run/mesos/isolators/docker/volume"
--enforce_container_disk_quota="false" --executor_registration_timeout="1mins" --executor_shutdown_grace_period="5secs"
--fetcher_cache_dir="/tmp/Endpoint_SlaveEndpointTest_UnauthorizedRequest_1_DdxeF0/fetch" --fetcher_cache_size="2GB"
--frameworks_home="" --gc_delay="1weeks" --gc_disk_headroom="0.1" --hadoop_home="" --help="false"
--hostname_lookup="true" --http_authenticators="basic" --http_command_executor="false" --http_credentials="/tmp/Endpoint_SlaveEndpointTest_UnauthorizedRequest_1_DdxeF0/http_credentials"
--http_heartbeat_interval="30secs" --initialize_driver_logging="true" --isolation="posix/cpu,posix/mem"
--launcher="posix" --launcher_dir="/mesos/mesos-1.3.0/_build/src" --logbufsecs="0" --logging_level="INFO"
--max_completed_executors_per_framework="150" --oversubscribed_resources_interval="15secs"
--perf_duration="10secs" --perf_interval="1mins" --qos_correction_interval_min="0ns" --quiet="false"
--recover="reconnect" --recovery_timeout="15mins" --registration_backoff_factor="10ms" --resources="cpus:2;gpus:0;mem:1024;disk:1024;ports:[31000-32000]"
--revocable_cpu_low_priority="true" --runtime_dir="/tmp/Endpoint_SlaveEndpointTest_UnauthorizedRequest_1_DdxeF0"
--sandbox_directory="/mnt/mesos/sandbox" --strict="true" --switch_user="true" --systemd_enable_support="true"
--systemd_runtime_directory="/run/systemd/system" --version="false" --work_dir="/tmp/Endpoint_SlaveEndpointTest_UnauthorizedRequest_1_Okfsej"
I0308 09:05:18.688012 30443 credentials.hpp:86] Loading credential for authentication from
'/tmp/Endpoint_SlaveEndpointTest_UnauthorizedRequest_1_DdxeF0/credential'
I0308 09:05:18.688180 30443 slave.cpp:358] Agent using credential for: test-principal
I0308 09:05:18.688206 30443 credentials.hpp:37] Loading credentials for authentication from
'/tmp/Endpoint_SlaveEndpointTest_UnauthorizedRequest_1_DdxeF0/http_credentials'
I0308 09:05:18.688472 30443 http.cpp:964] Using default 'basic' HTTP authenticator for realm
'mesos-agent-readonly'
I0308 09:05:18.688611 30443 http.cpp:964] Using default 'basic' HTTP authenticator for realm
'mesos-agent-readwrite'
I0308 09:05:18.690243 30443 slave.cpp:545] Agent resources: cpus(*):2; mem(*):1024; disk(*):1024;
ports(*):[31000-32000]
I0308 09:05:18.690343 30443 slave.cpp:553] Agent attributes: [  ]
I0308 09:05:18.690356 30443 slave.cpp:558] Agent hostname: 87169337eda0
I0308 09:05:18.690531 30438 status_update_manager.cpp:177] Pausing sending status updates
I0308 09:05:18.691885 30441 state.cpp:62] Recovering state from '/tmp/Endpoint_SlaveEndpointTest_UnauthorizedRequest_1_Okfsej/meta'
I0308 09:05:18.692445 30447 status_update_manager.cpp:203] Recovering status update manager
I0308 09:05:18.693143 30432 containerizer.cpp:600] Recovering containerizer
I0308 09:05:18.694883 30443 provisioner.cpp:410] Provisioner recovery complete
I0308 09:05:18.695742 30445 slave.cpp:5572] Finished recovery
I0308 09:05:18.696763 30445 slave.cpp:5754] Querying resource estimator for oversubscribable
resources
I0308 09:05:18.697095 30446 slave.cpp:5768] Received oversubscribable resources {} from the
resource estimator
I0308 09:05:18.699707 30436 process.cpp:3705] Handling HTTP event for process 'slave(711)'
with path: '/slave(711)/monitor/statistics.json'
I0308 09:05:18.701369 30441 http.cpp:916] Authorizing principal 'test-principal' to GET the
'/monitor/statistics.json' endpoint
I0308 09:05:18.704212 30435 slave.cpp:808] Agent terminating
[       OK ] Endpoint/SlaveEndpointTest.UnauthorizedRequest/1 (32 ms)
[ RUN      ] Endpoint/SlaveEndpointTest.UnauthorizedRequest/2
I0308 09:05:18.715914 30413 containerizer.cpp:221] Using isolation: posix/cpu,posix/mem,filesystem/posix,network/cni
W0308 09:05:18.716464 30413 backend.cpp:76] Failed to create 'aufs' backend: AufsBackend requires
root privileges
W0308 09:05:18.716573 30413 backend.cpp:76] Failed to create 'bind' backend: BindBackend requires
root privileges
I0308 09:05:18.716611 30413 provisioner.cpp:249] Using default backend 'copy'
I0308 09:05:18.719825 30436 slave.cpp:215] Mesos agent started on (712)@172.17.0.2:51162
I0308 09:05:18.719863 30436 slave.cpp:216] Flags at startup: --acls="" --appc_simple_discovery_uri_prefix="http://"
--appc_store_dir="/tmp/mesos/store/appc" --authenticate_http_readonly="true" --authenticate_http_readwrite="true"
--authenticatee="crammd5" --authentication_backoff_factor="1secs" --authorizer="local" --cgroups_cpu_enable_pids_and_tids_count="false"
--cgroups_enable_cfs="false" --cgroups_hierarchy="/sys/fs/cgroup" --cgroups_limit_swap="false"
--cgroups_root="mesos" --container_disk_watch_interval="15secs" --containerizers="mesos" --credential="/tmp/Endpoint_SlaveEndpointTest_UnauthorizedRequest_2_zOQoGO/credential"
--default_role="*" --disk_watch_interval="1mins" --docker="docker" --docker_kill_orphans="true"
--docker_registry="https://registry-1.docker.io" --docker_remove_delay="6hrs" --docker_socket="/var/run/docker.sock"
--docker_stop_timeout="0ns" --docker_store_dir="/tmp/mesos/store/docker" --docker_volume_checkpoint_dir="/var/run/mesos/isolators/docker/volume"
--enforce_container_disk_quota="false" --executor_registration_timeout="1mins" --executor_shutdown_grace_period="5secs"
--fetcher_cache_dir="/tmp/Endpoint_SlaveEndpointTest_UnauthorizedRequest_2_zOQoGO/fetch" --fetcher_cache_size="2GB"
--frameworks_home="" --gc_delay="1weeks" --gc_disk_headroom="0.1" --hadoop_home="" --help="false"
--hostname_lookup="true" --http_authenticators="basic" --http_command_executor="false" --http_credentials="/tmp/Endpoint_SlaveEndpointTest_UnauthorizedRequest_2_zOQoGO/http_credentials"
--http_heartbeat_interval="30secs" --initialize_driver_logging="true" --isolation="posix/cpu,posix/mem"
--launcher="posix" --launcher_dir="/mesos/mesos-1.3.0/_build/src" --logbufsecs="0" --logging_level="INFO"
--max_completed_executors_per_framework="150" --oversubscribed_resources_interval="15secs"
--perf_duration="10secs" --perf_interval="1mins" --qos_correction_interval_min="0ns" --quiet="false"
--recover="reconnect" --recovery_timeout="15mins" --registration_backoff_factor="10ms" --resources="cpus:2;gpus:0;mem:1024;disk:1024;ports:[31000-32000]"
--revocable_cpu_low_priority="true" --runtime_dir="/tmp/Endpoint_SlaveEndpointTest_UnauthorizedRequest_2_zOQoGO"
--sandbox_directory="/mnt/mesos/sandbox" --strict="true" --switch_user="true" --systemd_enable_support="true"
--systemd_runtime_directory="/run/systemd/system" --version="false" --work_dir="/tmp/Endpoint_SlaveEndpointTest_UnauthorizedRequest_2_keDka7"
I0308 09:05:18.720944 30436 credentials.hpp:86] Loading credential for authentication from
'/tmp/Endpoint_SlaveEndpointTest_UnauthorizedRequest_2_zOQoGO/credential'
I0308 09:05:18.721164 30436 slave.cpp:358] Agent using credential for: test-principal
I0308 09:05:18.721199 30436 credentials.hpp:37] Loading credentials for authentication from
'/tmp/Endpoint_SlaveEndpointTest_UnauthorizedRequest_2_zOQoGO/http_credentials'
I0308 09:05:18.721608 30436 http.cpp:964] Using default 'basic' HTTP authenticator for realm
'mesos-agent-readonly'
I0308 09:05:18.721767 30436 http.cpp:964] Using default 'basic' HTTP authenticator for realm
'mesos-agent-readwrite'
I0308 09:05:18.723511 30436 slave.cpp:545] Agent resources: cpus(*):2; mem(*):1024; disk(*):1024;
ports(*):[31000-32000]
I0308 09:05:18.723613 30436 slave.cpp:553] Agent attributes: [  ]
I0308 09:05:18.723628 30436 slave.cpp:558] Agent hostname: 87169337eda0
I0308 09:05:18.723829 30440 status_update_manager.cpp:177] Pausing sending status updates
I0308 09:05:18.725605 30447 state.cpp:62] Recovering state from '/tmp/Endpoint_SlaveEndpointTest_UnauthorizedRequest_2_keDka7/meta'
I0308 09:05:18.726284 30446 status_update_manager.cpp:203] Recovering status update manager
I0308 09:05:18.726685 30432 containerizer.cpp:600] Recovering containerizer
I0308 09:05:18.728047 30445 provisioner.cpp:410] Provisioner recovery complete
I0308 09:05:18.728605 30442 slave.cpp:5572] Finished recovery
I0308 09:05:18.729192 30442 slave.cpp:5754] Querying resource estimator for oversubscribable
resources
I0308 09:05:18.729609 30432 slave.cpp:5768] Received oversubscribable resources {} from the
resource estimator
I0308 09:05:18.731865 30447 process.cpp:3705] Handling HTTP event for process 'slave(712)'
with path: '/slave(712)/containers'
I0308 09:05:18.733310 30440 http.cpp:916] Authorizing principal 'test-principal' to GET the
'/containers' endpoint
I0308 09:05:18.736157 30443 slave.cpp:808] Agent terminating
[       OK ] Endpoint/SlaveEndpointTest.UnauthorizedRequest/2 (32 ms)
[ RUN      ] Endpoint/SlaveEndpointTest.NoAuthorizer/0
I0308 09:05:18.748219 30413 containerizer.cpp:221] Using isolation: posix/cpu,posix/mem,filesystem/posix,network/cni
W0308 09:05:18.748731 30413 backend.cpp:76] Failed to create 'aufs' backend: AufsBackend requires
root privileges
W0308 09:05:18.748843 30413 backend.cpp:76] Failed to create 'bind' backend: BindBackend requires
root privileges
I0308 09:05:18.748883 30413 provisioner.cpp:249] Using default backend 'copy'
I0308 09:05:18.750525 30413 cluster.cpp:446] Creating default 'local' authorizer
I0308 09:05:18.752214 30436 slave.cpp:215] Mesos agent started on (713)@172.17.0.2:51162
I0308 09:05:18.752235 30436 slave.cpp:216] Flags at startup: --acls="" --appc_simple_discovery_uri_prefix="http://"
--appc_store_dir="/tmp/mesos/store/appc" --authenticate_http_readonly="true" --authenticate_http_readwrite="true"
--authenticatee="crammd5" --authentication_backoff_factor="1secs" --authorizer="local" --cgroups_cpu_enable_pids_and_tids_count="false"
--cgroups_enable_cfs="false" --cgroups_hierarchy="/sys/fs/cgroup" --cgroups_limit_swap="false"
--cgroups_root="mesos" --container_disk_watch_interval="15secs" --containerizers="mesos" --credential="/tmp/Endpoint_SlaveEndpointTest_NoAuthorizer_0_HH2C2C/credential"
--default_role="*" --disk_watch_interval="1mins" --docker="docker" --docker_kill_orphans="true"
--docker_registry="https://registry-1.docker.io" --docker_remove_delay="6hrs" --docker_socket="/var/run/docker.sock"
--docker_stop_timeout="0ns" --docker_store_dir="/tmp/mesos/store/docker" --docker_volume_checkpoint_dir="/var/run/mesos/isolators/docker/volume"
--enforce_container_disk_quota="false" --executor_registration_timeout="1mins" --executor_shutdown_grace_period="5secs"
--fetcher_cache_dir="/tmp/Endpoint_SlaveEndpointTest_NoAuthorizer_0_HH2C2C/fetch" --fetcher_cache_size="2GB"
--frameworks_home="" --gc_delay="1weeks" --gc_disk_headroom="0.1" --hadoop_home="" --help="false"
--hostname_lookup="true" --http_authenticators="basic" --http_command_executor="false" --http_credentials="/tmp/Endpoint_SlaveEndpointTest_NoAuthorizer_0_HH2C2C/http_credentials"
--http_heartbeat_interval="30secs" --initialize_driver_logging="true" --isolation="posix/cpu,posix/mem"
--launcher="posix" --launcher_dir="/mesos/mesos-1.3.0/_build/src" --logbufsecs="0" --logging_level="INFO"
--max_completed_executors_per_framework="150" --oversubscribed_resources_interval="15secs"
--perf_duration="10secs" --perf_interval="1mins" --qos_correction_interval_min="0ns" --quiet="false"
--recover="reconnect" --recovery_timeout="15mins" --registration_backoff_factor="10ms" --resources="cpus:2;gpus:0;mem:1024;disk:1024;ports:[31000-32000]"
--revocable_cpu_low_priority="true" --runtime_dir="/tmp/Endpoint_SlaveEndpointTest_NoAuthorizer_0_HH2C2C"
--sandbox_directory="/mnt/mesos/sandbox" --strict="true" --switch_user="true" --systemd_enable_support="true"
--systemd_runtime_directory="/run/systemd/system" --version="false" --work_dir="/tmp/Endpoint_SlaveEndpointTest_NoAuthorizer_0_QcTjrV"
I0308 09:05:18.752804 30436 credentials.hpp:86] Loading credential for authentication from
'/tmp/Endpoint_SlaveEndpointTest_NoAuthorizer_0_HH2C2C/credential'
I0308 09:05:18.752936 30436 slave.cpp:358] Agent using credential for: test-principal
I0308 09:05:18.752959 30436 credentials.hpp:37] Loading credentials for authentication from
'/tmp/Endpoint_SlaveEndpointTest_NoAuthorizer_0_HH2C2C/http_credentials'
I0308 09:05:18.753170 30436 http.cpp:964] Using default 'basic' HTTP authenticator for realm
'mesos-agent-readonly'
I0308 09:05:18.753525 30436 http.cpp:964] Using default 'basic' HTTP authenticator for realm
'mesos-agent-readwrite'
I0308 09:05:18.754788 30436 slave.cpp:545] Agent resources: cpus(*):2; mem(*):1024; disk(*):1024;
ports(*):[31000-32000]
I0308 09:05:18.754866 30436 slave.cpp:553] Agent attributes: [  ]
I0308 09:05:18.754878 30436 slave.cpp:558] Agent hostname: 87169337eda0
I0308 09:05:18.755007 30435 status_update_manager.cpp:177] Pausing sending status updates
I0308 09:05:18.756639 30437 state.cpp:62] Recovering state from '/tmp/Endpoint_SlaveEndpointTest_NoAuthorizer_0_QcTjrV/meta'
I0308 09:05:18.757031 30435 status_update_manager.cpp:203] Recovering status update manager
I0308 09:05:18.757658 30446 containerizer.cpp:600] Recovering containerizer
I0308 09:05:18.758965 30432 provisioner.cpp:410] Provisioner recovery complete
I0308 09:05:18.759446 30440 slave.cpp:5572] Finished recovery
I0308 09:05:18.759934 30440 slave.cpp:5754] Querying resource estimator for oversubscribable
resources
I0308 09:05:18.760231 30442 slave.cpp:5768] Received oversubscribable resources {} from the
resource estimator
I0308 09:05:18.762886 30443 process.cpp:3705] Handling HTTP event for process 'slave(713)'
with path: '/slave(713)/monitor/statistics'
I0308 09:05:18.764343 30444 http.cpp:916] Authorizing principal 'test-principal' to GET the
'/monitor/statistics' endpoint
I0308 09:05:18.768272 30434 slave.cpp:808] Agent terminating
[       OK ] Endpoint/SlaveEndpointTest.NoAuthorizer/0 (30 ms)
[ RUN      ] Endpoint/SlaveEndpointTest.NoAuthorizer/1
I0308 09:05:18.780021 30413 containerizer.cpp:221] Using isolation: posix/cpu,posix/mem,filesystem/posix,network/cni
W0308 09:05:18.780593 30413 backend.cpp:76] Failed to create 'aufs' backend: AufsBackend requires
root privileges
W0308 09:05:18.780747 30413 backend.cpp:76] Failed to create 'bind' backend: BindBackend requires
root privileges
I0308 09:05:18.780791 30413 provisioner.cpp:249] Using default backend 'copy'
I0308 09:05:18.782539 30413 cluster.cpp:446] Creating default 'local' authorizer
I0308 09:05:18.784945 30441 slave.cpp:215] Mesos agent started on (714)@172.17.0.2:51162
I0308 09:05:18.784974 30441 slave.cpp:216] Flags at startup: --acls="" --appc_simple_discovery_uri_prefix="http://"
--appc_store_dir="/tmp/mesos/store/appc" --authenticate_http_readonly="true" --authenticate_http_readwrite="true"
--authenticatee="crammd5" --authentication_backoff_factor="1secs" --authorizer="local" --cgroups_cpu_enable_pids_and_tids_count="false"
--cgroups_enable_cfs="false" --cgroups_hierarchy="/sys/fs/cgroup" --cgroups_limit_swap="false"
--cgroups_root="mesos" --container_disk_watch_interval="15secs" --containerizers="mesos" --credential="/tmp/Endpoint_SlaveEndpointTest_NoAuthorizer_1_LfbgJr/credential"
--default_role="*" --disk_watch_interval="1mins" --docker="docker" --docker_kill_orphans="true"
--docker_registry="https://registry-1.docker.io" --docker_remove_delay="6hrs" --docker_socket="/var/run/docker.sock"
--docker_stop_timeout="0ns" --docker_store_dir="/tmp/mesos/store/docker" --docker_volume_checkpoint_dir="/var/run/mesos/isolators/docker/volume"
--enforce_container_disk_quota="false" --executor_registration_timeout="1mins" --executor_shutdown_grace_period="5secs"
--fetcher_cache_dir="/tmp/Endpoint_SlaveEndpointTest_NoAuthorizer_1_LfbgJr/fetch" --fetcher_cache_size="2GB"
--frameworks_home="" --gc_delay="1weeks" --gc_disk_headroom="0.1" --hadoop_home="" --help="false"
--hostname_lookup="true" --http_authenticators="basic" --http_command_executor="false" --http_credentials="/tmp/Endpoint_SlaveEndpointTest_NoAuthorizer_1_LfbgJr/http_credentials"
--http_heartbeat_interval="30secs" --initialize_driver_logging="true" --isolation="posix/cpu,posix/mem"
--launcher="posix" --launcher_dir="/mesos/mesos-1.3.0/_build/src" --logbufsecs="0" --logging_level="INFO"
--max_completed_executors_per_framework="150" --oversubscribed_resources_interval="15secs"
--perf_duration="10secs" --perf_interval="1mins" --qos_correction_interval_min="0ns" --quiet="false"
--recover="reconnect" --recovery_timeout="15mins" --registration_backoff_factor="10ms" --resources="cpus:2;gpus:0;mem:1024;disk:1024;ports:[31000-32000]"
--revocable_cpu_low_priority="true" --runtime_dir="/tmp/Endpoint_SlaveEndpointTest_NoAuthorizer_1_LfbgJr"
--sandbox_directory="/mnt/mesos/sandbox" --strict="true" --switch_user="true" --systemd_enable_support="true"
--systemd_runtime_directory="/run/systemd/system" --version="false" --work_dir="/tmp/Endpoint_SlaveEndpointTest_NoAuthorizer_1_sbgO2J"
I0308 09:05:18.785670 30441 credentials.hpp:86] Loading credential for authentication from
'/tmp/Endpoint_SlaveEndpointTest_NoAuthorizer_1_LfbgJr/credential'
I0308 09:05:18.785842 30441 slave.cpp:358] Agent using credential for: test-principal
I0308 09:05:18.785869 30441 credentials.hpp:37] Loading credentials for authentication from
'/tmp/Endpoint_SlaveEndpointTest_NoAuthorizer_1_LfbgJr/http_credentials'
I0308 09:05:18.786154 30441 http.cpp:964] Using default 'basic' HTTP authenticator for realm
'mesos-agent-readonly'
I0308 09:05:18.786293 30441 http.cpp:964] Using default 'basic' HTTP authenticator for realm
'mesos-agent-readwrite'
I0308 09:05:18.787784 30441 slave.cpp:545] Agent resources: cpus(*):2; mem(*):1024; disk(*):1024;
ports(*):[31000-32000]
I0308 09:05:18.787883 30441 slave.cpp:553] Agent attributes: [  ]
I0308 09:05:18.787896 30441 slave.cpp:558] Agent hostname: 87169337eda0
I0308 09:05:18.788044 30443 status_update_manager.cpp:177] Pausing sending status updates
I0308 09:05:18.789752 30447 state.cpp:62] Recovering state from '/tmp/Endpoint_SlaveEndpointTest_NoAuthorizer_1_sbgO2J/meta'
I0308 09:05:18.790274 30435 status_update_manager.cpp:203] Recovering status update manager
I0308 09:05:18.790524 30445 containerizer.cpp:600] Recovering containerizer
I0308 09:05:18.792425 30442 provisioner.cpp:410] Provisioner recovery complete
I0308 09:05:18.792942 30438 slave.cpp:5572] Finished recovery
I0308 09:05:18.793426 30438 slave.cpp:5754] Querying resource estimator for oversubscribable
resources
I0308 09:05:18.793848 30443 slave.cpp:5768] Received oversubscribable resources {} from the
resource estimator
I0308 09:05:18.796322 30444 process.cpp:3705] Handling HTTP event for process 'slave(714)'
with path: '/slave(714)/monitor/statistics.json'
I0308 09:05:18.797878 30437 http.cpp:916] Authorizing principal 'test-principal' to GET the
'/monitor/statistics.json' endpoint
I0308 09:05:18.801581 30442 slave.cpp:808] Agent terminating
[       OK ] Endpoint/SlaveEndpointTest.NoAuthorizer/1 (33 ms)
[ RUN      ] Endpoint/SlaveEndpointTest.NoAuthorizer/2
I0308 09:05:18.813508 30413 containerizer.cpp:221] Using isolation: posix/cpu,posix/mem,filesystem/posix,network/cni
W0308 09:05:18.814064 30413 backend.cpp:76] Failed to create 'aufs' backend: AufsBackend requires
root privileges
W0308 09:05:18.814174 30413 backend.cpp:76] Failed to create 'bind' backend: BindBackend requires
root privileges
I0308 09:05:18.814211 30413 provisioner.cpp:249] Using default backend 'copy'
I0308 09:05:18.816249 30413 cluster.cpp:446] Creating default 'local' authorizer
I0308 09:05:18.817981 30438 slave.cpp:215] Mesos agent started on (715)@172.17.0.2:51162
I0308 09:05:18.818007 30438 slave.cpp:216] Flags at startup: --acls="" --appc_simple_discovery_uri_prefix="http://"
--appc_store_dir="/tmp/mesos/store/appc" --authenticate_http_readonly="true" --authenticate_http_readwrite="true"
--authenticatee="crammd5" --authentication_backoff_factor="1secs" --authorizer="local" --cgroups_cpu_enable_pids_and_tids_count="false"
--cgroups_enable_cfs="false" --cgroups_hierarchy="/sys/fs/cgroup" --cgroups_limit_swap="false"
--cgroups_root="mesos" --container_disk_watch_interval="15secs" --containerizers="mesos" --credential="/tmp/Endpoint_SlaveEndpointTest_NoAuthorizer_2_xgjGLg/credential"
--default_role="*" --disk_watch_interval="1mins" --docker="docker" --docker_kill_orphans="true"
--docker_registry="https://registry-1.docker.io" --docker_remove_delay="6hrs" --docker_socket="/var/run/docker.sock"
--docker_stop_timeout="0ns" --docker_store_dir="/tmp/mesos/store/docker" --docker_volume_checkpoint_dir="/var/run/mesos/isolators/docker/volume"
--enforce_container_disk_quota="false" --executor_registration_timeout="1mins" --executor_shutdown_grace_period="5secs"
--fetcher_cache_dir="/tmp/Endpoint_SlaveEndpointTest_NoAuthorizer_2_xgjGLg/fetch" --fetcher_cache_size="2GB"
--frameworks_home="" --gc_delay="1weeks" --gc_disk_headroom="0.1" --hadoop_home="" --help="false"
--hostname_lookup="true" --http_authenticators="basic" --http_command_executor="false" --http_credentials="/tmp/Endpoint_SlaveEndpointTest_NoAuthorizer_2_xgjGLg/http_credentials"
--http_heartbeat_interval="30secs" --initialize_driver_logging="true" --isolation="posix/cpu,posix/mem"
--launcher="posix" --launcher_dir="/mesos/mesos-1.3.0/_build/src" --logbufsecs="0" --logging_level="INFO"
--max_completed_executors_per_framework="150" --oversubscribed_resources_interval="15secs"
--perf_duration="10secs" --perf_interval="1mins" --qos_correction_interval_min="0ns" --quiet="false"
--recover="reconnect" --recovery_timeout="15mins" --registration_backoff_factor="10ms" --resources="cpus:2;gpus:0;mem:1024;disk:1024;ports:[31000-32000]"
--revocable_cpu_low_priority="true" --runtime_dir="/tmp/Endpoint_SlaveEndpointTest_NoAuthorizer_2_xgjGLg"
--sandbox_directory="/mnt/mesos/sandbox" --strict="true" --switch_user="true" --systemd_enable_support="true"
--systemd_runtime_directory="/run/systemd/system" --version="false" --work_dir="/tmp/Endpoint_SlaveEndpointTest_NoAuthorizer_2_MD3MZy"
I0308 09:05:18.818701 30438 credentials.hpp:86] Loading credential for authentication from
'/tmp/Endpoint_SlaveEndpointTest_NoAuthorizer_2_xgjGLg/credential'
I0308 09:05:18.818861 30438 slave.cpp:358] Agent using credential for: test-principal
I0308 09:05:18.818888 30438 credentials.hpp:37] Loading credentials for authentication from
'/tmp/Endpoint_SlaveEndpointTest_NoAuthorizer_2_xgjGLg/http_credentials'
I0308 09:05:18.819160 30438 http.cpp:964] Using default 'basic' HTTP authenticator for realm
'mesos-agent-readonly'
I0308 09:05:18.819327 30438 http.cpp:964] Using default 'basic' HTTP authenticator for realm
'mesos-agent-readwrite'
I0308 09:05:18.821179 30438 slave.cpp:545] Agent resources: cpus(*):2; mem(*):1024; disk(*):1024;
ports(*):[31000-32000]
I0308 09:05:18.821282 30438 slave.cpp:553] Agent attributes: [  ]
I0308 09:05:18.821296 30438 slave.cpp:558] Agent hostname: 87169337eda0
I0308 09:05:18.821516 30444 status_update_manager.cpp:177] Pausing sending status updates
I0308 09:05:18.822741 30446 state.cpp:62] Recovering state from '/tmp/Endpoint_SlaveEndpointTest_NoAuthorizer_2_MD3MZy/meta'
I0308 09:05:18.822968 30445 status_update_manager.cpp:203] Recovering status update manager
I0308 09:05:18.823293 30434 containerizer.cpp:600] Recovering containerizer
I0308 09:05:18.825145 30445 provisioner.cpp:410] Provisioner recovery complete
I0308 09:05:18.825688 30444 slave.cpp:5572] Finished recovery
I0308 09:05:18.826131 30444 slave.cpp:5754] Querying resource estimator for oversubscribable
resources
I0308 09:05:18.826501 30439 slave.cpp:5768] Received oversubscribable resources {} from the
resource estimator
I0308 09:05:18.828986 30445 process.cpp:3705] Handling HTTP event for process 'slave(715)'
with path: '/slave(715)/containers'
I0308 09:05:18.830394 30438 http.cpp:916] Authorizing principal 'test-principal' to GET the
'/containers' endpoint
I0308 09:05:18.834977 30433 slave.cpp:808] Agent terminating
[       OK ] Endpoint/SlaveEndpointTest.NoAuthorizer/2 (33 ms)
[----------] 9 tests from Endpoint/SlaveEndpointTest (303 ms total)

[----------] Global test environment tear-down
[==========] 1516 tests from 169 test cases ran. (452997 ms total)
[  PASSED  ] 1515 tests.
[  FAILED  ] 1 test, listed below:
[  FAILED  ] SlaveAuthorizerTest/1.FilterStateEndpoint, where TypeParam = mesos::internal::LocalAuthorizer

 1 FAILED TEST
  YOU HAVE 12 DISABLED TESTS

make[4]: *** [check-local] Error 1
make[4]: Leaving directory `/mesos/mesos-1.3.0/_build/src'
make[3]: *** [check-am] Error 2
make[3]: Leaving directory `/mesos/mesos-1.3.0/_build/src'
make[2]: *** [check] Error 2
make[2]: Leaving directory `/mesos/mesos-1.3.0/_build/src'
make[1]: *** [check-recursive] Error 1
make[1]: Leaving directory `/mesos/mesos-1.3.0/_build'
make: *** [distcheck] Error 1
+ docker rmi mesos-1488961273-17176
Untagged: mesos-1488961273-17176:latest
Deleted: sha256:981e4708487106fc0ad47603989878b19b5e01fc72cbe650276be3127e6a6919
Deleted: sha256:ac868ab213af0eda10dd16a0a7251831d1d1eccd69bf33e3dc5b1c71127c9cb7
Deleted: sha256:84e29513fa6afcb2666c855e1d346ad706b8fc1e00942f487432c4c4fd705123
Deleted: sha256:2a75841a6ddc3d73cc6f7cfd7c71609db335dd2798f186f9fd7428b435842f4d
Deleted: sha256:c584703d47715b4a756714589dce46d7ddb598abd76a513060789b40324c02db
Deleted: sha256:57e74f84696e59634772e1ab15fe2781ce0abf07c60405c9c080dcbb2d01d8a0
Deleted: sha256:707880225a0b9a767f8c46e198e7fb44ab9631065e8ef6445cb349d989f74a78
Deleted: sha256:11cbb48748e83c9e25c38ff355e9cde51def2f8e341d752465519bfe45bb9f90
Deleted: sha256:c26ebb9acaaa66b011d8a6ebc5adaa76f30d3f944c1ad6f3debbf291baabe958
Deleted: sha256:9eeefced11b5df4878b60266d8dd922484668f1cd173172ab19185db633e536d
Deleted: sha256:9db6ac97c65f79456b625d8288fa943478e58812a27a66c5bc0c1847316a9829
Deleted: sha256:a600c6c7fe6febbcff6e7c5dd315df5494328c4e37e7a33da84231f4f4533eff
Deleted: sha256:224b4540fcf48518f5e48710ed2db904aacc7411b3d4ed72febffc0e2113eb95
Deleted: sha256:4382667ae0f06bfb22627880fb0aeafcd4e5d289df8a3d29d02a5112b18314df
Deleted: sha256:b9af1128db954301230fe497b54317bd821e671e11966156eb37c646b9164241
Deleted: sha256:14a853cea5b8d13e137b446d7b8ab410b696a0c48e96b3e3ef83041b510d7c8b
Deleted: sha256:84703be18a67a2ff917545aff34a67d06a00a7b41f16b371c2e16b6413799238
Deleted: sha256:7af6b4ee4a683445a868788091b9546a57d2afd87d2696d72a8d7c03d0a23923
Deleted: sha256:a9132da2d41f178098245f66ab9a512ca97a1d81f7e9315e1b0687e815e88967
Deleted: sha256:7be7355ecb9c8b30ecdbccfa84d6eca1f83aae742be5a4f8dc5041c20d2a76ae
Deleted: sha256:2d937de99611f52a1c8723ca38dfe6b3556ab9452959a32043a01ca2bbb840bb
Deleted: sha256:8c1c268b265521a6dcbc3beac10eb9b2b93da5e116dc7d4678f599b1e5b4f20e
Deleted: sha256:28f66802eb9f5c8ab22e5d3b7300497f3b92667bf5f3105fdce4d2652690a8ae
Deleted: sha256:ff434e0d8ec503241cbd6965bf59b8f99f88ca69c12006afe122cf61b52300ad
Build step 'Execute shell' marked build as failure

Mime
View raw message