mesos-builds mailing list archives

Site index · List index
Message view « Date » · « Thread »
Top « Date » · « Thread »
From Apache Jenkins Server <jenk...@builds.apache.org>
Subject Build failed in Jenkins: Mesos-Reviewbot #17366
Date Thu, 09 Mar 2017 07:26:50 GMT
See <https://builds.apache.org/job/Mesos-Reviewbot/17366/display/redirect>

------------------------------------------
[...truncated 25.70 MB...]
I0309 07:26:21.680732 30434 status_update_manager.cpp:203] Recovering status update manager
I0309 07:26:21.680969 30440 containerizer.cpp:600] Recovering containerizer
I0309 07:26:21.682729 30430 provisioner.cpp:410] Provisioner recovery complete
I0309 07:26:21.683307 30433 slave.cpp:5572] Finished recovery
I0309 07:26:21.683884 30433 slave.cpp:5754] Querying resource estimator for oversubscribable
resources
I0309 07:26:21.684139 30443 slave.cpp:5768] Received oversubscribable resources {} from the
resource estimator
I0309 07:26:21.686697 30441 process.cpp:3705] Handling HTTP event for process 'slave(707)'
with path: '/slave(707)/monitor/statistics.json'
I0309 07:26:21.688035 30443 http.cpp:916] Authorizing principal 'test-principal' to GET the
'/monitor/statistics.json' endpoint
I0309 07:26:21.692250 30439 slave.cpp:808] Agent terminating
[       OK ] Endpoint/SlaveEndpointTest.AuthorizedRequest/1 (32 ms)
[ RUN      ] Endpoint/SlaveEndpointTest.AuthorizedRequest/2
I0309 07:26:21.703550 30409 containerizer.cpp:221] Using isolation: posix/cpu,posix/mem,filesystem/posix,network/cni
W0309 07:26:21.704115 30409 backend.cpp:76] Failed to create 'aufs' backend: AufsBackend requires
root privileges
W0309 07:26:21.704227 30409 backend.cpp:76] Failed to create 'bind' backend: BindBackend requires
root privileges
I0309 07:26:21.704267 30409 provisioner.cpp:249] Using default backend 'copy'
I0309 07:26:21.707464 30442 slave.cpp:215] Mesos agent started on (708)@172.17.0.2:44785
I0309 07:26:21.707501 30442 slave.cpp:216] Flags at startup: --acls="" --appc_simple_discovery_uri_prefix="http://"
--appc_store_dir="/tmp/mesos/store/appc" --authenticate_http_readonly="true" --authenticate_http_readwrite="true"
--authenticatee="crammd5" --authentication_backoff_factor="1secs" --authorizer="local" --cgroups_cpu_enable_pids_and_tids_count="false"
--cgroups_enable_cfs="false" --cgroups_hierarchy="/sys/fs/cgroup" --cgroups_limit_swap="false"
--cgroups_root="mesos" --container_disk_watch_interval="15secs" --containerizers="mesos" --credential="/tmp/Endpoint_SlaveEndpointTest_AuthorizedRequest_2_IT2ctI/credential"
--default_role="*" --disk_watch_interval="1mins" --docker="docker" --docker_kill_orphans="true"
--docker_registry="https://registry-1.docker.io" --docker_remove_delay="6hrs" --docker_socket="/var/run/docker.sock"
--docker_stop_timeout="0ns" --docker_store_dir="/tmp/mesos/store/docker" --docker_volume_checkpoint_dir="/var/run/mesos/isolators/docker/volume"
--enforce_container_disk_quota="false" --executor_registration_timeout="1mins" --executor_shutdown_grace_period="5secs"
--fetcher_cache_dir="/tmp/Endpoint_SlaveEndpointTest_AuthorizedRequest_2_IT2ctI/fetch" --fetcher_cache_size="2GB"
--frameworks_home="" --gc_delay="1weeks" --gc_disk_headroom="0.1" --hadoop_home="" --help="false"
--hostname_lookup="true" --http_authenticators="basic" --http_command_executor="false" --http_credentials="/tmp/Endpoint_SlaveEndpointTest_AuthorizedRequest_2_IT2ctI/http_credentials"
--http_heartbeat_interval="30secs" --initialize_driver_logging="true" --isolation="posix/cpu,posix/mem"
--launcher="posix" --launcher_dir="/mesos/mesos-1.3.0/_build/src" --logbufsecs="0" --logging_level="INFO"
--max_completed_executors_per_framework="150" --oversubscribed_resources_interval="15secs"
--perf_duration="10secs" --perf_interval="1mins" --qos_correction_interval_min="0ns" --quiet="false"
--recover="reconnect" --recovery_timeout="15mins" --registration_backoff_factor="10ms" --resources="cpus:2;gpus:0;mem:1024;disk:1024;ports:[31000-32000]"
--revocable_cpu_low_priority="true" --runtime_dir="/tmp/Endpoint_SlaveEndpointTest_AuthorizedRequest_2_IT2ctI"
--sandbox_directory="/mnt/mesos/sandbox" --strict="true" --switch_user="true" --systemd_enable_support="true"
--systemd_runtime_directory="/run/systemd/system" --version="false" --work_dir="/tmp/Endpoint_SlaveEndpointTest_AuthorizedRequest_2_JBvYqi"
I0309 07:26:21.708140 30442 credentials.hpp:86] Loading credential for authentication from
'/tmp/Endpoint_SlaveEndpointTest_AuthorizedRequest_2_IT2ctI/credential'
I0309 07:26:21.708323 30442 slave.cpp:358] Agent using credential for: test-principal
I0309 07:26:21.708353 30442 credentials.hpp:37] Loading credentials for authentication from
'/tmp/Endpoint_SlaveEndpointTest_AuthorizedRequest_2_IT2ctI/http_credentials'
I0309 07:26:21.708639 30442 http.cpp:964] Using default 'basic' HTTP authenticator for realm
'mesos-agent-readonly'
I0309 07:26:21.708809 30442 http.cpp:964] Using default 'basic' HTTP authenticator for realm
'mesos-agent-readwrite'
I0309 07:26:21.710366 30442 slave.cpp:545] Agent resources: cpus(*):2; mem(*):1024; disk(*):1024;
ports(*):[31000-32000]
I0309 07:26:21.710467 30442 slave.cpp:553] Agent attributes: [  ]
I0309 07:26:21.710484 30442 slave.cpp:558] Agent hostname: 1c47272451d6
I0309 07:26:21.710636 30430 status_update_manager.cpp:177] Pausing sending status updates
I0309 07:26:21.711948 30439 state.cpp:62] Recovering state from '/tmp/Endpoint_SlaveEndpointTest_AuthorizedRequest_2_JBvYqi/meta'
I0309 07:26:21.712281 30443 status_update_manager.cpp:203] Recovering status update manager
I0309 07:26:21.712610 30432 containerizer.cpp:600] Recovering containerizer
I0309 07:26:21.714229 30433 provisioner.cpp:410] Provisioner recovery complete
I0309 07:26:21.714609 30442 slave.cpp:5572] Finished recovery
I0309 07:26:21.715067 30442 slave.cpp:5754] Querying resource estimator for oversubscribable
resources
I0309 07:26:21.715322 30428 slave.cpp:5768] Received oversubscribable resources {} from the
resource estimator
I0309 07:26:21.717619 30442 process.cpp:3705] Handling HTTP event for process 'slave(708)'
with path: '/slave(708)/containers'
I0309 07:26:21.718863 30436 http.cpp:916] Authorizing principal 'test-principal' to GET the
'/containers' endpoint
I0309 07:26:21.722681 30432 slave.cpp:808] Agent terminating
[       OK ] Endpoint/SlaveEndpointTest.AuthorizedRequest/2 (30 ms)
[ RUN      ] Endpoint/SlaveEndpointTest.UnauthorizedRequest/0
I0309 07:26:21.733862 30409 containerizer.cpp:221] Using isolation: posix/cpu,posix/mem,filesystem/posix,network/cni
W0309 07:26:21.734418 30409 backend.cpp:76] Failed to create 'aufs' backend: AufsBackend requires
root privileges
W0309 07:26:21.734526 30409 backend.cpp:76] Failed to create 'bind' backend: BindBackend requires
root privileges
I0309 07:26:21.734575 30409 provisioner.cpp:249] Using default backend 'copy'
I0309 07:26:21.738301 30439 slave.cpp:215] Mesos agent started on (709)@172.17.0.2:44785
I0309 07:26:21.738330 30439 slave.cpp:216] Flags at startup: --acls="" --appc_simple_discovery_uri_prefix="http://"
--appc_store_dir="/tmp/mesos/store/appc" --authenticate_http_readonly="true" --authenticate_http_readwrite="true"
--authenticatee="crammd5" --authentication_backoff_factor="1secs" --authorizer="local" --cgroups_cpu_enable_pids_and_tids_count="false"
--cgroups_enable_cfs="false" --cgroups_hierarchy="/sys/fs/cgroup" --cgroups_limit_swap="false"
--cgroups_root="mesos" --container_disk_watch_interval="15secs" --containerizers="mesos" --credential="/tmp/Endpoint_SlaveEndpointTest_UnauthorizedRequest_0_SaBQSo/credential"
--default_role="*" --disk_watch_interval="1mins" --docker="docker" --docker_kill_orphans="true"
--docker_registry="https://registry-1.docker.io" --docker_remove_delay="6hrs" --docker_socket="/var/run/docker.sock"
--docker_stop_timeout="0ns" --docker_store_dir="/tmp/mesos/store/docker" --docker_volume_checkpoint_dir="/var/run/mesos/isolators/docker/volume"
--enforce_container_disk_quota="false" --executor_registration_timeout="1mins" --executor_shutdown_grace_period="5secs"
--fetcher_cache_dir="/tmp/Endpoint_SlaveEndpointTest_UnauthorizedRequest_0_SaBQSo/fetch" --fetcher_cache_size="2GB"
--frameworks_home="" --gc_delay="1weeks" --gc_disk_headroom="0.1" --hadoop_home="" --help="false"
--hostname_lookup="true" --http_authenticators="basic" --http_command_executor="false" --http_credentials="/tmp/Endpoint_SlaveEndpointTest_UnauthorizedRequest_0_SaBQSo/http_credentials"
--http_heartbeat_interval="30secs" --initialize_driver_logging="true" --isolation="posix/cpu,posix/mem"
--launcher="posix" --launcher_dir="/mesos/mesos-1.3.0/_build/src" --logbufsecs="0" --logging_level="INFO"
--max_completed_executors_per_framework="150" --oversubscribed_resources_interval="15secs"
--perf_duration="10secs" --perf_interval="1mins" --qos_correction_interval_min="0ns" --quiet="false"
--recover="reconnect" --recovery_timeout="15mins" --registration_backoff_factor="10ms" --resources="cpus:2;gpus:0;mem:1024;disk:1024;ports:[31000-32000]"
--revocable_cpu_low_priority="true" --runtime_dir="/tmp/Endpoint_SlaveEndpointTest_UnauthorizedRequest_0_SaBQSo"
--sandbox_directory="/mnt/mesos/sandbox" --strict="true" --switch_user="true" --systemd_enable_support="true"
--systemd_runtime_directory="/run/systemd/system" --version="false" --work_dir="/tmp/Endpoint_SlaveEndpointTest_UnauthorizedRequest_0_putGLY"
I0309 07:26:21.738983 30439 credentials.hpp:86] Loading credential for authentication from
'/tmp/Endpoint_SlaveEndpointTest_UnauthorizedRequest_0_SaBQSo/credential'
I0309 07:26:21.739151 30439 slave.cpp:358] Agent using credential for: test-principal
I0309 07:26:21.739177 30439 credentials.hpp:37] Loading credentials for authentication from
'/tmp/Endpoint_SlaveEndpointTest_UnauthorizedRequest_0_SaBQSo/http_credentials'
I0309 07:26:21.739461 30439 http.cpp:964] Using default 'basic' HTTP authenticator for realm
'mesos-agent-readonly'
I0309 07:26:21.739610 30439 http.cpp:964] Using default 'basic' HTTP authenticator for realm
'mesos-agent-readwrite'
I0309 07:26:21.740881 30439 slave.cpp:545] Agent resources: cpus(*):2; mem(*):1024; disk(*):1024;
ports(*):[31000-32000]
I0309 07:26:21.740964 30439 slave.cpp:553] Agent attributes: [  ]
I0309 07:26:21.740978 30439 slave.cpp:558] Agent hostname: 1c47272451d6
I0309 07:26:21.741106 30432 status_update_manager.cpp:177] Pausing sending status updates
I0309 07:26:21.742282 30432 state.cpp:62] Recovering state from '/tmp/Endpoint_SlaveEndpointTest_UnauthorizedRequest_0_putGLY/meta'
I0309 07:26:21.742552 30435 status_update_manager.cpp:203] Recovering status update manager
I0309 07:26:21.742784 30443 containerizer.cpp:600] Recovering containerizer
I0309 07:26:21.744179 30441 provisioner.cpp:410] Provisioner recovery complete
I0309 07:26:21.744586 30442 slave.cpp:5572] Finished recovery
I0309 07:26:21.745162 30442 slave.cpp:5754] Querying resource estimator for oversubscribable
resources
I0309 07:26:21.745405 30436 slave.cpp:5768] Received oversubscribable resources {} from the
resource estimator
I0309 07:26:21.747726 30438 process.cpp:3705] Handling HTTP event for process 'slave(709)'
with path: '/slave(709)/monitor/statistics'
I0309 07:26:21.748986 30437 http.cpp:916] Authorizing principal 'test-principal' to GET the
'/monitor/statistics' endpoint
I0309 07:26:21.751241 30435 slave.cpp:808] Agent terminating
[       OK ] Endpoint/SlaveEndpointTest.UnauthorizedRequest/0 (28 ms)
[ RUN      ] Endpoint/SlaveEndpointTest.UnauthorizedRequest/1
I0309 07:26:21.761770 30409 containerizer.cpp:221] Using isolation: posix/cpu,posix/mem,filesystem/posix,network/cni
W0309 07:26:21.762207 30409 backend.cpp:76] Failed to create 'aufs' backend: AufsBackend requires
root privileges
W0309 07:26:21.762289 30409 backend.cpp:76] Failed to create 'bind' backend: BindBackend requires
root privileges
I0309 07:26:21.762315 30409 provisioner.cpp:249] Using default backend 'copy'
I0309 07:26:21.765395 30428 slave.cpp:215] Mesos agent started on (710)@172.17.0.2:44785
I0309 07:26:21.765426 30428 slave.cpp:216] Flags at startup: --acls="" --appc_simple_discovery_uri_prefix="http://"
--appc_store_dir="/tmp/mesos/store/appc" --authenticate_http_readonly="true" --authenticate_http_readwrite="true"
--authenticatee="crammd5" --authentication_backoff_factor="1secs" --authorizer="local" --cgroups_cpu_enable_pids_and_tids_count="false"
--cgroups_enable_cfs="false" --cgroups_hierarchy="/sys/fs/cgroup" --cgroups_limit_swap="false"
--cgroups_root="mesos" --container_disk_watch_interval="15secs" --containerizers="mesos" --credential="/tmp/Endpoint_SlaveEndpointTest_UnauthorizedRequest_1_AUi1A5/credential"
--default_role="*" --disk_watch_interval="1mins" --docker="docker" --docker_kill_orphans="true"
--docker_registry="https://registry-1.docker.io" --docker_remove_delay="6hrs" --docker_socket="/var/run/docker.sock"
--docker_stop_timeout="0ns" --docker_store_dir="/tmp/mesos/store/docker" --docker_volume_checkpoint_dir="/var/run/mesos/isolators/docker/volume"
--enforce_container_disk_quota="false" --executor_registration_timeout="1mins" --executor_shutdown_grace_period="5secs"
--fetcher_cache_dir="/tmp/Endpoint_SlaveEndpointTest_UnauthorizedRequest_1_AUi1A5/fetch" --fetcher_cache_size="2GB"
--frameworks_home="" --gc_delay="1weeks" --gc_disk_headroom="0.1" --hadoop_home="" --help="false"
--hostname_lookup="true" --http_authenticators="basic" --http_command_executor="false" --http_credentials="/tmp/Endpoint_SlaveEndpointTest_UnauthorizedRequest_1_AUi1A5/http_credentials"
--http_heartbeat_interval="30secs" --initialize_driver_logging="true" --isolation="posix/cpu,posix/mem"
--launcher="posix" --launcher_dir="/mesos/mesos-1.3.0/_build/src" --logbufsecs="0" --logging_level="INFO"
--max_completed_executors_per_framework="150" --oversubscribed_resources_interval="15secs"
--perf_duration="10secs" --perf_interval="1mins" --qos_correction_interval_min="0ns" --quiet="false"
--recover="reconnect" --recovery_timeout="15mins" --registration_backoff_factor="10ms" --resources="cpus:2;gpus:0;mem:1024;disk:1024;ports:[31000-32000]"
--revocable_cpu_low_priority="true" --runtime_dir="/tmp/Endpoint_SlaveEndpointTest_UnauthorizedRequest_1_AUi1A5"
--sandbox_directory="/mnt/mesos/sandbox" --strict="true" --switch_user="true" --systemd_enable_support="true"
--systemd_runtime_directory="/run/systemd/system" --version="false" --work_dir="/tmp/Endpoint_SlaveEndpointTest_UnauthorizedRequest_1_DdckpF"
I0309 07:26:21.766124 30428 credentials.hpp:86] Loading credential for authentication from
'/tmp/Endpoint_SlaveEndpointTest_UnauthorizedRequest_1_AUi1A5/credential'
I0309 07:26:21.766294 30428 slave.cpp:358] Agent using credential for: test-principal
I0309 07:26:21.766321 30428 credentials.hpp:37] Loading credentials for authentication from
'/tmp/Endpoint_SlaveEndpointTest_UnauthorizedRequest_1_AUi1A5/http_credentials'
I0309 07:26:21.766597 30428 http.cpp:964] Using default 'basic' HTTP authenticator for realm
'mesos-agent-readonly'
I0309 07:26:21.766743 30428 http.cpp:964] Using default 'basic' HTTP authenticator for realm
'mesos-agent-readwrite'
I0309 07:26:21.768275 30428 slave.cpp:545] Agent resources: cpus(*):2; mem(*):1024; disk(*):1024;
ports(*):[31000-32000]
I0309 07:26:21.768381 30428 slave.cpp:553] Agent attributes: [  ]
I0309 07:26:21.768406 30428 slave.cpp:558] Agent hostname: 1c47272451d6
I0309 07:26:21.768559 30438 status_update_manager.cpp:177] Pausing sending status updates
I0309 07:26:21.769911 30441 state.cpp:62] Recovering state from '/tmp/Endpoint_SlaveEndpointTest_UnauthorizedRequest_1_DdckpF/meta'
I0309 07:26:21.770292 30443 status_update_manager.cpp:203] Recovering status update manager
I0309 07:26:21.770525 30428 containerizer.cpp:600] Recovering containerizer
I0309 07:26:21.772073 30433 provisioner.cpp:410] Provisioner recovery complete
I0309 07:26:21.772532 30435 slave.cpp:5572] Finished recovery
I0309 07:26:21.773100 30435 slave.cpp:5754] Querying resource estimator for oversubscribable
resources
I0309 07:26:21.773408 30439 slave.cpp:5768] Received oversubscribable resources {} from the
resource estimator
I0309 07:26:21.775553 30428 process.cpp:3705] Handling HTTP event for process 'slave(710)'
with path: '/slave(710)/monitor/statistics.json'
I0309 07:26:21.777137 30437 http.cpp:916] Authorizing principal 'test-principal' to GET the
'/monitor/statistics.json' endpoint
I0309 07:26:21.779587 30438 slave.cpp:808] Agent terminating
[       OK ] Endpoint/SlaveEndpointTest.UnauthorizedRequest/1 (27 ms)
[ RUN      ] Endpoint/SlaveEndpointTest.UnauthorizedRequest/2
I0309 07:26:21.790663 30409 containerizer.cpp:221] Using isolation: posix/cpu,posix/mem,filesystem/posix,network/cni
W0309 07:26:21.791242 30409 backend.cpp:76] Failed to create 'aufs' backend: AufsBackend requires
root privileges
W0309 07:26:21.791360 30409 backend.cpp:76] Failed to create 'bind' backend: BindBackend requires
root privileges
I0309 07:26:21.791409 30409 provisioner.cpp:249] Using default backend 'copy'
I0309 07:26:21.795262 30434 slave.cpp:215] Mesos agent started on (711)@172.17.0.2:44785
I0309 07:26:21.795295 30434 slave.cpp:216] Flags at startup: --acls="" --appc_simple_discovery_uri_prefix="http://"
--appc_store_dir="/tmp/mesos/store/appc" --authenticate_http_readonly="true" --authenticate_http_readwrite="true"
--authenticatee="crammd5" --authentication_backoff_factor="1secs" --authorizer="local" --cgroups_cpu_enable_pids_and_tids_count="false"
--cgroups_enable_cfs="false" --cgroups_hierarchy="/sys/fs/cgroup" --cgroups_limit_swap="false"
--cgroups_root="mesos" --container_disk_watch_interval="15secs" --containerizers="mesos" --credential="/tmp/Endpoint_SlaveEndpointTest_UnauthorizedRequest_2_YTpABM/credential"
--default_role="*" --disk_watch_interval="1mins" --docker="docker" --docker_kill_orphans="true"
--docker_registry="https://registry-1.docker.io" --docker_remove_delay="6hrs" --docker_socket="/var/run/docker.sock"
--docker_stop_timeout="0ns" --docker_store_dir="/tmp/mesos/store/docker" --docker_volume_checkpoint_dir="/var/run/mesos/isolators/docker/volume"
--enforce_container_disk_quota="false" --executor_registration_timeout="1mins" --executor_shutdown_grace_period="5secs"
--fetcher_cache_dir="/tmp/Endpoint_SlaveEndpointTest_UnauthorizedRequest_2_YTpABM/fetch" --fetcher_cache_size="2GB"
--frameworks_home="" --gc_delay="1weeks" --gc_disk_headroom="0.1" --hadoop_home="" --help="false"
--hostname_lookup="true" --http_authenticators="basic" --http_command_executor="false" --http_credentials="/tmp/Endpoint_SlaveEndpointTest_UnauthorizedRequest_2_YTpABM/http_credentials"
--http_heartbeat_interval="30secs" --initialize_driver_logging="true" --isolation="posix/cpu,posix/mem"
--launcher="posix" --launcher_dir="/mesos/mesos-1.3.0/_build/src" --logbufsecs="0" --logging_level="INFO"
--max_completed_executors_per_framework="150" --oversubscribed_resources_interval="15secs"
--perf_duration="10secs" --perf_interval="1mins" --qos_correction_interval_min="0ns" --quiet="false"
--recover="reconnect" --recovery_timeout="15mins" --registration_backoff_factor="10ms" --resources="cpus:2;gpus:0;mem:1024;disk:1024;ports:[31000-32000]"
--revocable_cpu_low_priority="true" --runtime_dir="/tmp/Endpoint_SlaveEndpointTest_UnauthorizedRequest_2_YTpABM"
--sandbox_directory="/mnt/mesos/sandbox" --strict="true" --switch_user="true" --systemd_enable_support="true"
--systemd_runtime_directory="/run/systemd/system" --version="false" --work_dir="/tmp/Endpoint_SlaveEndpointTest_UnauthorizedRequest_2_PVQelm"
I0309 07:26:21.795959 30434 credentials.hpp:86] Loading credential for authentication from
'/tmp/Endpoint_SlaveEndpointTest_UnauthorizedRequest_2_YTpABM/credential'
I0309 07:26:21.796128 30434 slave.cpp:358] Agent using credential for: test-principal
I0309 07:26:21.796155 30434 credentials.hpp:37] Loading credentials for authentication from
'/tmp/Endpoint_SlaveEndpointTest_UnauthorizedRequest_2_YTpABM/http_credentials'
I0309 07:26:21.796437 30434 http.cpp:964] Using default 'basic' HTTP authenticator for realm
'mesos-agent-readonly'
I0309 07:26:21.796599 30434 http.cpp:964] Using default 'basic' HTTP authenticator for realm
'mesos-agent-readwrite'
I0309 07:26:21.798152 30434 slave.cpp:545] Agent resources: cpus(*):2; mem(*):1024; disk(*):1024;
ports(*):[31000-32000]
I0309 07:26:21.798255 30434 slave.cpp:553] Agent attributes: [  ]
I0309 07:26:21.798274 30434 slave.cpp:558] Agent hostname: 1c47272451d6
I0309 07:26:21.798425 30442 status_update_manager.cpp:177] Pausing sending status updates
I0309 07:26:21.799863 30433 state.cpp:62] Recovering state from '/tmp/Endpoint_SlaveEndpointTest_UnauthorizedRequest_2_PVQelm/meta'
I0309 07:26:21.800276 30442 status_update_manager.cpp:203] Recovering status update manager
I0309 07:26:21.800498 30437 containerizer.cpp:600] Recovering containerizer
I0309 07:26:21.802726 30428 provisioner.cpp:410] Provisioner recovery complete
I0309 07:26:21.803256 30431 slave.cpp:5572] Finished recovery
I0309 07:26:21.803839 30431 slave.cpp:5754] Querying resource estimator for oversubscribable
resources
I0309 07:26:21.804193 30439 slave.cpp:5768] Received oversubscribable resources {} from the
resource estimator
I0309 07:26:21.806664 30435 process.cpp:3705] Handling HTTP event for process 'slave(711)'
with path: '/slave(711)/containers'
I0309 07:26:21.808079 30441 http.cpp:916] Authorizing principal 'test-principal' to GET the
'/containers' endpoint
I0309 07:26:21.810565 30438 slave.cpp:808] Agent terminating
[       OK ] Endpoint/SlaveEndpointTest.UnauthorizedRequest/2 (31 ms)
[ RUN      ] Endpoint/SlaveEndpointTest.NoAuthorizer/0
I0309 07:26:21.821985 30409 containerizer.cpp:221] Using isolation: posix/cpu,posix/mem,filesystem/posix,network/cni
W0309 07:26:21.822463 30409 backend.cpp:76] Failed to create 'aufs' backend: AufsBackend requires
root privileges
W0309 07:26:21.822556 30409 backend.cpp:76] Failed to create 'bind' backend: BindBackend requires
root privileges
I0309 07:26:21.822595 30409 provisioner.cpp:249] Using default backend 'copy'
I0309 07:26:21.824087 30409 cluster.cpp:446] Creating default 'local' authorizer
I0309 07:26:21.825685 30443 slave.cpp:215] Mesos agent started on (712)@172.17.0.2:44785
I0309 07:26:21.825706 30443 slave.cpp:216] Flags at startup: --acls="" --appc_simple_discovery_uri_prefix="http://"
--appc_store_dir="/tmp/mesos/store/appc" --authenticate_http_readonly="true" --authenticate_http_readwrite="true"
--authenticatee="crammd5" --authentication_backoff_factor="1secs" --authorizer="local" --cgroups_cpu_enable_pids_and_tids_count="false"
--cgroups_enable_cfs="false" --cgroups_hierarchy="/sys/fs/cgroup" --cgroups_limit_swap="false"
--cgroups_root="mesos" --container_disk_watch_interval="15secs" --containerizers="mesos" --credential="/tmp/Endpoint_SlaveEndpointTest_NoAuthorizer_0_C4DoWt/credential"
--default_role="*" --disk_watch_interval="1mins" --docker="docker" --docker_kill_orphans="true"
--docker_registry="https://registry-1.docker.io" --docker_remove_delay="6hrs" --docker_socket="/var/run/docker.sock"
--docker_stop_timeout="0ns" --docker_store_dir="/tmp/mesos/store/docker" --docker_volume_checkpoint_dir="/var/run/mesos/isolators/docker/volume"
--enforce_container_disk_quota="false" --executor_registration_timeout="1mins" --executor_shutdown_grace_period="5secs"
--fetcher_cache_dir="/tmp/Endpoint_SlaveEndpointTest_NoAuthorizer_0_C4DoWt/fetch" --fetcher_cache_size="2GB"
--frameworks_home="" --gc_delay="1weeks" --gc_disk_headroom="0.1" --hadoop_home="" --help="false"
--hostname_lookup="true" --http_authenticators="basic" --http_command_executor="false" --http_credentials="/tmp/Endpoint_SlaveEndpointTest_NoAuthorizer_0_C4DoWt/http_credentials"
--http_heartbeat_interval="30secs" --initialize_driver_logging="true" --isolation="posix/cpu,posix/mem"
--launcher="posix" --launcher_dir="/mesos/mesos-1.3.0/_build/src" --logbufsecs="0" --logging_level="INFO"
--max_completed_executors_per_framework="150" --oversubscribed_resources_interval="15secs"
--perf_duration="10secs" --perf_interval="1mins" --qos_correction_interval_min="0ns" --quiet="false"
--recover="reconnect" --recovery_timeout="15mins" --registration_backoff_factor="10ms" --resources="cpus:2;gpus:0;mem:1024;disk:1024;ports:[31000-32000]"
--revocable_cpu_low_priority="true" --runtime_dir="/tmp/Endpoint_SlaveEndpointTest_NoAuthorizer_0_C4DoWt"
--sandbox_directory="/mnt/mesos/sandbox" --strict="true" --switch_user="true" --systemd_enable_support="true"
--systemd_runtime_directory="/run/systemd/system" --version="false" --work_dir="/tmp/Endpoint_SlaveEndpointTest_NoAuthorizer_0_JjGYA3"
I0309 07:26:21.826274 30443 credentials.hpp:86] Loading credential for authentication from
'/tmp/Endpoint_SlaveEndpointTest_NoAuthorizer_0_C4DoWt/credential'
I0309 07:26:21.826418 30443 slave.cpp:358] Agent using credential for: test-principal
I0309 07:26:21.826441 30443 credentials.hpp:37] Loading credentials for authentication from
'/tmp/Endpoint_SlaveEndpointTest_NoAuthorizer_0_C4DoWt/http_credentials'
I0309 07:26:21.826670 30443 http.cpp:964] Using default 'basic' HTTP authenticator for realm
'mesos-agent-readonly'
I0309 07:26:21.826812 30443 http.cpp:964] Using default 'basic' HTTP authenticator for realm
'mesos-agent-readwrite'
I0309 07:26:21.828733 30443 slave.cpp:545] Agent resources: cpus(*):2; mem(*):1024; disk(*):1024;
ports(*):[31000-32000]
I0309 07:26:21.828837 30443 slave.cpp:553] Agent attributes: [  ]
I0309 07:26:21.828855 30443 slave.cpp:558] Agent hostname: 1c47272451d6
I0309 07:26:21.829017 30429 status_update_manager.cpp:177] Pausing sending status updates
I0309 07:26:21.830521 30432 state.cpp:62] Recovering state from '/tmp/Endpoint_SlaveEndpointTest_NoAuthorizer_0_JjGYA3/meta'
I0309 07:26:21.830852 30434 status_update_manager.cpp:203] Recovering status update manager
I0309 07:26:21.831087 30428 containerizer.cpp:600] Recovering containerizer
I0309 07:26:21.832641 30440 provisioner.cpp:410] Provisioner recovery complete
I0309 07:26:21.833123 30436 slave.cpp:5572] Finished recovery
I0309 07:26:21.833708 30436 slave.cpp:5754] Querying resource estimator for oversubscribable
resources
I0309 07:26:21.834051 30440 slave.cpp:5768] Received oversubscribable resources {} from the
resource estimator
I0309 07:26:21.836632 30433 process.cpp:3705] Handling HTTP event for process 'slave(712)'
with path: '/slave(712)/monitor/statistics'
I0309 07:26:21.838043 30443 http.cpp:916] Authorizing principal 'test-principal' to GET the
'/monitor/statistics' endpoint
I0309 07:26:21.841480 30440 slave.cpp:808] Agent terminating
[       OK ] Endpoint/SlaveEndpointTest.NoAuthorizer/0 (30 ms)
[ RUN      ] Endpoint/SlaveEndpointTest.NoAuthorizer/1
I0309 07:26:21.852382 30409 containerizer.cpp:221] Using isolation: posix/cpu,posix/mem,filesystem/posix,network/cni
W0309 07:26:21.852942 30409 backend.cpp:76] Failed to create 'aufs' backend: AufsBackend requires
root privileges
W0309 07:26:21.853054 30409 backend.cpp:76] Failed to create 'bind' backend: BindBackend requires
root privileges
I0309 07:26:21.853092 30409 provisioner.cpp:249] Using default backend 'copy'
I0309 07:26:21.854703 30409 cluster.cpp:446] Creating default 'local' authorizer
I0309 07:26:21.856402 30439 slave.cpp:215] Mesos agent started on (713)@172.17.0.2:44785
I0309 07:26:21.856428 30439 slave.cpp:216] Flags at startup: --acls="" --appc_simple_discovery_uri_prefix="http://"
--appc_store_dir="/tmp/mesos/store/appc" --authenticate_http_readonly="true" --authenticate_http_readwrite="true"
--authenticatee="crammd5" --authentication_backoff_factor="1secs" --authorizer="local" --cgroups_cpu_enable_pids_and_tids_count="false"
--cgroups_enable_cfs="false" --cgroups_hierarchy="/sys/fs/cgroup" --cgroups_limit_swap="false"
--cgroups_root="mesos" --container_disk_watch_interval="15secs" --containerizers="mesos" --credential="/tmp/Endpoint_SlaveEndpointTest_NoAuthorizer_1_U7BTAb/credential"
--default_role="*" --disk_watch_interval="1mins" --docker="docker" --docker_kill_orphans="true"
--docker_registry="https://registry-1.docker.io" --docker_remove_delay="6hrs" --docker_socket="/var/run/docker.sock"
--docker_stop_timeout="0ns" --docker_store_dir="/tmp/mesos/store/docker" --docker_volume_checkpoint_dir="/var/run/mesos/isolators/docker/volume"
--enforce_container_disk_quota="false" --executor_registration_timeout="1mins" --executor_shutdown_grace_period="5secs"
--fetcher_cache_dir="/tmp/Endpoint_SlaveEndpointTest_NoAuthorizer_1_U7BTAb/fetch" --fetcher_cache_size="2GB"
--frameworks_home="" --gc_delay="1weeks" --gc_disk_headroom="0.1" --hadoop_home="" --help="false"
--hostname_lookup="true" --http_authenticators="basic" --http_command_executor="false" --http_credentials="/tmp/Endpoint_SlaveEndpointTest_NoAuthorizer_1_U7BTAb/http_credentials"
--http_heartbeat_interval="30secs" --initialize_driver_logging="true" --isolation="posix/cpu,posix/mem"
--launcher="posix" --launcher_dir="/mesos/mesos-1.3.0/_build/src" --logbufsecs="0" --logging_level="INFO"
--max_completed_executors_per_framework="150" --oversubscribed_resources_interval="15secs"
--perf_duration="10secs" --perf_interval="1mins" --qos_correction_interval_min="0ns" --quiet="false"
--recover="reconnect" --recovery_timeout="15mins" --registration_backoff_factor="10ms" --resources="cpus:2;gpus:0;mem:1024;disk:1024;ports:[31000-32000]"
--revocable_cpu_low_priority="true" --runtime_dir="/tmp/Endpoint_SlaveEndpointTest_NoAuthorizer_1_U7BTAb"
--sandbox_directory="/mnt/mesos/sandbox" --strict="true" --switch_user="true" --systemd_enable_support="true"
--systemd_runtime_directory="/run/systemd/system" --version="false" --work_dir="/tmp/Endpoint_SlaveEndpointTest_NoAuthorizer_1_PFjxaL"
I0309 07:26:21.857053 30439 credentials.hpp:86] Loading credential for authentication from
'/tmp/Endpoint_SlaveEndpointTest_NoAuthorizer_1_U7BTAb/credential'
I0309 07:26:21.857208 30439 slave.cpp:358] Agent using credential for: test-principal
I0309 07:26:21.857242 30439 credentials.hpp:37] Loading credentials for authentication from
'/tmp/Endpoint_SlaveEndpointTest_NoAuthorizer_1_U7BTAb/http_credentials'
I0309 07:26:21.857556 30439 http.cpp:964] Using default 'basic' HTTP authenticator for realm
'mesos-agent-readonly'
I0309 07:26:21.857714 30439 http.cpp:964] Using default 'basic' HTTP authenticator for realm
'mesos-agent-readwrite'
I0309 07:26:21.859309 30439 slave.cpp:545] Agent resources: cpus(*):2; mem(*):1024; disk(*):1024;
ports(*):[31000-32000]
I0309 07:26:21.859411 30439 slave.cpp:553] Agent attributes: [  ]
I0309 07:26:21.859437 30439 slave.cpp:558] Agent hostname: 1c47272451d6
I0309 07:26:21.859628 30432 status_update_manager.cpp:177] Pausing sending status updates
I0309 07:26:21.861030 30442 state.cpp:62] Recovering state from '/tmp/Endpoint_SlaveEndpointTest_NoAuthorizer_1_PFjxaL/meta'
I0309 07:26:21.861404 30429 status_update_manager.cpp:203] Recovering status update manager
I0309 07:26:21.861810 30441 containerizer.cpp:600] Recovering containerizer
I0309 07:26:21.863237 30442 provisioner.cpp:410] Provisioner recovery complete
I0309 07:26:21.863642 30440 slave.cpp:5572] Finished recovery
I0309 07:26:21.864176 30440 slave.cpp:5754] Querying resource estimator for oversubscribable
resources
I0309 07:26:21.864539 30436 slave.cpp:5768] Received oversubscribable resources {} from the
resource estimator
I0309 07:26:21.866945 30433 process.cpp:3705] Handling HTTP event for process 'slave(713)'
with path: '/slave(713)/monitor/statistics.json'
I0309 07:26:21.868618 30434 http.cpp:916] Authorizing principal 'test-principal' to GET the
'/monitor/statistics.json' endpoint
I0309 07:26:21.872253 30429 slave.cpp:808] Agent terminating
[       OK ] Endpoint/SlaveEndpointTest.NoAuthorizer/1 (30 ms)
[ RUN      ] Endpoint/SlaveEndpointTest.NoAuthorizer/2
I0309 07:26:21.883931 30409 containerizer.cpp:221] Using isolation: posix/cpu,posix/mem,filesystem/posix,network/cni
W0309 07:26:21.884551 30409 backend.cpp:76] Failed to create 'aufs' backend: AufsBackend requires
root privileges
W0309 07:26:21.884662 30409 backend.cpp:76] Failed to create 'bind' backend: BindBackend requires
root privileges
I0309 07:26:21.884712 30409 provisioner.cpp:249] Using default backend 'copy'
I0309 07:26:21.886643 30409 cluster.cpp:446] Creating default 'local' authorizer
I0309 07:26:21.888638 30443 slave.cpp:215] Mesos agent started on (714)@172.17.0.2:44785
I0309 07:26:21.888664 30443 slave.cpp:216] Flags at startup: --acls="" --appc_simple_discovery_uri_prefix="http://"
--appc_store_dir="/tmp/mesos/store/appc" --authenticate_http_readonly="true" --authenticate_http_readwrite="true"
--authenticatee="crammd5" --authentication_backoff_factor="1secs" --authorizer="local" --cgroups_cpu_enable_pids_and_tids_count="false"
--cgroups_enable_cfs="false" --cgroups_hierarchy="/sys/fs/cgroup" --cgroups_limit_swap="false"
--cgroups_root="mesos" --container_disk_watch_interval="15secs" --containerizers="mesos" --credential="/tmp/Endpoint_SlaveEndpointTest_NoAuthorizer_2_004FzT/credential"
--default_role="*" --disk_watch_interval="1mins" --docker="docker" --docker_kill_orphans="true"
--docker_registry="https://registry-1.docker.io" --docker_remove_delay="6hrs" --docker_socket="/var/run/docker.sock"
--docker_stop_timeout="0ns" --docker_store_dir="/tmp/mesos/store/docker" --docker_volume_checkpoint_dir="/var/run/mesos/isolators/docker/volume"
--enforce_container_disk_quota="false" --executor_registration_timeout="1mins" --executor_shutdown_grace_period="5secs"
--fetcher_cache_dir="/tmp/Endpoint_SlaveEndpointTest_NoAuthorizer_2_004FzT/fetch" --fetcher_cache_size="2GB"
--frameworks_home="" --gc_delay="1weeks" --gc_disk_headroom="0.1" --hadoop_home="" --help="false"
--hostname_lookup="true" --http_authenticators="basic" --http_command_executor="false" --http_credentials="/tmp/Endpoint_SlaveEndpointTest_NoAuthorizer_2_004FzT/http_credentials"
--http_heartbeat_interval="30secs" --initialize_driver_logging="true" --isolation="posix/cpu,posix/mem"
--launcher="posix" --launcher_dir="/mesos/mesos-1.3.0/_build/src" --logbufsecs="0" --logging_level="INFO"
--max_completed_executors_per_framework="150" --oversubscribed_resources_interval="15secs"
--perf_duration="10secs" --perf_interval="1mins" --qos_correction_interval_min="0ns" --quiet="false"
--recover="reconnect" --recovery_timeout="15mins" --registration_backoff_factor="10ms" --resources="cpus:2;gpus:0;mem:1024;disk:1024;ports:[31000-32000]"
--revocable_cpu_low_priority="true" --runtime_dir="/tmp/Endpoint_SlaveEndpointTest_NoAuthorizer_2_004FzT"
--sandbox_directory="/mnt/mesos/sandbox" --strict="true" --switch_user="true" --systemd_enable_support="true"
--systemd_runtime_directory="/run/systemd/system" --version="false" --work_dir="/tmp/Endpoint_SlaveEndpointTest_NoAuthorizer_2_3sQc4s"
I0309 07:26:21.889264 30443 credentials.hpp:86] Loading credential for authentication from
'/tmp/Endpoint_SlaveEndpointTest_NoAuthorizer_2_004FzT/credential'
I0309 07:26:21.889432 30443 slave.cpp:358] Agent using credential for: test-principal
I0309 07:26:21.889458 30443 credentials.hpp:37] Loading credentials for authentication from
'/tmp/Endpoint_SlaveEndpointTest_NoAuthorizer_2_004FzT/http_credentials'
I0309 07:26:21.889751 30443 http.cpp:964] Using default 'basic' HTTP authenticator for realm
'mesos-agent-readonly'
I0309 07:26:21.889900 30443 http.cpp:964] Using default 'basic' HTTP authenticator for realm
'mesos-agent-readwrite'
I0309 07:26:21.891703 30443 slave.cpp:545] Agent resources: cpus(*):2; mem(*):1024; disk(*):1024;
ports(*):[31000-32000]
I0309 07:26:21.891810 30443 slave.cpp:553] Agent attributes: [  ]
I0309 07:26:21.891835 30443 slave.cpp:558] Agent hostname: 1c47272451d6
I0309 07:26:21.892045 30432 status_update_manager.cpp:177] Pausing sending status updates
I0309 07:26:21.893250 30429 state.cpp:62] Recovering state from '/tmp/Endpoint_SlaveEndpointTest_NoAuthorizer_2_3sQc4s/meta'
I0309 07:26:21.893651 30436 status_update_manager.cpp:203] Recovering status update manager
I0309 07:26:21.893997 30430 containerizer.cpp:600] Recovering containerizer
I0309 07:26:21.895792 30433 provisioner.cpp:410] Provisioner recovery complete
I0309 07:26:21.896322 30443 slave.cpp:5572] Finished recovery
I0309 07:26:21.896829 30443 slave.cpp:5754] Querying resource estimator for oversubscribable
resources
I0309 07:26:21.897220 30432 slave.cpp:5768] Received oversubscribable resources {} from the
resource estimator
I0309 07:26:21.899844 30435 process.cpp:3705] Handling HTTP event for process 'slave(714)'
with path: '/slave(714)/containers'
I0309 07:26:21.901446 30438 http.cpp:916] Authorizing principal 'test-principal' to GET the
'/containers' endpoint
I0309 07:26:21.905885 30434 slave.cpp:808] Agent terminating
[       OK ] Endpoint/SlaveEndpointTest.NoAuthorizer/2 (33 ms)
[----------] 9 tests from Endpoint/SlaveEndpointTest (279 ms total)

[----------] Global test environment tear-down
[==========] 1516 tests from 169 test cases ran. (571353 ms total)
[  PASSED  ] 1515 tests.
[  FAILED  ] 1 test, listed below:
[  FAILED  ] MasterTest.LaunchAcrossSlavesDropped

 1 FAILED TEST
  YOU HAVE 12 DISABLED TESTS

make[4]: *** [check-local] Error 1
make[4]: Leaving directory `/mesos/mesos-1.3.0/_build/src'
make[3]: *** [check-am] Error 2
make[3]: Leaving directory `/mesos/mesos-1.3.0/_build/src'
make[2]: *** [check] Error 2
make[2]: Leaving directory `/mesos/mesos-1.3.0/_build/src'
make[1]: *** [check-recursive] Error 1
make[1]: Leaving directory `/mesos/mesos-1.3.0/_build'
make: *** [distcheck] Error 1
+ docker rmi mesos-1489041596-1947
Untagged: mesos-1489041596-1947:latest
Deleted: sha256:9402dae9ce26e2551d8f657412285887e152c57b636159153c69da405b74276e
Deleted: sha256:8fd61c05360a380b29eba3be4d1c6f59ed9a84e592a04c793e9f7e2ebe6445db
Deleted: sha256:4042dec8ea6b3a69ecc22b49694bea9dd49255cc1ea6db78beb5989d68925400
Deleted: sha256:42870d44d2a86cae753f1591ac8a12db340f8eabbf78aac7a763edcab0ef9bcc
Deleted: sha256:2e7aefa09f05fd5038b47e878e84f4a6c4d48c7e02529dd9351b9d65c2003852
Deleted: sha256:a535cba91d95494d1f94882922eb595dd49eb4ca26af427d14946cd6355953f0
Deleted: sha256:022d2d7e18914ce623942e197b2eabaa80c3618bb453ec68ecfc737be12b7588
Deleted: sha256:3b7bc2745d40b38dc9f1a750ce5be1567ddd9a23c3189db591326d496c333c41
Deleted: sha256:503cfaeb5f38634983e226ef22c8ccd750770c223b2ad23b87b9e035ada4736f
Deleted: sha256:5476679ddf122ad7b94d9bc9eba2f26314f938969eaede6aba41e84a095e3d52
Deleted: sha256:71fe1a59d1a9605c58cfce504656c4b94bcbf5989e1579c00ffd9ea497773c23
Deleted: sha256:618aa588539a3c60639e96dfc0238656f196ef5fd488d1eb470f3bd54116afa0
Deleted: sha256:90c6d5ee6fa25f41ce454cb8129939c5d3b2f784e152684b1072d3e5e306b97a
Deleted: sha256:38faffdacc2b385c6dd56436fc9aacaa9eb051db1f350c5dda684c6c5d873a78
Deleted: sha256:88eea683f96115801b51a7115a576573f2757533a3c318502ce07a81cbf801ef
Deleted: sha256:1cce3f01e2605dad98a92e8934a46ab33db0394baafd59934d63003c481fbf4a
Deleted: sha256:fa1db79a44f4dd3fb4437a8344e353ebeebdbc8dafd4cde045364466f05c6b3b
Deleted: sha256:e29d363eaa7664f63fd2c225df389bd9c40740072b4f1f764514e0d9f7b39a08
Deleted: sha256:e17b697c3b8b6576266ae721811151486f4eab036aab6488df9b16ae051b547c
Deleted: sha256:20c72a1317755332747dfd77bfc6f2071b14bbf4f86cc5d14c41fa12b7d373c4
Deleted: sha256:531b0b49bccfc37f6038c1739905321d81a392c429c407e2985f78049e673d1c
Deleted: sha256:3f32b5919c57590f7a24d652dc4fd92f70d524b12590c555764858052c919d53
Deleted: sha256:2a6aa8ac678cac32ff6435567e79bf55741345024172de28a9a03e951d69af43
Deleted: sha256:3dfd2eac4a3cc0f882d134fa2336362e76e17dc2c027b9aaee064a6525dbf5e8
Build step 'Execute shell' marked build as failure

Mime
View raw message