mesos-builds mailing list archives

Site index · List index
Message view « Date » · « Thread »
Top « Date » · « Thread »
From Apache Jenkins Server <jenk...@builds.apache.org>
Subject Build failed in Jenkins: Mesos-Buildbot » cmake,gcc,--verbose,GLOG_v=1 MESOS_VERBOSE=1,centos:7,(docker||Hadoop)&&(!ubuntu-us1)&&(!ubuntu-eu2) #3349
Date Wed, 08 Mar 2017 15:30:01 GMT
See <https://builds.apache.org/job/Mesos-Buildbot/BUILDTOOL=cmake,COMPILER=gcc,CONFIGURATION=--verbose,ENVIRONMENT=GLOG_v=1%20MESOS_VERBOSE=1,OS=centos%3A7,label_exp=(docker%7C%7CHadoop)&&(!ubuntu-us1)&&(!ubuntu-eu2)/3349/display/redirect?page=changes>

Changes:

[toenshoff] Removed unused lambda captures.

------------------------------------------
[...truncated 23.47 MB...]
I0308 15:29:33.080593 24419 provisioner.cpp:410] Provisioner recovery complete
I0308 15:29:33.080806 24430 slave.cpp:5572] Finished recovery
I0308 15:29:33.081189 24430 slave.cpp:5754] Querying resource estimator for oversubscribable
resources
I0308 15:29:33.081333 24432 slave.cpp:5768] Received oversubscribable resources {} from the
resource estimator
I0308 15:29:33.082176 24432 process.cpp:3705] Handling HTTP event for process 'slave(702)'
with path: '/slave(702)/monitor/statistics.json'
I0308 15:29:33.082777 24429 http.cpp:916] Authorizing principal 'test-principal' to GET the
'/monitor/statistics.json' endpoint
I0308 15:29:33.084511 24417 slave.cpp:808] Agent terminating
[       OK ] Endpoint/SlaveEndpointTest.AuthorizedRequest/1 (14 ms)
[ RUN      ] Endpoint/SlaveEndpointTest.AuthorizedRequest/2
I0308 15:29:33.090770 24416 containerizer.cpp:221] Using isolation: posix/cpu,posix/mem,filesystem/posix,network/cni
W0308 15:29:33.091095 24416 backend.cpp:76] Failed to create 'aufs' backend: AufsBackend requires
root privileges
W0308 15:29:33.091137 24416 backend.cpp:76] Failed to create 'bind' backend: BindBackend requires
root privileges
I0308 15:29:33.091151 24416 provisioner.cpp:249] Using default backend 'copy'
I0308 15:29:33.092532 24425 slave.cpp:215] Mesos agent started on (703)@172.17.0.3:45838
I0308 15:29:33.092558 24425 slave.cpp:216] Flags at startup: --acls="" --appc_simple_discovery_uri_prefix="http://"
--appc_store_dir="/tmp/mesos/store/appc" --authenticate_http_readonly="true" --authenticate_http_readwrite="true"
--authenticatee="crammd5" --authentication_backoff_factor="1secs" --authorizer="local" --cgroups_cpu_enable_pids_and_tids_count="false"
--cgroups_enable_cfs="false" --cgroups_hierarchy="/sys/fs/cgroup" --cgroups_limit_swap="false"
--cgroups_root="mesos" --container_disk_watch_interval="15secs" --containerizers="mesos" --credential="/tmp/Endpoint_SlaveEndpointTest_AuthorizedRequest_2_QqL7aP/credential"
--default_role="*" --disk_watch_interval="1mins" --docker="docker" --docker_kill_orphans="true"
--docker_registry="https://registry-1.docker.io" --docker_remove_delay="6hrs" --docker_socket="/var/run/docker.sock"
--docker_stop_timeout="0ns" --docker_store_dir="/tmp/mesos/store/docker" --docker_volume_checkpoint_dir="/var/run/mesos/isolators/docker/volume"
--enforce_container_disk_quota="false" --executor_registration_timeout="1mins" --executor_shutdown_grace_period="5secs"
--fetcher_cache_dir="/tmp/Endpoint_SlaveEndpointTest_AuthorizedRequest_2_QqL7aP/fetch" --fetcher_cache_size="2GB"
--frameworks_home="" --gc_delay="1weeks" --gc_disk_headroom="0.1" --hadoop_home="" --help="false"
--hostname_lookup="true" --http_authenticators="basic" --http_command_executor="false" --http_credentials="/tmp/Endpoint_SlaveEndpointTest_AuthorizedRequest_2_QqL7aP/http_credentials"
--http_heartbeat_interval="30secs" --initialize_driver_logging="true" --isolation="posix/cpu,posix/mem"
--launcher="posix" --launcher_dir="/mesos/build/src" --logbufsecs="0" --logging_level="INFO"
--max_completed_executors_per_framework="150" --oversubscribed_resources_interval="15secs"
--perf_duration="10secs" --perf_interval="1mins" --qos_correction_interval_min="0ns" --quiet="false"
--recover="reconnect" --recovery_timeout="15mins" --registration_backoff_factor="10ms" --resources="cpus:2;gpus:0;mem:1024;disk:1024;ports:[31000-32000]"
--revocable_cpu_low_priority="true" --runtime_dir="/tmp/Endpoint_SlaveEndpointTest_AuthorizedRequest_2_QqL7aP"
--sandbox_directory="/mnt/mesos/sandbox" --strict="true" --switch_user="true" --systemd_enable_support="true"
--systemd_runtime_directory="/run/systemd/system" --version="false" --work_dir="/tmp/Endpoint_SlaveEndpointTest_AuthorizedRequest_2_SPTn4a"
I0308 15:29:33.092957 24425 credentials.hpp:86] Loading credential for authentication from
'/tmp/Endpoint_SlaveEndpointTest_AuthorizedRequest_2_QqL7aP/credential'
I0308 15:29:33.093050 24425 slave.cpp:358] Agent using credential for: test-principal
I0308 15:29:33.093065 24425 credentials.hpp:37] Loading credentials for authentication from
'/tmp/Endpoint_SlaveEndpointTest_AuthorizedRequest_2_QqL7aP/http_credentials'
I0308 15:29:33.093173 24425 http.cpp:964] Using default 'basic' HTTP authenticator for realm
'mesos-agent-readonly'
I0308 15:29:33.093228 24425 http.cpp:964] Using default 'basic' HTTP authenticator for realm
'mesos-agent-readwrite'
I0308 15:29:33.093691 24425 slave.cpp:545] Agent resources: cpus(*):2; mem(*):1024; disk(*):1024;
ports(*):[31000-32000]
I0308 15:29:33.093791 24425 slave.cpp:553] Agent attributes: [  ]
I0308 15:29:33.093807 24425 slave.cpp:558] Agent hostname: ffa651cda12b
I0308 15:29:33.093924 24427 status_update_manager.cpp:177] Pausing sending status updates
I0308 15:29:33.094348 24426 state.cpp:62] Recovering state from '/tmp/Endpoint_SlaveEndpointTest_AuthorizedRequest_2_SPTn4a/meta'
I0308 15:29:33.094488 24426 status_update_manager.cpp:203] Recovering status update manager
I0308 15:29:33.094704 24425 containerizer.cpp:600] Recovering containerizer
I0308 15:29:33.095553 24422 provisioner.cpp:410] Provisioner recovery complete
I0308 15:29:33.095759 24428 slave.cpp:5572] Finished recovery
I0308 15:29:33.096146 24428 slave.cpp:5754] Querying resource estimator for oversubscribable
resources
I0308 15:29:33.096267 24419 slave.cpp:5768] Received oversubscribable resources {} from the
resource estimator
I0308 15:29:33.096948 24417 process.cpp:3705] Handling HTTP event for process 'slave(703)'
with path: '/slave(703)/containers'
I0308 15:29:33.097445 24421 http.cpp:916] Authorizing principal 'test-principal' to GET the
'/containers' endpoint
I0308 15:29:33.099069 24418 slave.cpp:808] Agent terminating
[       OK ] Endpoint/SlaveEndpointTest.AuthorizedRequest/2 (13 ms)
[ RUN      ] Endpoint/SlaveEndpointTest.UnauthorizedRequest/0
I0308 15:29:33.104766 24416 containerizer.cpp:221] Using isolation: posix/cpu,posix/mem,filesystem/posix,network/cni
W0308 15:29:33.105090 24416 backend.cpp:76] Failed to create 'aufs' backend: AufsBackend requires
root privileges
W0308 15:29:33.105134 24416 backend.cpp:76] Failed to create 'bind' backend: BindBackend requires
root privileges
I0308 15:29:33.105147 24416 provisioner.cpp:249] Using default backend 'copy'
I0308 15:29:33.106513 24427 slave.cpp:215] Mesos agent started on (704)@172.17.0.3:45838
I0308 15:29:33.106534 24427 slave.cpp:216] Flags at startup: --acls="" --appc_simple_discovery_uri_prefix="http://"
--appc_store_dir="/tmp/mesos/store/appc" --authenticate_http_readonly="true" --authenticate_http_readwrite="true"
--authenticatee="crammd5" --authentication_backoff_factor="1secs" --authorizer="local" --cgroups_cpu_enable_pids_and_tids_count="false"
--cgroups_enable_cfs="false" --cgroups_hierarchy="/sys/fs/cgroup" --cgroups_limit_swap="false"
--cgroups_root="mesos" --container_disk_watch_interval="15secs" --containerizers="mesos" --credential="/tmp/Endpoint_SlaveEndpointTest_UnauthorizedRequest_0_rxdSJp/credential"
--default_role="*" --disk_watch_interval="1mins" --docker="docker" --docker_kill_orphans="true"
--docker_registry="https://registry-1.docker.io" --docker_remove_delay="6hrs" --docker_socket="/var/run/docker.sock"
--docker_stop_timeout="0ns" --docker_store_dir="/tmp/mesos/store/docker" --docker_volume_checkpoint_dir="/var/run/mesos/isolators/docker/volume"
--enforce_container_disk_quota="false" --executor_registration_timeout="1mins" --executor_shutdown_grace_period="5secs"
--fetcher_cache_dir="/tmp/Endpoint_SlaveEndpointTest_UnauthorizedRequest_0_rxdSJp/fetch" --fetcher_cache_size="2GB"
--frameworks_home="" --gc_delay="1weeks" --gc_disk_headroom="0.1" --hadoop_home="" --help="false"
--hostname_lookup="true" --http_authenticators="basic" --http_command_executor="false" --http_credentials="/tmp/Endpoint_SlaveEndpointTest_UnauthorizedRequest_0_rxdSJp/http_credentials"
--http_heartbeat_interval="30secs" --initialize_driver_logging="true" --isolation="posix/cpu,posix/mem"
--launcher="posix" --launcher_dir="/mesos/build/src" --logbufsecs="0" --logging_level="INFO"
--max_completed_executors_per_framework="150" --oversubscribed_resources_interval="15secs"
--perf_duration="10secs" --perf_interval="1mins" --qos_correction_interval_min="0ns" --quiet="false"
--recover="reconnect" --recovery_timeout="15mins" --registration_backoff_factor="10ms" --resources="cpus:2;gpus:0;mem:1024;disk:1024;ports:[31000-32000]"
--revocable_cpu_low_priority="true" --runtime_dir="/tmp/Endpoint_SlaveEndpointTest_UnauthorizedRequest_0_rxdSJp"
--sandbox_directory="/mnt/mesos/sandbox" --strict="true" --switch_user="true" --systemd_enable_support="true"
--systemd_runtime_directory="/run/systemd/system" --version="false" --work_dir="/tmp/Endpoint_SlaveEndpointTest_UnauthorizedRequest_0_vD4PAL"
I0308 15:29:33.106911 24427 credentials.hpp:86] Loading credential for authentication from
'/tmp/Endpoint_SlaveEndpointTest_UnauthorizedRequest_0_rxdSJp/credential'
I0308 15:29:33.107025 24427 slave.cpp:358] Agent using credential for: test-principal
I0308 15:29:33.107053 24427 credentials.hpp:37] Loading credentials for authentication from
'/tmp/Endpoint_SlaveEndpointTest_UnauthorizedRequest_0_rxdSJp/http_credentials'
I0308 15:29:33.107194 24427 http.cpp:964] Using default 'basic' HTTP authenticator for realm
'mesos-agent-readonly'
I0308 15:29:33.107247 24427 http.cpp:964] Using default 'basic' HTTP authenticator for realm
'mesos-agent-readwrite'
I0308 15:29:33.107728 24427 slave.cpp:545] Agent resources: cpus(*):2; mem(*):1024; disk(*):1024;
ports(*):[31000-32000]
I0308 15:29:33.107770 24427 slave.cpp:553] Agent attributes: [  ]
I0308 15:29:33.107777 24427 slave.cpp:558] Agent hostname: ffa651cda12b
I0308 15:29:33.107885 24424 status_update_manager.cpp:177] Pausing sending status updates
I0308 15:29:33.108294 24430 state.cpp:62] Recovering state from '/tmp/Endpoint_SlaveEndpointTest_UnauthorizedRequest_0_vD4PAL/meta'
I0308 15:29:33.108631 24418 status_update_manager.cpp:203] Recovering status update manager
I0308 15:29:33.108830 24432 containerizer.cpp:600] Recovering containerizer
I0308 15:29:33.109550 24425 provisioner.cpp:410] Provisioner recovery complete
I0308 15:29:33.109899 24430 slave.cpp:5572] Finished recovery
I0308 15:29:33.110303 24430 slave.cpp:5754] Querying resource estimator for oversubscribable
resources
I0308 15:29:33.110476 24429 slave.cpp:5768] Received oversubscribable resources {} from the
resource estimator
I0308 15:29:33.111310 24426 process.cpp:3705] Handling HTTP event for process 'slave(704)'
with path: '/slave(704)/monitor/statistics'
I0308 15:29:33.111876 24430 http.cpp:916] Authorizing principal 'test-principal' to GET the
'/monitor/statistics' endpoint
I0308 15:29:33.113407 24417 slave.cpp:808] Agent terminating
[       OK ] Endpoint/SlaveEndpointTest.UnauthorizedRequest/0 (14 ms)
[ RUN      ] Endpoint/SlaveEndpointTest.UnauthorizedRequest/1
I0308 15:29:33.119144 24416 containerizer.cpp:221] Using isolation: posix/cpu,posix/mem,filesystem/posix,network/cni
W0308 15:29:33.119485 24416 backend.cpp:76] Failed to create 'aufs' backend: AufsBackend requires
root privileges
W0308 15:29:33.119530 24416 backend.cpp:76] Failed to create 'bind' backend: BindBackend requires
root privileges
I0308 15:29:33.119547 24416 provisioner.cpp:249] Using default backend 'copy'
I0308 15:29:33.120653 24424 slave.cpp:215] Mesos agent started on (705)@172.17.0.3:45838
I0308 15:29:33.120673 24424 slave.cpp:216] Flags at startup: --acls="" --appc_simple_discovery_uri_prefix="http://"
--appc_store_dir="/tmp/mesos/store/appc" --authenticate_http_readonly="true" --authenticate_http_readwrite="true"
--authenticatee="crammd5" --authentication_backoff_factor="1secs" --authorizer="local" --cgroups_cpu_enable_pids_and_tids_count="false"
--cgroups_enable_cfs="false" --cgroups_hierarchy="/sys/fs/cgroup" --cgroups_limit_swap="false"
--cgroups_root="mesos" --container_disk_watch_interval="15secs" --containerizers="mesos" --credential="/tmp/Endpoint_SlaveEndpointTest_UnauthorizedRequest_1_ZpYTr0/credential"
--default_role="*" --disk_watch_interval="1mins" --docker="docker" --docker_kill_orphans="true"
--docker_registry="https://registry-1.docker.io" --docker_remove_delay="6hrs" --docker_socket="/var/run/docker.sock"
--docker_stop_timeout="0ns" --docker_store_dir="/tmp/mesos/store/docker" --docker_volume_checkpoint_dir="/var/run/mesos/isolators/docker/volume"
--enforce_container_disk_quota="false" --executor_registration_timeout="1mins" --executor_shutdown_grace_period="5secs"
--fetcher_cache_dir="/tmp/Endpoint_SlaveEndpointTest_UnauthorizedRequest_1_ZpYTr0/fetch" --fetcher_cache_size="2GB"
--frameworks_home="" --gc_delay="1weeks" --gc_disk_headroom="0.1" --hadoop_home="" --help="false"
--hostname_lookup="true" --http_authenticators="basic" --http_command_executor="false" --http_credentials="/tmp/Endpoint_SlaveEndpointTest_UnauthorizedRequest_1_ZpYTr0/http_credentials"
--http_heartbeat_interval="30secs" --initialize_driver_logging="true" --isolation="posix/cpu,posix/mem"
--launcher="posix" --launcher_dir="/mesos/build/src" --logbufsecs="0" --logging_level="INFO"
--max_completed_executors_per_framework="150" --oversubscribed_resources_interval="15secs"
--perf_duration="10secs" --perf_interval="1mins" --qos_correction_interval_min="0ns" --quiet="false"
--recover="reconnect" --recovery_timeout="15mins" --registration_backoff_factor="10ms" --resources="cpus:2;gpus:0;mem:1024;disk:1024;ports:[31000-32000]"
--revocable_cpu_low_priority="true" --runtime_dir="/tmp/Endpoint_SlaveEndpointTest_UnauthorizedRequest_1_ZpYTr0"
--sandbox_directory="/mnt/mesos/sandbox" --strict="true" --switch_user="true" --systemd_enable_support="true"
--systemd_runtime_directory="/run/systemd/system" --version="false" --work_dir="/tmp/Endpoint_SlaveEndpointTest_UnauthorizedRequest_1_hjqxgm"
I0308 15:29:33.121115 24424 credentials.hpp:86] Loading credential for authentication from
'/tmp/Endpoint_SlaveEndpointTest_UnauthorizedRequest_1_ZpYTr0/credential'
I0308 15:29:33.121206 24424 slave.cpp:358] Agent using credential for: test-principal
I0308 15:29:33.121222 24424 credentials.hpp:37] Loading credentials for authentication from
'/tmp/Endpoint_SlaveEndpointTest_UnauthorizedRequest_1_ZpYTr0/http_credentials'
I0308 15:29:33.121330 24424 http.cpp:964] Using default 'basic' HTTP authenticator for realm
'mesos-agent-readonly'
I0308 15:29:33.121381 24424 http.cpp:964] Using default 'basic' HTTP authenticator for realm
'mesos-agent-readwrite'
I0308 15:29:33.121879 24424 slave.cpp:545] Agent resources: cpus(*):2; mem(*):1024; disk(*):1024;
ports(*):[31000-32000]
I0308 15:29:33.121922 24424 slave.cpp:553] Agent attributes: [  ]
I0308 15:29:33.121930 24424 slave.cpp:558] Agent hostname: ffa651cda12b
I0308 15:29:33.121999 24429 status_update_manager.cpp:177] Pausing sending status updates
I0308 15:29:33.122318 24430 state.cpp:62] Recovering state from '/tmp/Endpoint_SlaveEndpointTest_UnauthorizedRequest_1_hjqxgm/meta'
I0308 15:29:33.122570 24431 status_update_manager.cpp:203] Recovering status update manager
I0308 15:29:33.122789 24419 containerizer.cpp:600] Recovering containerizer
I0308 15:29:33.123425 24425 provisioner.cpp:410] Provisioner recovery complete
I0308 15:29:33.123697 24419 slave.cpp:5572] Finished recovery
I0308 15:29:33.124119 24419 slave.cpp:5754] Querying resource estimator for oversubscribable
resources
I0308 15:29:33.124300 24424 slave.cpp:5768] Received oversubscribable resources {} from the
resource estimator
I0308 15:29:33.125124 24418 process.cpp:3705] Handling HTTP event for process 'slave(705)'
with path: '/slave(705)/monitor/statistics.json'
I0308 15:29:33.125608 24427 http.cpp:916] Authorizing principal 'test-principal' to GET the
'/monitor/statistics.json' endpoint
I0308 15:29:33.126935 24419 slave.cpp:808] Agent terminating
[       OK ] Endpoint/SlaveEndpointTest.UnauthorizedRequest/1 (14 ms)
[ RUN      ] Endpoint/SlaveEndpointTest.UnauthorizedRequest/2
I0308 15:29:33.132886 24416 containerizer.cpp:221] Using isolation: posix/cpu,posix/mem,filesystem/posix,network/cni
W0308 15:29:33.133230 24416 backend.cpp:76] Failed to create 'aufs' backend: AufsBackend requires
root privileges
W0308 15:29:33.133275 24416 backend.cpp:76] Failed to create 'bind' backend: BindBackend requires
root privileges
I0308 15:29:33.133288 24416 provisioner.cpp:249] Using default backend 'copy'
I0308 15:29:33.134485 24422 slave.cpp:215] Mesos agent started on (706)@172.17.0.3:45838
I0308 15:29:33.134505 24422 slave.cpp:216] Flags at startup: --acls="" --appc_simple_discovery_uri_prefix="http://"
--appc_store_dir="/tmp/mesos/store/appc" --authenticate_http_readonly="true" --authenticate_http_readwrite="true"
--authenticatee="crammd5" --authentication_backoff_factor="1secs" --authorizer="local" --cgroups_cpu_enable_pids_and_tids_count="false"
--cgroups_enable_cfs="false" --cgroups_hierarchy="/sys/fs/cgroup" --cgroups_limit_swap="false"
--cgroups_root="mesos" --container_disk_watch_interval="15secs" --containerizers="mesos" --credential="/tmp/Endpoint_SlaveEndpointTest_UnauthorizedRequest_2_ZtPSiB/credential"
--default_role="*" --disk_watch_interval="1mins" --docker="docker" --docker_kill_orphans="true"
--docker_registry="https://registry-1.docker.io" --docker_remove_delay="6hrs" --docker_socket="/var/run/docker.sock"
--docker_stop_timeout="0ns" --docker_store_dir="/tmp/mesos/store/docker" --docker_volume_checkpoint_dir="/var/run/mesos/isolators/docker/volume"
--enforce_container_disk_quota="false" --executor_registration_timeout="1mins" --executor_shutdown_grace_period="5secs"
--fetcher_cache_dir="/tmp/Endpoint_SlaveEndpointTest_UnauthorizedRequest_2_ZtPSiB/fetch" --fetcher_cache_size="2GB"
--frameworks_home="" --gc_delay="1weeks" --gc_disk_headroom="0.1" --hadoop_home="" --help="false"
--hostname_lookup="true" --http_authenticators="basic" --http_command_executor="false" --http_credentials="/tmp/Endpoint_SlaveEndpointTest_UnauthorizedRequest_2_ZtPSiB/http_credentials"
--http_heartbeat_interval="30secs" --initialize_driver_logging="true" --isolation="posix/cpu,posix/mem"
--launcher="posix" --launcher_dir="/mesos/build/src" --logbufsecs="0" --logging_level="INFO"
--max_completed_executors_per_framework="150" --oversubscribed_resources_interval="15secs"
--perf_duration="10secs" --perf_interval="1mins" --qos_correction_interval_min="0ns" --quiet="false"
--recover="reconnect" --recovery_timeout="15mins" --registration_backoff_factor="10ms" --resources="cpus:2;gpus:0;mem:1024;disk:1024;ports:[31000-32000]"
--revocable_cpu_low_priority="true" --runtime_dir="/tmp/Endpoint_SlaveEndpointTest_UnauthorizedRequest_2_ZtPSiB"
--sandbox_directory="/mnt/mesos/sandbox" --strict="true" --switch_user="true" --systemd_enable_support="true"
--systemd_runtime_directory="/run/systemd/system" --version="false" --work_dir="/tmp/Endpoint_SlaveEndpointTest_UnauthorizedRequest_2_vnCh5W"
I0308 15:29:33.134902 24422 credentials.hpp:86] Loading credential for authentication from
'/tmp/Endpoint_SlaveEndpointTest_UnauthorizedRequest_2_ZtPSiB/credential'
I0308 15:29:33.135001 24422 slave.cpp:358] Agent using credential for: test-principal
I0308 15:29:33.135016 24422 credentials.hpp:37] Loading credentials for authentication from
'/tmp/Endpoint_SlaveEndpointTest_UnauthorizedRequest_2_ZtPSiB/http_credentials'
I0308 15:29:33.135128 24422 http.cpp:964] Using default 'basic' HTTP authenticator for realm
'mesos-agent-readonly'
I0308 15:29:33.135179 24422 http.cpp:964] Using default 'basic' HTTP authenticator for realm
'mesos-agent-readwrite'
I0308 15:29:33.135690 24422 slave.cpp:545] Agent resources: cpus(*):2; mem(*):1024; disk(*):1024;
ports(*):[31000-32000]
I0308 15:29:33.135735 24422 slave.cpp:553] Agent attributes: [  ]
I0308 15:29:33.135743 24422 slave.cpp:558] Agent hostname: ffa651cda12b
I0308 15:29:33.135869 24426 status_update_manager.cpp:177] Pausing sending status updates
I0308 15:29:33.136150 24431 state.cpp:62] Recovering state from '/tmp/Endpoint_SlaveEndpointTest_UnauthorizedRequest_2_vnCh5W/meta'
I0308 15:29:33.136368 24424 status_update_manager.cpp:203] Recovering status update manager
I0308 15:29:33.136535 24431 containerizer.cpp:600] Recovering containerizer
I0308 15:29:33.137132 24429 provisioner.cpp:410] Provisioner recovery complete
I0308 15:29:33.137348 24418 slave.cpp:5572] Finished recovery
I0308 15:29:33.137790 24418 slave.cpp:5754] Querying resource estimator for oversubscribable
resources
I0308 15:29:33.137949 24432 slave.cpp:5768] Received oversubscribable resources {} from the
resource estimator
I0308 15:29:33.138761 24419 process.cpp:3705] Handling HTTP event for process 'slave(706)'
with path: '/slave(706)/containers'
I0308 15:29:33.139434 24429 http.cpp:916] Authorizing principal 'test-principal' to GET the
'/containers' endpoint
I0308 15:29:33.140915 24432 slave.cpp:808] Agent terminating
[       OK ] Endpoint/SlaveEndpointTest.UnauthorizedRequest/2 (13 ms)
[ RUN      ] Endpoint/SlaveEndpointTest.NoAuthorizer/0
I0308 15:29:33.146373 24416 containerizer.cpp:221] Using isolation: posix/cpu,posix/mem,filesystem/posix,network/cni
W0308 15:29:33.146698 24416 backend.cpp:76] Failed to create 'aufs' backend: AufsBackend requires
root privileges
W0308 15:29:33.146741 24416 backend.cpp:76] Failed to create 'bind' backend: BindBackend requires
root privileges
I0308 15:29:33.146754 24416 provisioner.cpp:249] Using default backend 'copy'
I0308 15:29:33.147395 24416 cluster.cpp:446] Creating default 'local' authorizer
I0308 15:29:33.147953 24429 slave.cpp:215] Mesos agent started on (707)@172.17.0.3:45838
I0308 15:29:33.147976 24429 slave.cpp:216] Flags at startup: --acls="" --appc_simple_discovery_uri_prefix="http://"
--appc_store_dir="/tmp/mesos/store/appc" --authenticate_http_readonly="true" --authenticate_http_readwrite="true"
--authenticatee="crammd5" --authentication_backoff_factor="1secs" --authorizer="local" --cgroups_cpu_enable_pids_and_tids_count="false"
--cgroups_enable_cfs="false" --cgroups_hierarchy="/sys/fs/cgroup" --cgroups_limit_swap="false"
--cgroups_root="mesos" --container_disk_watch_interval="15secs" --containerizers="mesos" --credential="/tmp/Endpoint_SlaveEndpointTest_NoAuthorizer_0_zLoAic/credential"
--default_role="*" --disk_watch_interval="1mins" --docker="docker" --docker_kill_orphans="true"
--docker_registry="https://registry-1.docker.io" --docker_remove_delay="6hrs" --docker_socket="/var/run/docker.sock"
--docker_stop_timeout="0ns" --docker_store_dir="/tmp/mesos/store/docker" --docker_volume_checkpoint_dir="/var/run/mesos/isolators/docker/volume"
--enforce_container_disk_quota="false" --executor_registration_timeout="1mins" --executor_shutdown_grace_period="5secs"
--fetcher_cache_dir="/tmp/Endpoint_SlaveEndpointTest_NoAuthorizer_0_zLoAic/fetch" --fetcher_cache_size="2GB"
--frameworks_home="" --gc_delay="1weeks" --gc_disk_headroom="0.1" --hadoop_home="" --help="false"
--hostname_lookup="true" --http_authenticators="basic" --http_command_executor="false" --http_credentials="/tmp/Endpoint_SlaveEndpointTest_NoAuthorizer_0_zLoAic/http_credentials"
--http_heartbeat_interval="30secs" --initialize_driver_logging="true" --isolation="posix/cpu,posix/mem"
--launcher="posix" --launcher_dir="/mesos/build/src" --logbufsecs="0" --logging_level="INFO"
--max_completed_executors_per_framework="150" --oversubscribed_resources_interval="15secs"
--perf_duration="10secs" --perf_interval="1mins" --qos_correction_interval_min="0ns" --quiet="false"
--recover="reconnect" --recovery_timeout="15mins" --registration_backoff_factor="10ms" --resources="cpus:2;gpus:0;mem:1024;disk:1024;ports:[31000-32000]"
--revocable_cpu_low_priority="true" --runtime_dir="/tmp/Endpoint_SlaveEndpointTest_NoAuthorizer_0_zLoAic"
--sandbox_directory="/mnt/mesos/sandbox" --strict="true" --switch_user="true" --systemd_enable_support="true"
--systemd_runtime_directory="/run/systemd/system" --version="false" --work_dir="/tmp/Endpoint_SlaveEndpointTest_NoAuthorizer_0_1KZO2x"
I0308 15:29:33.148406 24429 credentials.hpp:86] Loading credential for authentication from
'/tmp/Endpoint_SlaveEndpointTest_NoAuthorizer_0_zLoAic/credential'
I0308 15:29:33.148505 24429 slave.cpp:358] Agent using credential for: test-principal
I0308 15:29:33.148521 24429 credentials.hpp:37] Loading credentials for authentication from
'/tmp/Endpoint_SlaveEndpointTest_NoAuthorizer_0_zLoAic/http_credentials'
I0308 15:29:33.148632 24429 http.cpp:964] Using default 'basic' HTTP authenticator for realm
'mesos-agent-readonly'
I0308 15:29:33.148679 24429 http.cpp:964] Using default 'basic' HTTP authenticator for realm
'mesos-agent-readwrite'
I0308 15:29:33.149281 24429 slave.cpp:545] Agent resources: cpus(*):2; mem(*):1024; disk(*):1024;
ports(*):[31000-32000]
I0308 15:29:33.149327 24429 slave.cpp:553] Agent attributes: [  ]
I0308 15:29:33.149338 24429 slave.cpp:558] Agent hostname: ffa651cda12b
I0308 15:29:33.149467 24418 status_update_manager.cpp:177] Pausing sending status updates
I0308 15:29:33.149768 24423 state.cpp:62] Recovering state from '/tmp/Endpoint_SlaveEndpointTest_NoAuthorizer_0_1KZO2x/meta'
I0308 15:29:33.149958 24419 status_update_manager.cpp:203] Recovering status update manager
I0308 15:29:33.150064 24419 containerizer.cpp:600] Recovering containerizer
I0308 15:29:33.150741 24422 provisioner.cpp:410] Provisioner recovery complete
I0308 15:29:33.150920 24428 slave.cpp:5572] Finished recovery
I0308 15:29:33.151314 24428 slave.cpp:5754] Querying resource estimator for oversubscribable
resources
I0308 15:29:33.151425 24426 slave.cpp:5768] Received oversubscribable resources {} from the
resource estimator
I0308 15:29:33.152146 24428 process.cpp:3705] Handling HTTP event for process 'slave(707)'
with path: '/slave(707)/monitor/statistics'
I0308 15:29:33.152704 24423 http.cpp:916] Authorizing principal 'test-principal' to GET the
'/monitor/statistics' endpoint
I0308 15:29:33.154297 24426 slave.cpp:808] Agent terminating
[       OK ] Endpoint/SlaveEndpointTest.NoAuthorizer/0 (13 ms)
[ RUN      ] Endpoint/SlaveEndpointTest.NoAuthorizer/1
I0308 15:29:33.159901 24416 containerizer.cpp:221] Using isolation: posix/cpu,posix/mem,filesystem/posix,network/cni
W0308 15:29:33.160251 24416 backend.cpp:76] Failed to create 'aufs' backend: AufsBackend requires
root privileges
W0308 15:29:33.160300 24416 backend.cpp:76] Failed to create 'bind' backend: BindBackend requires
root privileges
I0308 15:29:33.160315 24416 provisioner.cpp:249] Using default backend 'copy'
I0308 15:29:33.160822 24416 cluster.cpp:446] Creating default 'local' authorizer
I0308 15:29:33.161449 24431 slave.cpp:215] Mesos agent started on (708)@172.17.0.3:45838
I0308 15:29:33.161469 24431 slave.cpp:216] Flags at startup: --acls="" --appc_simple_discovery_uri_prefix="http://"
--appc_store_dir="/tmp/mesos/store/appc" --authenticate_http_readonly="true" --authenticate_http_readwrite="true"
--authenticatee="crammd5" --authentication_backoff_factor="1secs" --authorizer="local" --cgroups_cpu_enable_pids_and_tids_count="false"
--cgroups_enable_cfs="false" --cgroups_hierarchy="/sys/fs/cgroup" --cgroups_limit_swap="false"
--cgroups_root="mesos" --container_disk_watch_interval="15secs" --containerizers="mesos" --credential="/tmp/Endpoint_SlaveEndpointTest_NoAuthorizer_1_LUU5qN/credential"
--default_role="*" --disk_watch_interval="1mins" --docker="docker" --docker_kill_orphans="true"
--docker_registry="https://registry-1.docker.io" --docker_remove_delay="6hrs" --docker_socket="/var/run/docker.sock"
--docker_stop_timeout="0ns" --docker_store_dir="/tmp/mesos/store/docker" --docker_volume_checkpoint_dir="/var/run/mesos/isolators/docker/volume"
--enforce_container_disk_quota="false" --executor_registration_timeout="1mins" --executor_shutdown_grace_period="5secs"
--fetcher_cache_dir="/tmp/Endpoint_SlaveEndpointTest_NoAuthorizer_1_LUU5qN/fetch" --fetcher_cache_size="2GB"
--frameworks_home="" --gc_delay="1weeks" --gc_disk_headroom="0.1" --hadoop_home="" --help="false"
--hostname_lookup="true" --http_authenticators="basic" --http_command_executor="false" --http_credentials="/tmp/Endpoint_SlaveEndpointTest_NoAuthorizer_1_LUU5qN/http_credentials"
--http_heartbeat_interval="30secs" --initialize_driver_logging="true" --isolation="posix/cpu,posix/mem"
--launcher="posix" --launcher_dir="/mesos/build/src" --logbufsecs="0" --logging_level="INFO"
--max_completed_executors_per_framework="150" --oversubscribed_resources_interval="15secs"
--perf_duration="10secs" --perf_interval="1mins" --qos_correction_interval_min="0ns" --quiet="false"
--recover="reconnect" --recovery_timeout="15mins" --registration_backoff_factor="10ms" --resources="cpus:2;gpus:0;mem:1024;disk:1024;ports:[31000-32000]"
--revocable_cpu_low_priority="true" --runtime_dir="/tmp/Endpoint_SlaveEndpointTest_NoAuthorizer_1_LUU5qN"
--sandbox_directory="/mnt/mesos/sandbox" --strict="true" --switch_user="true" --systemd_enable_support="true"
--systemd_runtime_directory="/run/systemd/system" --version="false" --work_dir="/tmp/Endpoint_SlaveEndpointTest_NoAuthorizer_1_NGQ788"
I0308 15:29:33.161872 24431 credentials.hpp:86] Loading credential for authentication from
'/tmp/Endpoint_SlaveEndpointTest_NoAuthorizer_1_LUU5qN/credential'
I0308 15:29:33.161965 24431 slave.cpp:358] Agent using credential for: test-principal
I0308 15:29:33.161981 24431 credentials.hpp:37] Loading credentials for authentication from
'/tmp/Endpoint_SlaveEndpointTest_NoAuthorizer_1_LUU5qN/http_credentials'
I0308 15:29:33.162091 24431 http.cpp:964] Using default 'basic' HTTP authenticator for realm
'mesos-agent-readonly'
I0308 15:29:33.162140 24431 http.cpp:964] Using default 'basic' HTTP authenticator for realm
'mesos-agent-readwrite'
I0308 15:29:33.162549 24431 slave.cpp:545] Agent resources: cpus(*):2; mem(*):1024; disk(*):1024;
ports(*):[31000-32000]
I0308 15:29:33.162591 24431 slave.cpp:553] Agent attributes: [  ]
I0308 15:29:33.162598 24431 slave.cpp:558] Agent hostname: ffa651cda12b
I0308 15:29:33.162662 24432 status_update_manager.cpp:177] Pausing sending status updates
I0308 15:29:33.163005 24420 state.cpp:62] Recovering state from '/tmp/Endpoint_SlaveEndpointTest_NoAuthorizer_1_NGQ788/meta'
I0308 15:29:33.163278 24423 status_update_manager.cpp:203] Recovering status update manager
I0308 15:29:33.163406 24423 containerizer.cpp:600] Recovering containerizer
I0308 15:29:33.164047 24422 provisioner.cpp:410] Provisioner recovery complete
I0308 15:29:33.164362 24432 slave.cpp:5572] Finished recovery
I0308 15:29:33.164777 24432 slave.cpp:5754] Querying resource estimator for oversubscribable
resources
I0308 15:29:33.164932 24430 slave.cpp:5768] Received oversubscribable resources {} from the
resource estimator
I0308 15:29:33.165647 24424 process.cpp:3705] Handling HTTP event for process 'slave(708)'
with path: '/slave(708)/monitor/statistics.json'
I0308 15:29:33.166323 24427 http.cpp:916] Authorizing principal 'test-principal' to GET the
'/monitor/statistics.json' endpoint
I0308 15:29:33.168357 24419 slave.cpp:808] Agent terminating
[       OK ] Endpoint/SlaveEndpointTest.NoAuthorizer/1 (14 ms)
[ RUN      ] Endpoint/SlaveEndpointTest.NoAuthorizer/2
I0308 15:29:33.174497 24416 containerizer.cpp:221] Using isolation: posix/cpu,posix/mem,filesystem/posix,network/cni
W0308 15:29:33.174825 24416 backend.cpp:76] Failed to create 'aufs' backend: AufsBackend requires
root privileges
W0308 15:29:33.174868 24416 backend.cpp:76] Failed to create 'bind' backend: BindBackend requires
root privileges
I0308 15:29:33.174885 24416 provisioner.cpp:249] Using default backend 'copy'
I0308 15:29:33.175565 24416 cluster.cpp:446] Creating default 'local' authorizer
I0308 15:29:33.176300 24422 slave.cpp:215] Mesos agent started on (709)@172.17.0.3:45838
I0308 15:29:33.176318 24422 slave.cpp:216] Flags at startup: --acls="" --appc_simple_discovery_uri_prefix="http://"
--appc_store_dir="/tmp/mesos/store/appc" --authenticate_http_readonly="true" --authenticate_http_readwrite="true"
--authenticatee="crammd5" --authentication_backoff_factor="1secs" --authorizer="local" --cgroups_cpu_enable_pids_and_tids_count="false"
--cgroups_enable_cfs="false" --cgroups_hierarchy="/sys/fs/cgroup" --cgroups_limit_swap="false"
--cgroups_root="mesos" --container_disk_watch_interval="15secs" --containerizers="mesos" --credential="/tmp/Endpoint_SlaveEndpointTest_NoAuthorizer_2_v6LPIo/credential"
--default_role="*" --disk_watch_interval="1mins" --docker="docker" --docker_kill_orphans="true"
--docker_registry="https://registry-1.docker.io" --docker_remove_delay="6hrs" --docker_socket="/var/run/docker.sock"
--docker_stop_timeout="0ns" --docker_store_dir="/tmp/mesos/store/docker" --docker_volume_checkpoint_dir="/var/run/mesos/isolators/docker/volume"
--enforce_container_disk_quota="false" --executor_registration_timeout="1mins" --executor_shutdown_grace_period="5secs"
--fetcher_cache_dir="/tmp/Endpoint_SlaveEndpointTest_NoAuthorizer_2_v6LPIo/fetch" --fetcher_cache_size="2GB"
--frameworks_home="" --gc_delay="1weeks" --gc_disk_headroom="0.1" --hadoop_home="" --help="false"
--hostname_lookup="true" --http_authenticators="basic" --http_command_executor="false" --http_credentials="/tmp/Endpoint_SlaveEndpointTest_NoAuthorizer_2_v6LPIo/http_credentials"
--http_heartbeat_interval="30secs" --initialize_driver_logging="true" --isolation="posix/cpu,posix/mem"
--launcher="posix" --launcher_dir="/mesos/build/src" --logbufsecs="0" --logging_level="INFO"
--max_completed_executors_per_framework="150" --oversubscribed_resources_interval="15secs"
--perf_duration="10secs" --perf_interval="1mins" --qos_correction_interval_min="0ns" --quiet="false"
--recover="reconnect" --recovery_timeout="15mins" --registration_backoff_factor="10ms" --resources="cpus:2;gpus:0;mem:1024;disk:1024;ports:[31000-32000]"
--revocable_cpu_low_priority="true" --runtime_dir="/tmp/Endpoint_SlaveEndpointTest_NoAuthorizer_2_v6LPIo"
--sandbox_directory="/mnt/mesos/sandbox" --strict="true" --switch_user="true" --systemd_enable_support="true"
--systemd_runtime_directory="/run/systemd/system" --version="false" --work_dir="/tmp/Endpoint_SlaveEndpointTest_NoAuthorizer_2_9AawoK"
I0308 15:29:33.176745 24422 credentials.hpp:86] Loading credential for authentication from
'/tmp/Endpoint_SlaveEndpointTest_NoAuthorizer_2_v6LPIo/credential'
I0308 15:29:33.176847 24422 slave.cpp:358] Agent using credential for: test-principal
I0308 15:29:33.176863 24422 credentials.hpp:37] Loading credentials for authentication from
'/tmp/Endpoint_SlaveEndpointTest_NoAuthorizer_2_v6LPIo/http_credentials'
I0308 15:29:33.176976 24422 http.cpp:964] Using default 'basic' HTTP authenticator for realm
'mesos-agent-readonly'
I0308 15:29:33.177023 24422 http.cpp:964] Using default 'basic' HTTP authenticator for realm
'mesos-agent-readwrite'
I0308 15:29:33.177757 24422 slave.cpp:545] Agent resources: cpus(*):2; mem(*):1024; disk(*):1024;
ports(*):[31000-32000]
I0308 15:29:33.177801 24422 slave.cpp:553] Agent attributes: [  ]
I0308 15:29:33.177809 24422 slave.cpp:558] Agent hostname: ffa651cda12b
I0308 15:29:33.177887 24430 status_update_manager.cpp:177] Pausing sending status updates
I0308 15:29:33.178267 24432 state.cpp:62] Recovering state from '/tmp/Endpoint_SlaveEndpointTest_NoAuthorizer_2_9AawoK/meta'
I0308 15:29:33.178498 24431 status_update_manager.cpp:203] Recovering status update manager
I0308 15:29:33.178570 24431 containerizer.cpp:600] Recovering containerizer
I0308 15:29:33.179442 24424 provisioner.cpp:410] Provisioner recovery complete
I0308 15:29:33.179715 24422 slave.cpp:5572] Finished recovery
I0308 15:29:33.180284 24422 slave.cpp:5754] Querying resource estimator for oversubscribable
resources
I0308 15:29:33.180415 24426 slave.cpp:5768] Received oversubscribable resources {} from the
resource estimator
I0308 15:29:33.181160 24423 process.cpp:3705] Handling HTTP event for process 'slave(709)'
with path: '/slave(709)/containers'
I0308 15:29:33.181704 24423 http.cpp:916] Authorizing principal 'test-principal' to GET the
'/containers' endpoint
I0308 15:29:33.183467 24429 slave.cpp:808] Agent terminating
[       OK ] Endpoint/SlaveEndpointTest.NoAuthorizer/2 (15 ms)
[----------] 9 tests from Endpoint/SlaveEndpointTest (127 ms total)

[----------] Global test environment tear-down
[==========] 1459 tests from 160 test cases ran. (463463 ms total)
[  PASSED  ] 1455 tests.
[  FAILED  ] 4 tests, listed below:
[  FAILED  ] MasterAllocatorTest/0.OutOfOrderDispatch, where TypeParam = mesos::internal::master::allocator::MesosAllocator<mesos::internal::master::allocator::HierarchicalAllocatorProcess<mesos::internal::master::allocator::DRFSorter,
mesos::internal::master::allocator::DRFSorter, mesos::internal::master::allocator::DRFSorter>
>
[  FAILED  ] RegistrarTest.StartMaintenance
[  FAILED  ] ContentType/AgentAPITest.GetContainers/0, where GetParam() = application/x-protobuf
[  FAILED  ] DiskResource/PersistentVolumeTest.SharedPersistentVolumeMultipleTasks/0, where
GetParam() = 0

 4 FAILED TESTS
  YOU HAVE 12 DISABLED TESTS

make[3]: *** [CMakeFiles/check] Error 1
make[3]: Leaving directory `/mesos/build'
make[2]: *** [CMakeFiles/check.dir/all] Error 2
make[2]: Leaving directory `/mesos/build'
make[1]: *** [CMakeFiles/check.dir/rule] Error 2
make[1]: Leaving directory `/mesos/build'
make: *** [check] Error 2
+ docker rmi mesos-1488983961-16212
Untagged: mesos-1488983961-16212:latest
Deleted: sha256:7b7ca861bf35299d2f485bb24ccbc66e13823ac880453f557f75205e60306042
Deleted: sha256:c10a500a060d1ee142352bee0b6e65ee35d8c616c15ebb68af60bf66e54e5daa
Deleted: sha256:ac86e2e93d05fc70b37e69519fbef982c33c47cb4c9f7defd1216ee1cec6b807
Deleted: sha256:418faae5181673f53c541ac48657619d7f6c91dbe2dcd8360bdfd708d55ecb0f
Deleted: sha256:8f22996060f4b95075f055ad94c0deba8050c40ed832fb789f908c65ab9ce2a1
Deleted: sha256:5e34441240d337b18bdfb2b1e72698f2114be9d0bb01a8aff2f30c8c816d10f1
Deleted: sha256:68c6a4c5f7325e73c55f16b01c2d6bdf407183914e60bc696793a3b8ead0e1f7
Deleted: sha256:510c101c092aafbffec06f6165f98e593076937f792cdd3b258e97a89ece0e9e
Deleted: sha256:e4a71b7acee94dd24233b6c91a88b26ef4cb923b4d19fdd7787e98e0f124fee3
Deleted: sha256:c4d084a7a1f21c8481ba55ce8cfaaa5699127dd1d0769b40da6631910eff8983
Deleted: sha256:504ef64906ebda3299dee2eb0112caa9587cc2ce702b9fd9a89355c4573be761
Deleted: sha256:d8977c6a02ce007f2016d111906db1567a2b3e7ea3f60fdd5c1a05d7df63ab93
Deleted: sha256:b9cfa15f6b69debbbfc1e383392211857b00a38b7c5decd1bca3c037130f65f7
Deleted: sha256:eebef1b008bb232497e029345871e2d124c6748e06daccff456f7715a0c45cb7
Deleted: sha256:97b6fd81dd7a1ed0b50a4b2be2f16da53b1070685ceeda7589418ba3c8cb3ef3
Deleted: sha256:2bfac70bf039f84d21a58a6c99f6d84bb3620fb825ccbb4cb1096bbd98b85102
Deleted: sha256:3c145d1a1019b51437f6cbb047c7602d9e9960570dc5f531915fa0fa312e0dd7
Deleted: sha256:2133163a7c90307f5d3d362665cb5443995d829aaa0911a0948a804ebd371ae7
Deleted: sha256:aa1f77ce61ceb007496c9407334769e85a1bafec26ba3ef31f5161a02626b636
Deleted: sha256:f3ec9a69861a72dfe8c743b5babd8a3f03e496340c49fdee231a4c8686177350
Deleted: sha256:4557fffcdb33e18f11a918b737103b03bacbfa08f99fc66a6ad5940616cbbe4f
Deleted: sha256:e52f94920753e1c9ad12ac8fc0297d1961eb3e0864de11de8a5a7f9c89f4fe8f
Deleted: sha256:9d3abff0137e3185bfeb39db1078cb257348d212295546dd56031378c7d15422
Deleted: sha256:d83667f6939238db99815ebc8642dd245a38d7a9890fffaadd2afc740f51311d
Deleted: sha256:b581f4e65f8ac046aeb26052c04c6239f3103a04175ead320379d618cbda29e6
Build step 'Execute shell' marked build as failure

Mime
View raw message