mesos-builds mailing list archives

Site index · List index
Message view « Date » · « Thread »
Top « Date » · « Thread »
From Apache Jenkins Server <jenk...@builds.apache.org>
Subject Build failed in Jenkins: Mesos-Buildbot » autotools,gcc,--verbose,GLOG_v=1 MESOS_VERBOSE=1,ubuntu:14.04,(docker||Hadoop)&&(!ubuntu-us1)&&(!ubuntu-eu2) #3419
Date Sat, 25 Mar 2017 20:02:25 GMT
See <https://builds.apache.org/job/Mesos-Buildbot/BUILDTOOL=autotools,COMPILER=gcc,CONFIGURATION=--verbose,ENVIRONMENT=GLOG_v=1%20MESOS_VERBOSE=1,OS=ubuntu%3A14.04,label_exp=(docker%7C%7CHadoop)&&(!ubuntu-us1)&&(!ubuntu-eu2)/3419/display/redirect?page=changes>

Changes:

[anand] Added support for auth tokens to the V1 executor library.

[anand] Added support for auth tokens to the default executor.

[anand] Added a output operator overload for Secret::Type.

[anand] Updated the agent to generate executor secrets.

[anand] Fixed invocations of 'executorEnvironment' in the tests.

[anand] Enabled executor authentication in the tests.

[anand] Turned off executor authentication in the ExecutorHttpApiTests.

[anand] Updated 'SchedulerTest.TaskGroupRunning'.

[anand] Turned on executor authentication in the 'DefaultExecutorTests'.

[anand] Changed the agent's SecretGenerator from Owned to pointer.

[anand] Added a 'MockSecretGenerator'.

[anand] Added SecretGenerator injection to the MockSlave.

[anand] Added a new unmocked method to the mock agent.

[anand] Added new tests for executor secret generation.

------------------------------------------
[...truncated 26.04 MB...]
I0325 20:02:18.375021 30527 containerizer.cpp:608] Recovering containerizer
I0325 20:02:18.376793 30539 provisioner.cpp:410] Provisioner recovery complete
I0325 20:02:18.377297 30527 slave.cpp:5921] Finished recovery
I0325 20:02:18.377718 30527 slave.cpp:6103] Querying resource estimator for oversubscribable
resources
I0325 20:02:18.378070 30532 slave.cpp:6117] Received oversubscribable resources {} from the
resource estimator
I0325 20:02:18.380511 30534 process.cpp:3705] Handling HTTP event for process 'slave(721)'
with path: '/slave(721)/monitor/statistics.json'
I0325 20:02:18.381971 30528 http.cpp:922] Authorizing principal 'test-principal' to GET the
'/monitor/statistics.json' endpoint
I0325 20:02:18.387183 30529 slave.cpp:748] Agent terminating
[       OK ] Endpoint/SlaveEndpointTest.AuthorizedRequest/1 (33 ms)
[ RUN      ] Endpoint/SlaveEndpointTest.AuthorizedRequest/2
I0325 20:02:18.398247 30507 containerizer.cpp:221] Using isolation: posix/cpu,posix/mem,filesystem/posix,network/cni
W0325 20:02:18.398696 30507 backend.cpp:76] Failed to create 'aufs' backend: AufsBackend requires
root privileges
W0325 20:02:18.398789 30507 backend.cpp:76] Failed to create 'bind' backend: BindBackend requires
root privileges
I0325 20:02:18.398831 30507 provisioner.cpp:249] Using default backend 'copy'
I0325 20:02:18.402104 30536 slave.cpp:226] Mesos agent started on (722)@172.17.0.3:43578
I0325 20:02:18.402209 30536 slave.cpp:227] Flags at startup: --acls="" --appc_simple_discovery_uri_prefix="http://"
--appc_store_dir="/tmp/mesos/store/appc" --authenticate_http_readonly="true" --authenticate_http_readwrite="true"
--authenticatee="crammd5" --authentication_backoff_factor="1secs" --authorizer="local" --cgroups_cpu_enable_pids_and_tids_count="false"
--cgroups_enable_cfs="false" --cgroups_hierarchy="/sys/fs/cgroup" --cgroups_limit_swap="false"
--cgroups_root="mesos" --container_disk_watch_interval="15secs" --containerizers="mesos" --credential="/tmp/Endpoint_SlaveEndpointTest_AuthorizedRequest_2_THaYkL/credential"
--default_role="*" --disk_watch_interval="1mins" --docker="docker" --docker_kill_orphans="true"
--docker_registry="https://registry-1.docker.io" --docker_remove_delay="6hrs" --docker_socket="/var/run/docker.sock"
--docker_stop_timeout="0ns" --docker_store_dir="/tmp/mesos/store/docker" --docker_volume_checkpoint_dir="/var/run/mesos/isolators/docker/volume"
--enforce_container_disk_quota="false" --executor_registration_timeout="1mins" --executor_shutdown_grace_period="5secs"
--fetcher_cache_dir="/tmp/Endpoint_SlaveEndpointTest_AuthorizedRequest_2_THaYkL/fetch" --fetcher_cache_size="2GB"
--frameworks_home="" --gc_delay="1weeks" --gc_disk_headroom="0.1" --hadoop_home="" --help="false"
--hostname_lookup="true" --http_command_executor="false" --http_credentials="/tmp/Endpoint_SlaveEndpointTest_AuthorizedRequest_2_THaYkL/http_credentials"
--http_heartbeat_interval="30secs" --initialize_driver_logging="true" --isolation="posix/cpu,posix/mem"
--launcher="posix" --launcher_dir="/mesos/mesos-1.3.0/_build/src" --logbufsecs="0" --logging_level="INFO"
--max_completed_executors_per_framework="150" --oversubscribed_resources_interval="15secs"
--perf_duration="10secs" --perf_interval="1mins" --qos_correction_interval_min="0ns" --quiet="false"
--recover="reconnect" --recovery_timeout="15mins" --registration_backoff_factor="10ms" --resources="cpus:2;gpus:0;mem:1024;disk:1024;ports:[31000-32000]"
--revocable_cpu_low_priority="true" --runtime_dir="/tmp/Endpoint_SlaveEndpointTest_AuthorizedRequest_2_THaYkL"
--sandbox_directory="/mnt/mesos/sandbox" --strict="true" --switch_user="true" --systemd_enable_support="true"
--systemd_runtime_directory="/run/systemd/system" --version="false" --work_dir="/tmp/Endpoint_SlaveEndpointTest_AuthorizedRequest_2_YJ5sgk"
I0325 20:02:18.402864 30536 credentials.hpp:86] Loading credential for authentication from
'/tmp/Endpoint_SlaveEndpointTest_AuthorizedRequest_2_THaYkL/credential'
I0325 20:02:18.403026 30536 slave.cpp:259] Agent using credential for: test-principal
I0325 20:02:18.403053 30536 credentials.hpp:37] Loading credentials for authentication from
'/tmp/Endpoint_SlaveEndpointTest_AuthorizedRequest_2_THaYkL/http_credentials'
I0325 20:02:18.403318 30536 http.cpp:961] Creating default 'basic' HTTP authenticator for
realm 'mesos-agent-readonly'
I0325 20:02:18.403645 30536 http.cpp:961] Creating default 'basic' HTTP authenticator for
realm 'mesos-agent-readwrite'
I0325 20:02:18.405200 30536 slave.cpp:486] Agent resources: cpus(*):2; mem(*):1024; disk(*):1024;
ports(*):[31000-32000]
I0325 20:02:18.405303 30536 slave.cpp:494] Agent attributes: [  ]
I0325 20:02:18.405320 30536 slave.cpp:499] Agent hostname: 3e4477a29a4b
I0325 20:02:18.405474 30538 status_update_manager.cpp:177] Pausing sending status updates
I0325 20:02:18.406847 30540 state.cpp:62] Recovering state from '/tmp/Endpoint_SlaveEndpointTest_AuthorizedRequest_2_YJ5sgk/meta'
I0325 20:02:18.407567 30539 status_update_manager.cpp:203] Recovering status update manager
I0325 20:02:18.407812 30537 containerizer.cpp:608] Recovering containerizer
I0325 20:02:18.409423 30528 provisioner.cpp:410] Provisioner recovery complete
I0325 20:02:18.410049 30529 slave.cpp:5921] Finished recovery
I0325 20:02:18.410641 30529 slave.cpp:6103] Querying resource estimator for oversubscribable
resources
I0325 20:02:18.410987 30537 slave.cpp:6117] Received oversubscribable resources {} from the
resource estimator
I0325 20:02:18.413224 30536 process.cpp:3705] Handling HTTP event for process 'slave(722)'
with path: '/slave(722)/containers'
I0325 20:02:18.414722 30536 http.cpp:922] Authorizing principal 'test-principal' to GET the
'/containers' endpoint
I0325 20:02:18.419471 30531 slave.cpp:748] Agent terminating
[       OK ] Endpoint/SlaveEndpointTest.AuthorizedRequest/2 (31 ms)
[ RUN      ] Endpoint/SlaveEndpointTest.UnauthorizedRequest/0
I0325 20:02:18.430763 30507 containerizer.cpp:221] Using isolation: posix/cpu,posix/mem,filesystem/posix,network/cni
W0325 20:02:18.431396 30507 backend.cpp:76] Failed to create 'aufs' backend: AufsBackend requires
root privileges
W0325 20:02:18.431510 30507 backend.cpp:76] Failed to create 'bind' backend: BindBackend requires
root privileges
I0325 20:02:18.431584 30507 provisioner.cpp:249] Using default backend 'copy'
I0325 20:02:18.435124 30536 slave.cpp:226] Mesos agent started on (723)@172.17.0.3:43578
I0325 20:02:18.435150 30536 slave.cpp:227] Flags at startup: --acls="" --appc_simple_discovery_uri_prefix="http://"
--appc_store_dir="/tmp/mesos/store/appc" --authenticate_http_readonly="true" --authenticate_http_readwrite="true"
--authenticatee="crammd5" --authentication_backoff_factor="1secs" --authorizer="local" --cgroups_cpu_enable_pids_and_tids_count="false"
--cgroups_enable_cfs="false" --cgroups_hierarchy="/sys/fs/cgroup" --cgroups_limit_swap="false"
--cgroups_root="mesos" --container_disk_watch_interval="15secs" --containerizers="mesos" --credential="/tmp/Endpoint_SlaveEndpointTest_UnauthorizedRequest_0_JV9OUv/credential"
--default_role="*" --disk_watch_interval="1mins" --docker="docker" --docker_kill_orphans="true"
--docker_registry="https://registry-1.docker.io" --docker_remove_delay="6hrs" --docker_socket="/var/run/docker.sock"
--docker_stop_timeout="0ns" --docker_store_dir="/tmp/mesos/store/docker" --docker_volume_checkpoint_dir="/var/run/mesos/isolators/docker/volume"
--enforce_container_disk_quota="false" --executor_registration_timeout="1mins" --executor_shutdown_grace_period="5secs"
--fetcher_cache_dir="/tmp/Endpoint_SlaveEndpointTest_UnauthorizedRequest_0_JV9OUv/fetch" --fetcher_cache_size="2GB"
--frameworks_home="" --gc_delay="1weeks" --gc_disk_headroom="0.1" --hadoop_home="" --help="false"
--hostname_lookup="true" --http_command_executor="false" --http_credentials="/tmp/Endpoint_SlaveEndpointTest_UnauthorizedRequest_0_JV9OUv/http_credentials"
--http_heartbeat_interval="30secs" --initialize_driver_logging="true" --isolation="posix/cpu,posix/mem"
--launcher="posix" --launcher_dir="/mesos/mesos-1.3.0/_build/src" --logbufsecs="0" --logging_level="INFO"
--max_completed_executors_per_framework="150" --oversubscribed_resources_interval="15secs"
--perf_duration="10secs" --perf_interval="1mins" --qos_correction_interval_min="0ns" --quiet="false"
--recover="reconnect" --recovery_timeout="15mins" --registration_backoff_factor="10ms" --resources="cpus:2;gpus:0;mem:1024;disk:1024;ports:[31000-32000]"
--revocable_cpu_low_priority="true" --runtime_dir="/tmp/Endpoint_SlaveEndpointTest_UnauthorizedRequest_0_JV9OUv"
--sandbox_directory="/mnt/mesos/sandbox" --strict="true" --switch_user="true" --systemd_enable_support="true"
--systemd_runtime_directory="/run/systemd/system" --version="false" --work_dir="/tmp/Endpoint_SlaveEndpointTest_UnauthorizedRequest_0_GKi3K4"
I0325 20:02:18.435885 30536 credentials.hpp:86] Loading credential for authentication from
'/tmp/Endpoint_SlaveEndpointTest_UnauthorizedRequest_0_JV9OUv/credential'
I0325 20:02:18.436123 30536 slave.cpp:259] Agent using credential for: test-principal
I0325 20:02:18.436151 30536 credentials.hpp:37] Loading credentials for authentication from
'/tmp/Endpoint_SlaveEndpointTest_UnauthorizedRequest_0_JV9OUv/http_credentials'
I0325 20:02:18.436455 30536 http.cpp:961] Creating default 'basic' HTTP authenticator for
realm 'mesos-agent-readonly'
I0325 20:02:18.436583 30536 http.cpp:961] Creating default 'basic' HTTP authenticator for
realm 'mesos-agent-readwrite'
I0325 20:02:18.438205 30536 slave.cpp:486] Agent resources: cpus(*):2; mem(*):1024; disk(*):1024;
ports(*):[31000-32000]
I0325 20:02:18.438318 30536 slave.cpp:494] Agent attributes: [  ]
I0325 20:02:18.438344 30536 slave.cpp:499] Agent hostname: 3e4477a29a4b
I0325 20:02:18.438531 30531 status_update_manager.cpp:177] Pausing sending status updates
I0325 20:02:18.439791 30534 state.cpp:62] Recovering state from '/tmp/Endpoint_SlaveEndpointTest_UnauthorizedRequest_0_GKi3K4/meta'
I0325 20:02:18.440089 30526 status_update_manager.cpp:203] Recovering status update manager
I0325 20:02:18.440388 30539 containerizer.cpp:608] Recovering containerizer
I0325 20:02:18.442212 30532 provisioner.cpp:410] Provisioner recovery complete
I0325 20:02:18.442662 30528 slave.cpp:5921] Finished recovery
I0325 20:02:18.443176 30528 slave.cpp:6103] Querying resource estimator for oversubscribable
resources
I0325 20:02:18.443536 30541 slave.cpp:6117] Received oversubscribable resources {} from the
resource estimator
I0325 20:02:18.445889 30527 process.cpp:3705] Handling HTTP event for process 'slave(723)'
with path: '/slave(723)/monitor/statistics'
I0325 20:02:18.447696 30527 http.cpp:922] Authorizing principal 'test-principal' to GET the
'/monitor/statistics' endpoint
I0325 20:02:18.450645 30527 slave.cpp:748] Agent terminating
[       OK ] Endpoint/SlaveEndpointTest.UnauthorizedRequest/0 (31 ms)
[ RUN      ] Endpoint/SlaveEndpointTest.UnauthorizedRequest/1
I0325 20:02:18.461758 30507 containerizer.cpp:221] Using isolation: posix/cpu,posix/mem,filesystem/posix,network/cni
W0325 20:02:18.462366 30507 backend.cpp:76] Failed to create 'aufs' backend: AufsBackend requires
root privileges
W0325 20:02:18.462481 30507 backend.cpp:76] Failed to create 'bind' backend: BindBackend requires
root privileges
I0325 20:02:18.462530 30507 provisioner.cpp:249] Using default backend 'copy'
I0325 20:02:18.466401 30536 slave.cpp:226] Mesos agent started on (724)@172.17.0.3:43578
I0325 20:02:18.466481 30536 slave.cpp:227] Flags at startup: --acls="" --appc_simple_discovery_uri_prefix="http://"
--appc_store_dir="/tmp/mesos/store/appc" --authenticate_http_readonly="true" --authenticate_http_readwrite="true"
--authenticatee="crammd5" --authentication_backoff_factor="1secs" --authorizer="local" --cgroups_cpu_enable_pids_and_tids_count="false"
--cgroups_enable_cfs="false" --cgroups_hierarchy="/sys/fs/cgroup" --cgroups_limit_swap="false"
--cgroups_root="mesos" --container_disk_watch_interval="15secs" --containerizers="mesos" --credential="/tmp/Endpoint_SlaveEndpointTest_UnauthorizedRequest_1_bZL5Og/credential"
--default_role="*" --disk_watch_interval="1mins" --docker="docker" --docker_kill_orphans="true"
--docker_registry="https://registry-1.docker.io" --docker_remove_delay="6hrs" --docker_socket="/var/run/docker.sock"
--docker_stop_timeout="0ns" --docker_store_dir="/tmp/mesos/store/docker" --docker_volume_checkpoint_dir="/var/run/mesos/isolators/docker/volume"
--enforce_container_disk_quota="false" --executor_registration_timeout="1mins" --executor_shutdown_grace_period="5secs"
--fetcher_cache_dir="/tmp/Endpoint_SlaveEndpointTest_UnauthorizedRequest_1_bZL5Og/fetch" --fetcher_cache_size="2GB"
--frameworks_home="" --gc_delay="1weeks" --gc_disk_headroom="0.1" --hadoop_home="" --help="false"
--hostname_lookup="true" --http_command_executor="false" --http_credentials="/tmp/Endpoint_SlaveEndpointTest_UnauthorizedRequest_1_bZL5Og/http_credentials"
--http_heartbeat_interval="30secs" --initialize_driver_logging="true" --isolation="posix/cpu,posix/mem"
--launcher="posix" --launcher_dir="/mesos/mesos-1.3.0/_build/src" --logbufsecs="0" --logging_level="INFO"
--max_completed_executors_per_framework="150" --oversubscribed_resources_interval="15secs"
--perf_duration="10secs" --perf_interval="1mins" --qos_correction_interval_min="0ns" --quiet="false"
--recover="reconnect" --recovery_timeout="15mins" --registration_backoff_factor="10ms" --resources="cpus:2;gpus:0;mem:1024;disk:1024;ports:[31000-32000]"
--revocable_cpu_low_priority="true" --runtime_dir="/tmp/Endpoint_SlaveEndpointTest_UnauthorizedRequest_1_bZL5Og"
--sandbox_directory="/mnt/mesos/sandbox" --strict="true" --switch_user="true" --systemd_enable_support="true"
--systemd_runtime_directory="/run/systemd/system" --version="false" --work_dir="/tmp/Endpoint_SlaveEndpointTest_UnauthorizedRequest_1_egfhAP"
I0325 20:02:18.467145 30536 credentials.hpp:86] Loading credential for authentication from
'/tmp/Endpoint_SlaveEndpointTest_UnauthorizedRequest_1_bZL5Og/credential'
I0325 20:02:18.467316 30536 slave.cpp:259] Agent using credential for: test-principal
I0325 20:02:18.467347 30536 credentials.hpp:37] Loading credentials for authentication from
'/tmp/Endpoint_SlaveEndpointTest_UnauthorizedRequest_1_bZL5Og/http_credentials'
I0325 20:02:18.467625 30536 http.cpp:961] Creating default 'basic' HTTP authenticator for
realm 'mesos-agent-readonly'
I0325 20:02:18.467777 30536 http.cpp:961] Creating default 'basic' HTTP authenticator for
realm 'mesos-agent-readwrite'
I0325 20:02:18.469544 30536 slave.cpp:486] Agent resources: cpus(*):2; mem(*):1024; disk(*):1024;
ports(*):[31000-32000]
I0325 20:02:18.469650 30536 slave.cpp:494] Agent attributes: [  ]
I0325 20:02:18.469666 30536 slave.cpp:499] Agent hostname: 3e4477a29a4b
I0325 20:02:18.469940 30541 status_update_manager.cpp:177] Pausing sending status updates
I0325 20:02:18.471293 30533 state.cpp:62] Recovering state from '/tmp/Endpoint_SlaveEndpointTest_UnauthorizedRequest_1_egfhAP/meta'
I0325 20:02:18.471726 30536 status_update_manager.cpp:203] Recovering status update manager
I0325 20:02:18.471938 30540 containerizer.cpp:608] Recovering containerizer
I0325 20:02:18.473927 30527 provisioner.cpp:410] Provisioner recovery complete
I0325 20:02:18.474490 30535 slave.cpp:5921] Finished recovery
I0325 20:02:18.475071 30535 slave.cpp:6103] Querying resource estimator for oversubscribable
resources
I0325 20:02:18.475401 30533 slave.cpp:6117] Received oversubscribable resources {} from the
resource estimator
I0325 20:02:18.478169 30539 process.cpp:3705] Handling HTTP event for process 'slave(724)'
with path: '/slave(724)/monitor/statistics.json'
I0325 20:02:18.479615 30535 http.cpp:922] Authorizing principal 'test-principal' to GET the
'/monitor/statistics.json' endpoint
I0325 20:02:18.482861 30528 slave.cpp:748] Agent terminating
[       OK ] Endpoint/SlaveEndpointTest.UnauthorizedRequest/1 (32 ms)
[ RUN      ] Endpoint/SlaveEndpointTest.UnauthorizedRequest/2
I0325 20:02:18.494302 30507 containerizer.cpp:221] Using isolation: posix/cpu,posix/mem,filesystem/posix,network/cni
W0325 20:02:18.494766 30507 backend.cpp:76] Failed to create 'aufs' backend: AufsBackend requires
root privileges
W0325 20:02:18.494858 30507 backend.cpp:76] Failed to create 'bind' backend: BindBackend requires
root privileges
I0325 20:02:18.494889 30507 provisioner.cpp:249] Using default backend 'copy'
I0325 20:02:18.497648 30539 slave.cpp:226] Mesos agent started on (725)@172.17.0.3:43578
I0325 20:02:18.497668 30539 slave.cpp:227] Flags at startup: --acls="" --appc_simple_discovery_uri_prefix="http://"
--appc_store_dir="/tmp/mesos/store/appc" --authenticate_http_readonly="true" --authenticate_http_readwrite="true"
--authenticatee="crammd5" --authentication_backoff_factor="1secs" --authorizer="local" --cgroups_cpu_enable_pids_and_tids_count="false"
--cgroups_enable_cfs="false" --cgroups_hierarchy="/sys/fs/cgroup" --cgroups_limit_swap="false"
--cgroups_root="mesos" --container_disk_watch_interval="15secs" --containerizers="mesos" --credential="/tmp/Endpoint_SlaveEndpointTest_UnauthorizedRequest_2_VGgp41/credential"
--default_role="*" --disk_watch_interval="1mins" --docker="docker" --docker_kill_orphans="true"
--docker_registry="https://registry-1.docker.io" --docker_remove_delay="6hrs" --docker_socket="/var/run/docker.sock"
--docker_stop_timeout="0ns" --docker_store_dir="/tmp/mesos/store/docker" --docker_volume_checkpoint_dir="/var/run/mesos/isolators/docker/volume"
--enforce_container_disk_quota="false" --executor_registration_timeout="1mins" --executor_shutdown_grace_period="5secs"
--fetcher_cache_dir="/tmp/Endpoint_SlaveEndpointTest_UnauthorizedRequest_2_VGgp41/fetch" --fetcher_cache_size="2GB"
--frameworks_home="" --gc_delay="1weeks" --gc_disk_headroom="0.1" --hadoop_home="" --help="false"
--hostname_lookup="true" --http_command_executor="false" --http_credentials="/tmp/Endpoint_SlaveEndpointTest_UnauthorizedRequest_2_VGgp41/http_credentials"
--http_heartbeat_interval="30secs" --initialize_driver_logging="true" --isolation="posix/cpu,posix/mem"
--launcher="posix" --launcher_dir="/mesos/mesos-1.3.0/_build/src" --logbufsecs="0" --logging_level="INFO"
--max_completed_executors_per_framework="150" --oversubscribed_resources_interval="15secs"
--perf_duration="10secs" --perf_interval="1mins" --qos_correction_interval_min="0ns" --quiet="false"
--recover="reconnect" --recovery_timeout="15mins" --registration_backoff_factor="10ms" --resources="cpus:2;gpus:0;mem:1024;disk:1024;ports:[31000-32000]"
--revocable_cpu_low_priority="true" --runtime_dir="/tmp/Endpoint_SlaveEndpointTest_UnauthorizedRequest_2_VGgp41"
--sandbox_directory="/mnt/mesos/sandbox" --strict="true" --switch_user="true" --systemd_enable_support="true"
--systemd_runtime_directory="/run/systemd/system" --version="false" --work_dir="/tmp/Endpoint_SlaveEndpointTest_UnauthorizedRequest_2_cfCiKA"
I0325 20:02:18.498147 30539 credentials.hpp:86] Loading credential for authentication from
'/tmp/Endpoint_SlaveEndpointTest_UnauthorizedRequest_2_VGgp41/credential'
I0325 20:02:18.498270 30539 slave.cpp:259] Agent using credential for: test-principal
I0325 20:02:18.498292 30539 credentials.hpp:37] Loading credentials for authentication from
'/tmp/Endpoint_SlaveEndpointTest_UnauthorizedRequest_2_VGgp41/http_credentials'
I0325 20:02:18.498550 30539 http.cpp:961] Creating default 'basic' HTTP authenticator for
realm 'mesos-agent-readonly'
I0325 20:02:18.498719 30539 http.cpp:961] Creating default 'basic' HTTP authenticator for
realm 'mesos-agent-readwrite'
I0325 20:02:18.500027 30539 slave.cpp:486] Agent resources: cpus(*):2; mem(*):1024; disk(*):1024;
ports(*):[31000-32000]
I0325 20:02:18.500105 30539 slave.cpp:494] Agent attributes: [  ]
I0325 20:02:18.500118 30539 slave.cpp:499] Agent hostname: 3e4477a29a4b
I0325 20:02:18.500247 30532 status_update_manager.cpp:177] Pausing sending status updates
I0325 20:02:18.501426 30541 state.cpp:62] Recovering state from '/tmp/Endpoint_SlaveEndpointTest_UnauthorizedRequest_2_cfCiKA/meta'
I0325 20:02:18.501790 30537 status_update_manager.cpp:203] Recovering status update manager
I0325 20:02:18.501986 30541 containerizer.cpp:608] Recovering containerizer
I0325 20:02:18.503224 30537 provisioner.cpp:410] Provisioner recovery complete
I0325 20:02:18.503541 30538 slave.cpp:5921] Finished recovery
I0325 20:02:18.503988 30538 slave.cpp:6103] Querying resource estimator for oversubscribable
resources
I0325 20:02:18.504250 30531 slave.cpp:6117] Received oversubscribable resources {} from the
resource estimator
I0325 20:02:18.506294 30531 process.cpp:3705] Handling HTTP event for process 'slave(725)'
with path: '/slave(725)/containers'
I0325 20:02:18.507383 30529 http.cpp:922] Authorizing principal 'test-principal' to GET the
'/containers' endpoint
I0325 20:02:18.509784 30541 slave.cpp:748] Agent terminating
[       OK ] Endpoint/SlaveEndpointTest.UnauthorizedRequest/2 (26 ms)
[ RUN      ] Endpoint/SlaveEndpointTest.NoAuthorizer/0
I0325 20:02:18.520608 30507 containerizer.cpp:221] Using isolation: posix/cpu,posix/mem,filesystem/posix,network/cni
W0325 20:02:18.521056 30507 backend.cpp:76] Failed to create 'aufs' backend: AufsBackend requires
root privileges
W0325 20:02:18.521148 30507 backend.cpp:76] Failed to create 'bind' backend: BindBackend requires
root privileges
I0325 20:02:18.521247 30507 provisioner.cpp:249] Using default backend 'copy'
I0325 20:02:18.522665 30507 cluster.cpp:446] Creating default 'local' authorizer
I0325 20:02:18.524155 30527 slave.cpp:226] Mesos agent started on (726)@172.17.0.3:43578
I0325 20:02:18.524178 30527 slave.cpp:227] Flags at startup: --acls="" --appc_simple_discovery_uri_prefix="http://"
--appc_store_dir="/tmp/mesos/store/appc" --authenticate_http_readonly="true" --authenticate_http_readwrite="true"
--authenticatee="crammd5" --authentication_backoff_factor="1secs" --authorizer="local" --cgroups_cpu_enable_pids_and_tids_count="false"
--cgroups_enable_cfs="false" --cgroups_hierarchy="/sys/fs/cgroup" --cgroups_limit_swap="false"
--cgroups_root="mesos" --container_disk_watch_interval="15secs" --containerizers="mesos" --credential="/tmp/Endpoint_SlaveEndpointTest_NoAuthorizer_0_1HvvBN/credential"
--default_role="*" --disk_watch_interval="1mins" --docker="docker" --docker_kill_orphans="true"
--docker_registry="https://registry-1.docker.io" --docker_remove_delay="6hrs" --docker_socket="/var/run/docker.sock"
--docker_stop_timeout="0ns" --docker_store_dir="/tmp/mesos/store/docker" --docker_volume_checkpoint_dir="/var/run/mesos/isolators/docker/volume"
--enforce_container_disk_quota="false" --executor_registration_timeout="1mins" --executor_shutdown_grace_period="5secs"
--fetcher_cache_dir="/tmp/Endpoint_SlaveEndpointTest_NoAuthorizer_0_1HvvBN/fetch" --fetcher_cache_size="2GB"
--frameworks_home="" --gc_delay="1weeks" --gc_disk_headroom="0.1" --hadoop_home="" --help="false"
--hostname_lookup="true" --http_command_executor="false" --http_credentials="/tmp/Endpoint_SlaveEndpointTest_NoAuthorizer_0_1HvvBN/http_credentials"
--http_heartbeat_interval="30secs" --initialize_driver_logging="true" --isolation="posix/cpu,posix/mem"
--launcher="posix" --launcher_dir="/mesos/mesos-1.3.0/_build/src" --logbufsecs="0" --logging_level="INFO"
--max_completed_executors_per_framework="150" --oversubscribed_resources_interval="15secs"
--perf_duration="10secs" --perf_interval="1mins" --qos_correction_interval_min="0ns" --quiet="false"
--recover="reconnect" --recovery_timeout="15mins" --registration_backoff_factor="10ms" --resources="cpus:2;gpus:0;mem:1024;disk:1024;ports:[31000-32000]"
--revocable_cpu_low_priority="true" --runtime_dir="/tmp/Endpoint_SlaveEndpointTest_NoAuthorizer_0_1HvvBN"
--sandbox_directory="/mnt/mesos/sandbox" --strict="true" --switch_user="true" --systemd_enable_support="true"
--systemd_runtime_directory="/run/systemd/system" --version="false" --work_dir="/tmp/Endpoint_SlaveEndpointTest_NoAuthorizer_0_ggw3cm"
I0325 20:02:18.524704 30527 credentials.hpp:86] Loading credential for authentication from
'/tmp/Endpoint_SlaveEndpointTest_NoAuthorizer_0_1HvvBN/credential'
I0325 20:02:18.524873 30527 slave.cpp:259] Agent using credential for: test-principal
I0325 20:02:18.524893 30527 credentials.hpp:37] Loading credentials for authentication from
'/tmp/Endpoint_SlaveEndpointTest_NoAuthorizer_0_1HvvBN/http_credentials'
I0325 20:02:18.525121 30527 http.cpp:961] Creating default 'basic' HTTP authenticator for
realm 'mesos-agent-readonly'
I0325 20:02:18.525298 30527 http.cpp:961] Creating default 'basic' HTTP authenticator for
realm 'mesos-agent-readwrite'
I0325 20:02:18.526562 30527 slave.cpp:486] Agent resources: cpus(*):2; mem(*):1024; disk(*):1024;
ports(*):[31000-32000]
I0325 20:02:18.526640 30527 slave.cpp:494] Agent attributes: [  ]
I0325 20:02:18.526659 30527 slave.cpp:499] Agent hostname: 3e4477a29a4b
I0325 20:02:18.526785 30540 status_update_manager.cpp:177] Pausing sending status updates
I0325 20:02:18.527971 30528 state.cpp:62] Recovering state from '/tmp/Endpoint_SlaveEndpointTest_NoAuthorizer_0_ggw3cm/meta'
I0325 20:02:18.528225 30531 status_update_manager.cpp:203] Recovering status update manager
I0325 20:02:18.528568 30539 containerizer.cpp:608] Recovering containerizer
I0325 20:02:18.529791 30534 provisioner.cpp:410] Provisioner recovery complete
I0325 20:02:18.530153 30527 slave.cpp:5921] Finished recovery
I0325 20:02:18.530591 30527 slave.cpp:6103] Querying resource estimator for oversubscribable
resources
I0325 20:02:18.530817 30528 slave.cpp:6117] Received oversubscribable resources {} from the
resource estimator
I0325 20:02:18.533004 30527 process.cpp:3705] Handling HTTP event for process 'slave(726)'
with path: '/slave(726)/monitor/statistics'
I0325 20:02:18.534376 30541 http.cpp:922] Authorizing principal 'test-principal' to GET the
'/monitor/statistics' endpoint
I0325 20:02:18.538156 30540 slave.cpp:748] Agent terminating
[       OK ] Endpoint/SlaveEndpointTest.NoAuthorizer/0 (27 ms)
[ RUN      ] Endpoint/SlaveEndpointTest.NoAuthorizer/1
I0325 20:02:18.549929 30507 containerizer.cpp:221] Using isolation: posix/cpu,posix/mem,filesystem/posix,network/cni
W0325 20:02:18.550518 30507 backend.cpp:76] Failed to create 'aufs' backend: AufsBackend requires
root privileges
W0325 20:02:18.550633 30507 backend.cpp:76] Failed to create 'bind' backend: BindBackend requires
root privileges
I0325 20:02:18.550673 30507 provisioner.cpp:249] Using default backend 'copy'
I0325 20:02:18.553324 30507 cluster.cpp:446] Creating default 'local' authorizer
I0325 20:02:18.555006 30533 slave.cpp:226] Mesos agent started on (727)@172.17.0.3:43578
I0325 20:02:18.555029 30533 slave.cpp:227] Flags at startup: --acls="" --appc_simple_discovery_uri_prefix="http://"
--appc_store_dir="/tmp/mesos/store/appc" --authenticate_http_readonly="true" --authenticate_http_readwrite="true"
--authenticatee="crammd5" --authentication_backoff_factor="1secs" --authorizer="local" --cgroups_cpu_enable_pids_and_tids_count="false"
--cgroups_enable_cfs="false" --cgroups_hierarchy="/sys/fs/cgroup" --cgroups_limit_swap="false"
--cgroups_root="mesos" --container_disk_watch_interval="15secs" --containerizers="mesos" --credential="/tmp/Endpoint_SlaveEndpointTest_NoAuthorizer_1_J28Kqz/credential"
--default_role="*" --disk_watch_interval="1mins" --docker="docker" --docker_kill_orphans="true"
--docker_registry="https://registry-1.docker.io" --docker_remove_delay="6hrs" --docker_socket="/var/run/docker.sock"
--docker_stop_timeout="0ns" --docker_store_dir="/tmp/mesos/store/docker" --docker_volume_checkpoint_dir="/var/run/mesos/isolators/docker/volume"
--enforce_container_disk_quota="false" --executor_registration_timeout="1mins" --executor_shutdown_grace_period="5secs"
--fetcher_cache_dir="/tmp/Endpoint_SlaveEndpointTest_NoAuthorizer_1_J28Kqz/fetch" --fetcher_cache_size="2GB"
--frameworks_home="" --gc_delay="1weeks" --gc_disk_headroom="0.1" --hadoop_home="" --help="false"
--hostname_lookup="true" --http_command_executor="false" --http_credentials="/tmp/Endpoint_SlaveEndpointTest_NoAuthorizer_1_J28Kqz/http_credentials"
--http_heartbeat_interval="30secs" --initialize_driver_logging="true" --isolation="posix/cpu,posix/mem"
--launcher="posix" --launcher_dir="/mesos/mesos-1.3.0/_build/src" --logbufsecs="0" --logging_level="INFO"
--max_completed_executors_per_framework="150" --oversubscribed_resources_interval="15secs"
--perf_duration="10secs" --perf_interval="1mins" --qos_correction_interval_min="0ns" --quiet="false"
--recover="reconnect" --recovery_timeout="15mins" --registration_backoff_factor="10ms" --resources="cpus:2;gpus:0;mem:1024;disk:1024;ports:[31000-32000]"
--revocable_cpu_low_priority="true" --runtime_dir="/tmp/Endpoint_SlaveEndpointTest_NoAuthorizer_1_J28Kqz"
--sandbox_directory="/mnt/mesos/sandbox" --strict="true" --switch_user="true" --systemd_enable_support="true"
--systemd_runtime_directory="/run/systemd/system" --version="false" --work_dir="/tmp/Endpoint_SlaveEndpointTest_NoAuthorizer_1_KwvGX7"
I0325 20:02:18.555686 30533 credentials.hpp:86] Loading credential for authentication from
'/tmp/Endpoint_SlaveEndpointTest_NoAuthorizer_1_J28Kqz/credential'
I0325 20:02:18.555847 30533 slave.cpp:259] Agent using credential for: test-principal
I0325 20:02:18.555871 30533 credentials.hpp:37] Loading credentials for authentication from
'/tmp/Endpoint_SlaveEndpointTest_NoAuthorizer_1_J28Kqz/http_credentials'
I0325 20:02:18.556144 30533 http.cpp:961] Creating default 'basic' HTTP authenticator for
realm 'mesos-agent-readonly'
I0325 20:02:18.556318 30533 http.cpp:961] Creating default 'basic' HTTP authenticator for
realm 'mesos-agent-readwrite'
I0325 20:02:18.557909 30533 slave.cpp:486] Agent resources: cpus(*):2; mem(*):1024; disk(*):1024;
ports(*):[31000-32000]
I0325 20:02:18.558012 30533 slave.cpp:494] Agent attributes: [  ]
I0325 20:02:18.558025 30533 slave.cpp:499] Agent hostname: 3e4477a29a4b
I0325 20:02:18.558214 30536 status_update_manager.cpp:177] Pausing sending status updates
I0325 20:02:18.559767 30541 state.cpp:62] Recovering state from '/tmp/Endpoint_SlaveEndpointTest_NoAuthorizer_1_KwvGX7/meta'
I0325 20:02:18.560128 30530 status_update_manager.cpp:203] Recovering status update manager
I0325 20:02:18.560401 30526 containerizer.cpp:608] Recovering containerizer
I0325 20:02:18.562424 30532 provisioner.cpp:410] Provisioner recovery complete
I0325 20:02:18.562973 30540 slave.cpp:5921] Finished recovery
I0325 20:02:18.563525 30540 slave.cpp:6103] Querying resource estimator for oversubscribable
resources
I0325 20:02:18.563933 30531 slave.cpp:6117] Received oversubscribable resources {} from the
resource estimator
I0325 20:02:18.566308 30534 process.cpp:3705] Handling HTTP event for process 'slave(727)'
with path: '/slave(727)/monitor/statistics.json'
I0325 20:02:18.567930 30534 http.cpp:922] Authorizing principal 'test-principal' to GET the
'/monitor/statistics.json' endpoint
I0325 20:02:18.573040 30528 slave.cpp:748] Agent terminating
[       OK ] Endpoint/SlaveEndpointTest.NoAuthorizer/1 (36 ms)
[ RUN      ] Endpoint/SlaveEndpointTest.NoAuthorizer/2
I0325 20:02:18.586135 30507 containerizer.cpp:221] Using isolation: posix/cpu,posix/mem,filesystem/posix,network/cni
W0325 20:02:18.586735 30507 backend.cpp:76] Failed to create 'aufs' backend: AufsBackend requires
root privileges
W0325 20:02:18.586844 30507 backend.cpp:76] Failed to create 'bind' backend: BindBackend requires
root privileges
I0325 20:02:18.586884 30507 provisioner.cpp:249] Using default backend 'copy'
I0325 20:02:18.588755 30507 cluster.cpp:446] Creating default 'local' authorizer
I0325 20:02:18.590817 30540 slave.cpp:226] Mesos agent started on (728)@172.17.0.3:43578
I0325 20:02:18.590845 30540 slave.cpp:227] Flags at startup: --acls="" --appc_simple_discovery_uri_prefix="http://"
--appc_store_dir="/tmp/mesos/store/appc" --authenticate_http_readonly="true" --authenticate_http_readwrite="true"
--authenticatee="crammd5" --authentication_backoff_factor="1secs" --authorizer="local" --cgroups_cpu_enable_pids_and_tids_count="false"
--cgroups_enable_cfs="false" --cgroups_hierarchy="/sys/fs/cgroup" --cgroups_limit_swap="false"
--cgroups_root="mesos" --container_disk_watch_interval="15secs" --containerizers="mesos" --credential="/tmp/Endpoint_SlaveEndpointTest_NoAuthorizer_2_dlzZCl/credential"
--default_role="*" --disk_watch_interval="1mins" --docker="docker" --docker_kill_orphans="true"
--docker_registry="https://registry-1.docker.io" --docker_remove_delay="6hrs" --docker_socket="/var/run/docker.sock"
--docker_stop_timeout="0ns" --docker_store_dir="/tmp/mesos/store/docker" --docker_volume_checkpoint_dir="/var/run/mesos/isolators/docker/volume"
--enforce_container_disk_quota="false" --executor_registration_timeout="1mins" --executor_shutdown_grace_period="5secs"
--fetcher_cache_dir="/tmp/Endpoint_SlaveEndpointTest_NoAuthorizer_2_dlzZCl/fetch" --fetcher_cache_size="2GB"
--frameworks_home="" --gc_delay="1weeks" --gc_disk_headroom="0.1" --hadoop_home="" --help="false"
--hostname_lookup="true" --http_command_executor="false" --http_credentials="/tmp/Endpoint_SlaveEndpointTest_NoAuthorizer_2_dlzZCl/http_credentials"
--http_heartbeat_interval="30secs" --initialize_driver_logging="true" --isolation="posix/cpu,posix/mem"
--launcher="posix" --launcher_dir="/mesos/mesos-1.3.0/_build/src" --logbufsecs="0" --logging_level="INFO"
--max_completed_executors_per_framework="150" --oversubscribed_resources_interval="15secs"
--perf_duration="10secs" --perf_interval="1mins" --qos_correction_interval_min="0ns" --quiet="false"
--recover="reconnect" --recovery_timeout="15mins" --registration_backoff_factor="10ms" --resources="cpus:2;gpus:0;mem:1024;disk:1024;ports:[31000-32000]"
--revocable_cpu_low_priority="true" --runtime_dir="/tmp/Endpoint_SlaveEndpointTest_NoAuthorizer_2_dlzZCl"
--sandbox_directory="/mnt/mesos/sandbox" --strict="true" --switch_user="true" --systemd_enable_support="true"
--systemd_runtime_directory="/run/systemd/system" --version="false" --work_dir="/tmp/Endpoint_SlaveEndpointTest_NoAuthorizer_2_QNF23T"
I0325 20:02:18.591559 30540 credentials.hpp:86] Loading credential for authentication from
'/tmp/Endpoint_SlaveEndpointTest_NoAuthorizer_2_dlzZCl/credential'
I0325 20:02:18.591730 30540 slave.cpp:259] Agent using credential for: test-principal
I0325 20:02:18.591756 30540 credentials.hpp:37] Loading credentials for authentication from
'/tmp/Endpoint_SlaveEndpointTest_NoAuthorizer_2_dlzZCl/http_credentials'
I0325 20:02:18.592031 30540 http.cpp:961] Creating default 'basic' HTTP authenticator for
realm 'mesos-agent-readonly'
I0325 20:02:18.592178 30540 http.cpp:961] Creating default 'basic' HTTP authenticator for
realm 'mesos-agent-readwrite'
I0325 20:02:18.593845 30540 slave.cpp:486] Agent resources: cpus(*):2; mem(*):1024; disk(*):1024;
ports(*):[31000-32000]
I0325 20:02:18.593957 30540 slave.cpp:494] Agent attributes: [  ]
I0325 20:02:18.593973 30540 slave.cpp:499] Agent hostname: 3e4477a29a4b
I0325 20:02:18.594120 30539 status_update_manager.cpp:177] Pausing sending status updates
I0325 20:02:18.595600 30538 state.cpp:62] Recovering state from '/tmp/Endpoint_SlaveEndpointTest_NoAuthorizer_2_QNF23T/meta'
I0325 20:02:18.596068 30532 status_update_manager.cpp:203] Recovering status update manager
I0325 20:02:18.596310 30528 containerizer.cpp:608] Recovering containerizer
I0325 20:02:18.597764 30535 provisioner.cpp:410] Provisioner recovery complete
I0325 20:02:18.598412 30539 slave.cpp:5921] Finished recovery
I0325 20:02:18.599014 30539 slave.cpp:6103] Querying resource estimator for oversubscribable
resources
I0325 20:02:18.599313 30538 slave.cpp:6117] Received oversubscribable resources {} from the
resource estimator
I0325 20:02:18.601815 30539 process.cpp:3705] Handling HTTP event for process 'slave(728)'
with path: '/slave(728)/containers'
I0325 20:02:18.603551 30532 http.cpp:922] Authorizing principal 'test-principal' to GET the
'/containers' endpoint
I0325 20:02:18.608386 30529 slave.cpp:748] Agent terminating
[       OK ] Endpoint/SlaveEndpointTest.NoAuthorizer/2 (34 ms)
[----------] 9 tests from Endpoint/SlaveEndpointTest (291 ms total)

[----------] Global test environment tear-down
[==========] 1534 tests from 173 test cases ran. (459029 ms total)
[  PASSED  ] 1532 tests.
[  FAILED  ] 2 tests, listed below:
[  FAILED  ] DockerFetcherPluginTest.INTERNET_CURL_FetchImage
[  FAILED  ] DockerFetcherPluginTest.INTERNET_CURL_InvokeFetchByName

 2 FAILED TESTS
  YOU HAVE 12 DISABLED TESTS

make[4]: *** [check-local] Error 1
make[4]: Leaving directory `/mesos/mesos-1.3.0/_build/src'
make[3]: *** [check-am] Error 2
make[3]: Leaving directory `/mesos/mesos-1.3.0/_build/src'
make[2]: *** [check] Error 2
make[2]: Leaving directory `/mesos/mesos-1.3.0/_build/src'
make[1]: *** [check-recursive] Error 1
make[1]: Leaving directory `/mesos/mesos-1.3.0/_build'
make: *** [distcheck] Error 1
+ docker rmi mesos-1490469056-30998
Untagged: mesos-1490469056-30998:latest
Deleted: sha256:560aeec2f520d434120e8956e2ec503f367e80743cf7d449d464376142e94ec6
Deleted: sha256:1b07933a5c8be6e75d699672e46f0f136a13b9cefd4e523a3d507f4e185d053c
Deleted: sha256:8b4af46938b75f83b20c256e54d463bcb108bc0af44ce8e53252ba2ad3cc86d8
Deleted: sha256:706cf9a41613aa682e25bfe34bdfb89239ad836b1509756707d68d52b7ec003d
Deleted: sha256:9fcfbbe8ceab3e2820370353f76460a691de1c8ff30009901d06494dd7d75e55
Deleted: sha256:41a2d0eebe31f0bf8e86b414c6e6d60b049d4c1d08f02b15f9dcf904ba6d91fd
Deleted: sha256:85f84afe8f913030793eef928d34b1956c243f8ac0a05f3cad802fc2ac081283
Deleted: sha256:5d886852e6caf1142b71f890b3a95bf49d30e4f2101b1d979d038e307a278a1c
Deleted: sha256:772286432f0491dc3bda13af7a83c63164ce1379510257f69a38cc6349b2d969
Deleted: sha256:fca32b8db37cc1e73b7045f37c9cb2b3ea7c8b4662159ec90eb009889899ba1a
Deleted: sha256:8add8559d8ab1db3a6dd2b2b24655f3f2290df9b4ab628d571e818c4978bda91
Deleted: sha256:d675214f03060cc0bae45f9e01ba0f3a06a683bfee1297ef780e248dfcc26f6b
Deleted: sha256:9736f9f29f0635185eae619ce57609d064bdd2ea7bd351783c83ba131c9cc237
Deleted: sha256:f053f62c11a37d37030f3c6616e09cb22533b1e80318ec9de94f7c7c2d8f3162
Deleted: sha256:29cab6c6e8feaf055ff996cedb1d28d5680f9b26bc8c7775867fb0a486e84d10
Deleted: sha256:b35c973d3824d7412b9d28baf060b0755926abcf6cd3f5ba659d5826a0bc3aca
Deleted: sha256:1661b346653ca546e40b69581706de9ed401d93fd0a836972d7617eae5078408
Deleted: sha256:f987979896eabed61fc126a80c1c85fa92f2b40bcbbf753290ddb3f8493ccb34
Deleted: sha256:20ef8dbf8c87ff6130ae969df5312cbbba17b3b9b3c05ecc7470c1db3b1509df
Deleted: sha256:eae8452ea1c8896dcf7ccca080540863ba7d2a05fa68cc680b6f707a19322660
Deleted: sha256:25fb2163e2e55e62aeac5dce6b23b85f7b2d7537467b4cde0a5b4d05d5e89e86
Deleted: sha256:30186e439010a9aed622601ce4588d55a8107dc2c27b20f46a085a27bb4f0258
Deleted: sha256:6affd22662d591d4ec91ce90f9327054c2247afecb2231ff83a022c45731c41a
Deleted: sha256:94b9592f94f8ec5d5bdb5bfd5e22f6d62bd8158dd809d809271a33a3b6d1de63
Build step 'Execute shell' marked build as failure

Mime
View raw message