mesos-builds mailing list archives

Site index · List index
Message view « Date » · « Thread »
Top « Date » · « Thread »
From Apache Jenkins Server <jenk...@builds.apache.org>
Subject Build failed in Jenkins: Mesos-Buildbot » cmake,clang,--verbose --enable-libevent --enable-ssl,GLOG_v=1 MESOS_VERBOSE=1,ubuntu:14.04,(docker||Hadoop)&&(!ubuntu-us1)&&(!ubuntu-eu2) #3406
Date Thu, 23 Mar 2017 23:20:06 GMT
See <https://builds.apache.org/job/Mesos-Buildbot/BUILDTOOL=cmake,COMPILER=clang,CONFIGURATION=--verbose%20--enable-libevent%20--enable-ssl,ENVIRONMENT=GLOG_v=1%20MESOS_VERBOSE=1,OS=ubuntu%3A14.04,label_exp=(docker%7C%7CHadoop)&&(!ubuntu-us1)&&(!ubuntu-eu2)/3406/display/redirect?page=changes>

Changes:

[toenshoff] Fixed flags logging in Docker executor.

[josephwu] Windows: Fixed usage of WindowsError in stat.hpp.

[josephwu] Fixed 'all be it' typo.

------------------------------------------
[...truncated 24.87 MB...]
I0323 23:20:01.229688   880 status_update_manager.cpp:177] Pausing sending status updates
I0323 23:20:01.230018   880 state.cpp:62] Recovering state from '/tmp/Endpoint_SlaveEndpointTest_AuthorizedRequest_1_Dk8CMo/meta'
I0323 23:20:01.230159   873 status_update_manager.cpp:203] Recovering status update manager
I0323 23:20:01.230346   875 containerizer.cpp:608] Recovering containerizer
I0323 23:20:01.230998   875 provisioner.cpp:410] Provisioner recovery complete
I0323 23:20:01.231139   886 slave.cpp:5638] Finished recovery
I0323 23:20:01.231533   886 slave.cpp:5820] Querying resource estimator for oversubscribable
resources
I0323 23:20:01.231613   889 slave.cpp:5834] Received oversubscribable resources {} from the
resource estimator
I0323 23:20:01.232350   889 process.cpp:3705] Handling HTTP event for process 'slave(710)'
with path: '/slave(710)/monitor/statistics.json'
I0323 23:20:01.232779   889 http.cpp:918] Authorizing principal 'test-principal' to GET the
'/monitor/statistics.json' endpoint
I0323 23:20:01.234392   874 slave.cpp:693] Agent terminating
[       OK ] Endpoint/SlaveEndpointTest.AuthorizedRequest/1 (24 ms)
[ RUN      ] Endpoint/SlaveEndpointTest.AuthorizedRequest/2
I0323 23:20:01.282130 26722 containerizer.cpp:221] Using isolation: posix/cpu,posix/mem,filesystem/posix,network/cni
W0323 23:20:01.282398 26722 backend.cpp:76] Failed to create 'aufs' backend: AufsBackend requires
root privileges
W0323 23:20:01.282444 26722 backend.cpp:76] Failed to create 'bind' backend: BindBackend requires
root privileges
I0323 23:20:01.282456 26722 provisioner.cpp:249] Using default backend 'copy'
I0323 23:20:01.283893   888 slave.cpp:210] Mesos agent started on (711)@172.17.0.2:44436
I0323 23:20:01.283944   888 slave.cpp:211] Flags at startup: --acls="" --appc_simple_discovery_uri_prefix="http://"
--appc_store_dir="/tmp/mesos/store/appc" --authenticate_http_readonly="true" --authenticate_http_readwrite="true"
--authenticatee="crammd5" --authentication_backoff_factor="1secs" --authorizer="local" --cgroups_cpu_enable_pids_and_tids_count="false"
--cgroups_enable_cfs="false" --cgroups_hierarchy="/sys/fs/cgroup" --cgroups_limit_swap="false"
--cgroups_root="mesos" --container_disk_watch_interval="15secs" --containerizers="mesos" --credential="/tmp/Endpoint_SlaveEndpointTest_AuthorizedRequest_2_inxxkB/credential"
--default_role="*" --disk_watch_interval="1mins" --docker="docker" --docker_kill_orphans="true"
--docker_registry="https://registry-1.docker.io" --docker_remove_delay="6hrs" --docker_socket="/var/run/docker.sock"
--docker_stop_timeout="0ns" --docker_store_dir="/tmp/mesos/store/docker" --docker_volume_checkpoint_dir="/var/run/mesos/isolators/docker/volume"
--enforce_container_disk_quota="false" --executor_registration_timeout="1mins" --executor_shutdown_grace_period="5secs"
--fetcher_cache_dir="/tmp/Endpoint_SlaveEndpointTest_AuthorizedRequest_2_inxxkB/fetch" --fetcher_cache_size="2GB"
--frameworks_home="" --gc_delay="1weeks" --gc_disk_headroom="0.1" --hadoop_home="" --help="false"
--hostname_lookup="true" --http_authenticators="basic" --http_command_executor="false" --http_credentials="/tmp/Endpoint_SlaveEndpointTest_AuthorizedRequest_2_inxxkB/http_credentials"
--http_heartbeat_interval="30secs" --initialize_driver_logging="true" --isolation="posix/cpu,posix/mem"
--launcher="posix" --launcher_dir="/mesos/build/src" --logbufsecs="0" --logging_level="INFO"
--max_completed_executors_per_framework="150" --oversubscribed_resources_interval="15secs"
--perf_duration="10secs" --perf_interval="1mins" --qos_correction_interval_min="0ns" --quiet="false"
--recover="reconnect" --recovery_timeout="15mins" --registration_backoff_factor="10ms" --resources="cpus:2;gpus:0;mem:1024;disk:1024;ports:[31000-32000]"
--revocable_cpu_low_priority="true" --runtime_dir="/tmp/Endpoint_SlaveEndpointTest_AuthorizedRequest_2_inxxkB"
--sandbox_directory="/mnt/mesos/sandbox" --strict="true" --switch_user="true" --systemd_enable_support="true"
--systemd_runtime_directory="/run/systemd/system" --version="false" --work_dir="/tmp/Endpoint_SlaveEndpointTest_AuthorizedRequest_2_5LUPX9"
I0323 23:20:01.284272   888 credentials.hpp:86] Loading credential for authentication from
'/tmp/Endpoint_SlaveEndpointTest_AuthorizedRequest_2_inxxkB/credential'
I0323 23:20:01.287892   888 slave.cpp:243] Agent using credential for: test-principal
I0323 23:20:01.287906   888 credentials.hpp:37] Loading credentials for authentication from
'/tmp/Endpoint_SlaveEndpointTest_AuthorizedRequest_2_inxxkB/http_credentials'
I0323 23:20:01.288014   888 http.cpp:957] Creating default 'basic' HTTP authenticator for
realm 'mesos-agent-readonly'
I0323 23:20:01.288079   888 http.cpp:957] Creating default 'basic' HTTP authenticator for
realm 'mesos-agent-readwrite'
I0323 23:20:01.288556   888 slave.cpp:430] Agent resources: cpus(*):2; mem(*):1024; disk(*):1024;
ports(*):[31000-32000]
I0323 23:20:01.288592   888 slave.cpp:438] Agent attributes: [  ]
I0323 23:20:01.288600   888 slave.cpp:443] Agent hostname: df90cfdea248
I0323 23:20:01.288655   896 status_update_manager.cpp:177] Pausing sending status updates
I0323 23:20:01.289218   893 state.cpp:62] Recovering state from '/tmp/Endpoint_SlaveEndpointTest_AuthorizedRequest_2_5LUPX9/meta'
I0323 23:20:01.289475   891 status_update_manager.cpp:203] Recovering status update manager
I0323 23:20:01.289619   881 containerizer.cpp:608] Recovering containerizer
I0323 23:20:01.290299   880 provisioner.cpp:410] Provisioner recovery complete
I0323 23:20:01.290441   887 slave.cpp:5638] Finished recovery
I0323 23:20:01.290745   887 slave.cpp:5820] Querying resource estimator for oversubscribable
resources
I0323 23:20:01.290930   893 slave.cpp:5834] Received oversubscribable resources {} from the
resource estimator
I0323 23:20:01.291640   892 process.cpp:3705] Handling HTTP event for process 'slave(711)'
with path: '/slave(711)/containers'
I0323 23:20:01.292140   883 http.cpp:918] Authorizing principal 'test-principal' to GET the
'/containers' endpoint
I0323 23:20:01.293783   886 slave.cpp:693] Agent terminating
[       OK ] Endpoint/SlaveEndpointTest.AuthorizedRequest/2 (17 ms)
[ RUN      ] Endpoint/SlaveEndpointTest.UnauthorizedRequest/0
I0323 23:20:01.350785 26722 containerizer.cpp:221] Using isolation: posix/cpu,posix/mem,filesystem/posix,network/cni
W0323 23:20:01.351130 26722 backend.cpp:76] Failed to create 'aufs' backend: AufsBackend requires
root privileges
W0323 23:20:01.351166 26722 backend.cpp:76] Failed to create 'bind' backend: BindBackend requires
root privileges
I0323 23:20:01.351176 26722 provisioner.cpp:249] Using default backend 'copy'
I0323 23:20:01.352308   873 slave.cpp:210] Mesos agent started on (712)@172.17.0.2:44436
I0323 23:20:01.352335   873 slave.cpp:211] Flags at startup: --acls="" --appc_simple_discovery_uri_prefix="http://"
--appc_store_dir="/tmp/mesos/store/appc" --authenticate_http_readonly="true" --authenticate_http_readwrite="true"
--authenticatee="crammd5" --authentication_backoff_factor="1secs" --authorizer="local" --cgroups_cpu_enable_pids_and_tids_count="false"
--cgroups_enable_cfs="false" --cgroups_hierarchy="/sys/fs/cgroup" --cgroups_limit_swap="false"
--cgroups_root="mesos" --container_disk_watch_interval="15secs" --containerizers="mesos" --credential="/tmp/Endpoint_SlaveEndpointTest_UnauthorizedRequest_0_6SDcjn/credential"
--default_role="*" --disk_watch_interval="1mins" --docker="docker" --docker_kill_orphans="true"
--docker_registry="https://registry-1.docker.io" --docker_remove_delay="6hrs" --docker_socket="/var/run/docker.sock"
--docker_stop_timeout="0ns" --docker_store_dir="/tmp/mesos/store/docker" --docker_volume_checkpoint_dir="/var/run/mesos/isolators/docker/volume"
--enforce_container_disk_quota="false" --executor_registration_timeout="1mins" --executor_shutdown_grace_period="5secs"
--fetcher_cache_dir="/tmp/Endpoint_SlaveEndpointTest_UnauthorizedRequest_0_6SDcjn/fetch" --fetcher_cache_size="2GB"
--frameworks_home="" --gc_delay="1weeks" --gc_disk_headroom="0.1" --hadoop_home="" --help="false"
--hostname_lookup="true" --http_authenticators="basic" --http_command_executor="false" --http_credentials="/tmp/Endpoint_SlaveEndpointTest_UnauthorizedRequest_0_6SDcjn/http_credentials"
--http_heartbeat_interval="30secs" --initialize_driver_logging="true" --isolation="posix/cpu,posix/mem"
--launcher="posix" --launcher_dir="/mesos/build/src" --logbufsecs="0" --logging_level="INFO"
--max_completed_executors_per_framework="150" --oversubscribed_resources_interval="15secs"
--perf_duration="10secs" --perf_interval="1mins" --qos_correction_interval_min="0ns" --quiet="false"
--recover="reconnect" --recovery_timeout="15mins" --registration_backoff_factor="10ms" --resources="cpus:2;gpus:0;mem:1024;disk:1024;ports:[31000-32000]"
--revocable_cpu_low_priority="true" --runtime_dir="/tmp/Endpoint_SlaveEndpointTest_UnauthorizedRequest_0_6SDcjn"
--sandbox_directory="/mnt/mesos/sandbox" --strict="true" --switch_user="true" --systemd_enable_support="true"
--systemd_runtime_directory="/run/systemd/system" --version="false" --work_dir="/tmp/Endpoint_SlaveEndpointTest_UnauthorizedRequest_0_efEgMV"
I0323 23:20:01.352655   873 credentials.hpp:86] Loading credential for authentication from
'/tmp/Endpoint_SlaveEndpointTest_UnauthorizedRequest_0_6SDcjn/credential'
I0323 23:20:01.352742   873 slave.cpp:243] Agent using credential for: test-principal
I0323 23:20:01.352752   873 credentials.hpp:37] Loading credentials for authentication from
'/tmp/Endpoint_SlaveEndpointTest_UnauthorizedRequest_0_6SDcjn/http_credentials'
I0323 23:20:01.352829   873 http.cpp:957] Creating default 'basic' HTTP authenticator for
realm 'mesos-agent-readonly'
I0323 23:20:01.352881   873 http.cpp:957] Creating default 'basic' HTTP authenticator for
realm 'mesos-agent-readwrite'
I0323 23:20:01.353488   873 slave.cpp:430] Agent resources: cpus(*):2; mem(*):1024; disk(*):1024;
ports(*):[31000-32000]
I0323 23:20:01.353533   873 slave.cpp:438] Agent attributes: [  ]
I0323 23:20:01.353541   873 slave.cpp:443] Agent hostname: df90cfdea248
I0323 23:20:01.353621   880 status_update_manager.cpp:177] Pausing sending status updates
I0323 23:20:01.354146   878 state.cpp:62] Recovering state from '/tmp/Endpoint_SlaveEndpointTest_UnauthorizedRequest_0_efEgMV/meta'
I0323 23:20:01.354411   886 status_update_manager.cpp:203] Recovering status update manager
I0323 23:20:01.354595   884 containerizer.cpp:608] Recovering containerizer
I0323 23:20:01.355190   887 provisioner.cpp:410] Provisioner recovery complete
I0323 23:20:01.355382   879 slave.cpp:5638] Finished recovery
I0323 23:20:01.355782   879 slave.cpp:5820] Querying resource estimator for oversubscribable
resources
I0323 23:20:01.355849   879 slave.cpp:5834] Received oversubscribable resources {} from the
resource estimator
I0323 23:20:01.356477   893 process.cpp:3705] Handling HTTP event for process 'slave(712)'
with path: '/slave(712)/monitor/statistics'
I0323 23:20:01.356856   892 http.cpp:918] Authorizing principal 'test-principal' to GET the
'/monitor/statistics' endpoint
I0323 23:20:01.357920   879 slave.cpp:693] Agent terminating
[       OK ] Endpoint/SlaveEndpointTest.UnauthorizedRequest/0 (13 ms)
[ RUN      ] Endpoint/SlaveEndpointTest.UnauthorizedRequest/1
I0323 23:20:01.363222 26722 containerizer.cpp:221] Using isolation: posix/cpu,posix/mem,filesystem/posix,network/cni
W0323 23:20:01.363456 26722 backend.cpp:76] Failed to create 'aufs' backend: AufsBackend requires
root privileges
W0323 23:20:01.363492 26722 backend.cpp:76] Failed to create 'bind' backend: BindBackend requires
root privileges
I0323 23:20:01.363503 26722 provisioner.cpp:249] Using default backend 'copy'
I0323 23:20:01.364471   893 slave.cpp:210] Mesos agent started on (713)@172.17.0.2:44436
I0323 23:20:01.364496   893 slave.cpp:211] Flags at startup: --acls="" --appc_simple_discovery_uri_prefix="http://"
--appc_store_dir="/tmp/mesos/store/appc" --authenticate_http_readonly="true" --authenticate_http_readwrite="true"
--authenticatee="crammd5" --authentication_backoff_factor="1secs" --authorizer="local" --cgroups_cpu_enable_pids_and_tids_count="false"
--cgroups_enable_cfs="false" --cgroups_hierarchy="/sys/fs/cgroup" --cgroups_limit_swap="false"
--cgroups_root="mesos" --container_disk_watch_interval="15secs" --containerizers="mesos" --credential="/tmp/Endpoint_SlaveEndpointTest_UnauthorizedRequest_1_FqzZw9/credential"
--default_role="*" --disk_watch_interval="1mins" --docker="docker" --docker_kill_orphans="true"
--docker_registry="https://registry-1.docker.io" --docker_remove_delay="6hrs" --docker_socket="/var/run/docker.sock"
--docker_stop_timeout="0ns" --docker_store_dir="/tmp/mesos/store/docker" --docker_volume_checkpoint_dir="/var/run/mesos/isolators/docker/volume"
--enforce_container_disk_quota="false" --executor_registration_timeout="1mins" --executor_shutdown_grace_period="5secs"
--fetcher_cache_dir="/tmp/Endpoint_SlaveEndpointTest_UnauthorizedRequest_1_FqzZw9/fetch" --fetcher_cache_size="2GB"
--frameworks_home="" --gc_delay="1weeks" --gc_disk_headroom="0.1" --hadoop_home="" --help="false"
--hostname_lookup="true" --http_authenticators="basic" --http_command_executor="false" --http_credentials="/tmp/Endpoint_SlaveEndpointTest_UnauthorizedRequest_1_FqzZw9/http_credentials"
--http_heartbeat_interval="30secs" --initialize_driver_logging="true" --isolation="posix/cpu,posix/mem"
--launcher="posix" --launcher_dir="/mesos/build/src" --logbufsecs="0" --logging_level="INFO"
--max_completed_executors_per_framework="150" --oversubscribed_resources_interval="15secs"
--perf_duration="10secs" --perf_interval="1mins" --qos_correction_interval_min="0ns" --quiet="false"
--recover="reconnect" --recovery_timeout="15mins" --registration_backoff_factor="10ms" --resources="cpus:2;gpus:0;mem:1024;disk:1024;ports:[31000-32000]"
--revocable_cpu_low_priority="true" --runtime_dir="/tmp/Endpoint_SlaveEndpointTest_UnauthorizedRequest_1_FqzZw9"
--sandbox_directory="/mnt/mesos/sandbox" --strict="true" --switch_user="true" --systemd_enable_support="true"
--systemd_runtime_directory="/run/systemd/system" --version="false" --work_dir="/tmp/Endpoint_SlaveEndpointTest_UnauthorizedRequest_1_9LWhYH"
I0323 23:20:01.364827   893 credentials.hpp:86] Loading credential for authentication from
'/tmp/Endpoint_SlaveEndpointTest_UnauthorizedRequest_1_FqzZw9/credential'
I0323 23:20:01.364928   893 slave.cpp:243] Agent using credential for: test-principal
I0323 23:20:01.364938   893 credentials.hpp:37] Loading credentials for authentication from
'/tmp/Endpoint_SlaveEndpointTest_UnauthorizedRequest_1_FqzZw9/http_credentials'
I0323 23:20:01.365051   893 http.cpp:957] Creating default 'basic' HTTP authenticator for
realm 'mesos-agent-readonly'
I0323 23:20:01.365128   893 http.cpp:957] Creating default 'basic' HTTP authenticator for
realm 'mesos-agent-readwrite'
I0323 23:20:01.365749   893 slave.cpp:430] Agent resources: cpus(*):2; mem(*):1024; disk(*):1024;
ports(*):[31000-32000]
I0323 23:20:01.365818   893 slave.cpp:438] Agent attributes: [  ]
I0323 23:20:01.365828   893 slave.cpp:443] Agent hostname: df90cfdea248
I0323 23:20:01.365913   887 status_update_manager.cpp:177] Pausing sending status updates
I0323 23:20:01.366420   886 state.cpp:62] Recovering state from '/tmp/Endpoint_SlaveEndpointTest_UnauthorizedRequest_1_9LWhYH/meta'
I0323 23:20:01.366636   873 status_update_manager.cpp:203] Recovering status update manager
I0323 23:20:01.366736   886 containerizer.cpp:608] Recovering containerizer
I0323 23:20:01.367282   873 provisioner.cpp:410] Provisioner recovery complete
I0323 23:20:01.367465   893 slave.cpp:5638] Finished recovery
I0323 23:20:01.367782   893 slave.cpp:5820] Querying resource estimator for oversubscribable
resources
I0323 23:20:01.368003   891 slave.cpp:5834] Received oversubscribable resources {} from the
resource estimator
I0323 23:20:01.368844   877 process.cpp:3705] Handling HTTP event for process 'slave(713)'
with path: '/slave(713)/monitor/statistics.json'
I0323 23:20:01.369355   880 http.cpp:918] Authorizing principal 'test-principal' to GET the
'/monitor/statistics.json' endpoint
I0323 23:20:01.370527   891 slave.cpp:693] Agent terminating
[       OK ] Endpoint/SlaveEndpointTest.UnauthorizedRequest/1 (13 ms)
[ RUN      ] Endpoint/SlaveEndpointTest.UnauthorizedRequest/2
I0323 23:20:01.375670 26722 containerizer.cpp:221] Using isolation: posix/cpu,posix/mem,filesystem/posix,network/cni
W0323 23:20:01.375915 26722 backend.cpp:76] Failed to create 'aufs' backend: AufsBackend requires
root privileges
W0323 23:20:01.375951 26722 backend.cpp:76] Failed to create 'bind' backend: BindBackend requires
root privileges
I0323 23:20:01.375962 26722 provisioner.cpp:249] Using default backend 'copy'
I0323 23:20:01.377298   885 slave.cpp:210] Mesos agent started on (714)@172.17.0.2:44436
I0323 23:20:01.377328   885 slave.cpp:211] Flags at startup: --acls="" --appc_simple_discovery_uri_prefix="http://"
--appc_store_dir="/tmp/mesos/store/appc" --authenticate_http_readonly="true" --authenticate_http_readwrite="true"
--authenticatee="crammd5" --authentication_backoff_factor="1secs" --authorizer="local" --cgroups_cpu_enable_pids_and_tids_count="false"
--cgroups_enable_cfs="false" --cgroups_hierarchy="/sys/fs/cgroup" --cgroups_limit_swap="false"
--cgroups_root="mesos" --container_disk_watch_interval="15secs" --containerizers="mesos" --credential="/tmp/Endpoint_SlaveEndpointTest_UnauthorizedRequest_2_ptMoSV/credential"
--default_role="*" --disk_watch_interval="1mins" --docker="docker" --docker_kill_orphans="true"
--docker_registry="https://registry-1.docker.io" --docker_remove_delay="6hrs" --docker_socket="/var/run/docker.sock"
--docker_stop_timeout="0ns" --docker_store_dir="/tmp/mesos/store/docker" --docker_volume_checkpoint_dir="/var/run/mesos/isolators/docker/volume"
--enforce_container_disk_quota="false" --executor_registration_timeout="1mins" --executor_shutdown_grace_period="5secs"
--fetcher_cache_dir="/tmp/Endpoint_SlaveEndpointTest_UnauthorizedRequest_2_ptMoSV/fetch" --fetcher_cache_size="2GB"
--frameworks_home="" --gc_delay="1weeks" --gc_disk_headroom="0.1" --hadoop_home="" --help="false"
--hostname_lookup="true" --http_authenticators="basic" --http_command_executor="false" --http_credentials="/tmp/Endpoint_SlaveEndpointTest_UnauthorizedRequest_2_ptMoSV/http_credentials"
--http_heartbeat_interval="30secs" --initialize_driver_logging="true" --isolation="posix/cpu,posix/mem"
--launcher="posix" --launcher_dir="/mesos/build/src" --logbufsecs="0" --logging_level="INFO"
--max_completed_executors_per_framework="150" --oversubscribed_resources_interval="15secs"
--perf_duration="10secs" --perf_interval="1mins" --qos_correction_interval_min="0ns" --quiet="false"
--recover="reconnect" --recovery_timeout="15mins" --registration_backoff_factor="10ms" --resources="cpus:2;gpus:0;mem:1024;disk:1024;ports:[31000-32000]"
--revocable_cpu_low_priority="true" --runtime_dir="/tmp/Endpoint_SlaveEndpointTest_UnauthorizedRequest_2_ptMoSV"
--sandbox_directory="/mnt/mesos/sandbox" --strict="true" --switch_user="true" --systemd_enable_support="true"
--systemd_runtime_directory="/run/systemd/system" --version="false" --work_dir="/tmp/Endpoint_SlaveEndpointTest_UnauthorizedRequest_2_vr6Khu"
I0323 23:20:01.377614   885 credentials.hpp:86] Loading credential for authentication from
'/tmp/Endpoint_SlaveEndpointTest_UnauthorizedRequest_2_ptMoSV/credential'
I0323 23:20:01.377696   885 slave.cpp:243] Agent using credential for: test-principal
I0323 23:20:01.377707   885 credentials.hpp:37] Loading credentials for authentication from
'/tmp/Endpoint_SlaveEndpointTest_UnauthorizedRequest_2_ptMoSV/http_credentials'
I0323 23:20:01.377790   885 http.cpp:957] Creating default 'basic' HTTP authenticator for
realm 'mesos-agent-readonly'
I0323 23:20:01.377831   885 http.cpp:957] Creating default 'basic' HTTP authenticator for
realm 'mesos-agent-readwrite'
I0323 23:20:01.378288   885 slave.cpp:430] Agent resources: cpus(*):2; mem(*):1024; disk(*):1024;
ports(*):[31000-32000]
I0323 23:20:01.378331   885 slave.cpp:438] Agent attributes: [  ]
I0323 23:20:01.378342   885 slave.cpp:443] Agent hostname: df90cfdea248
I0323 23:20:01.378417   881 status_update_manager.cpp:177] Pausing sending status updates
I0323 23:20:01.378733   893 state.cpp:62] Recovering state from '/tmp/Endpoint_SlaveEndpointTest_UnauthorizedRequest_2_vr6Khu/meta'
I0323 23:20:01.378836   876 status_update_manager.cpp:203] Recovering status update manager
I0323 23:20:01.379071   894 containerizer.cpp:608] Recovering containerizer
I0323 23:20:01.379632   891 provisioner.cpp:410] Provisioner recovery complete
I0323 23:20:01.379863   892 slave.cpp:5638] Finished recovery
I0323 23:20:01.380137   892 slave.cpp:5820] Querying resource estimator for oversubscribable
resources
I0323 23:20:01.380209   895 slave.cpp:5834] Received oversubscribable resources {} from the
resource estimator
I0323 23:20:01.380997   883 process.cpp:3705] Handling HTTP event for process 'slave(714)'
with path: '/slave(714)/containers'
I0323 23:20:01.381501   888 http.cpp:918] Authorizing principal 'test-principal' to GET the
'/containers' endpoint
I0323 23:20:01.382472 26722 slave.cpp:693] Agent terminating
[       OK ] Endpoint/SlaveEndpointTest.UnauthorizedRequest/2 (12 ms)
[ RUN      ] Endpoint/SlaveEndpointTest.NoAuthorizer/0
I0323 23:20:01.389081 26722 containerizer.cpp:221] Using isolation: posix/cpu,posix/mem,filesystem/posix,network/cni
W0323 23:20:01.389363 26722 backend.cpp:76] Failed to create 'aufs' backend: AufsBackend requires
root privileges
W0323 23:20:01.389395 26722 backend.cpp:76] Failed to create 'bind' backend: BindBackend requires
root privileges
I0323 23:20:01.389405 26722 provisioner.cpp:249] Using default backend 'copy'
I0323 23:20:01.390113 26722 cluster.cpp:446] Creating default 'local' authorizer
I0323 23:20:01.390779   886 slave.cpp:210] Mesos agent started on (715)@172.17.0.2:44436
I0323 23:20:01.390807   886 slave.cpp:211] Flags at startup: --acls="" --appc_simple_discovery_uri_prefix="http://"
--appc_store_dir="/tmp/mesos/store/appc" --authenticate_http_readonly="true" --authenticate_http_readwrite="true"
--authenticatee="crammd5" --authentication_backoff_factor="1secs" --authorizer="local" --cgroups_cpu_enable_pids_and_tids_count="false"
--cgroups_enable_cfs="false" --cgroups_hierarchy="/sys/fs/cgroup" --cgroups_limit_swap="false"
--cgroups_root="mesos" --container_disk_watch_interval="15secs" --containerizers="mesos" --credential="/tmp/Endpoint_SlaveEndpointTest_NoAuthorizer_0_soKclI/credential"
--default_role="*" --disk_watch_interval="1mins" --docker="docker" --docker_kill_orphans="true"
--docker_registry="https://registry-1.docker.io" --docker_remove_delay="6hrs" --docker_socket="/var/run/docker.sock"
--docker_stop_timeout="0ns" --docker_store_dir="/tmp/mesos/store/docker" --docker_volume_checkpoint_dir="/var/run/mesos/isolators/docker/volume"
--enforce_container_disk_quota="false" --executor_registration_timeout="1mins" --executor_shutdown_grace_period="5secs"
--fetcher_cache_dir="/tmp/Endpoint_SlaveEndpointTest_NoAuthorizer_0_soKclI/fetch" --fetcher_cache_size="2GB"
--frameworks_home="" --gc_delay="1weeks" --gc_disk_headroom="0.1" --hadoop_home="" --help="false"
--hostname_lookup="true" --http_authenticators="basic" --http_command_executor="false" --http_credentials="/tmp/Endpoint_SlaveEndpointTest_NoAuthorizer_0_soKclI/http_credentials"
--http_heartbeat_interval="30secs" --initialize_driver_logging="true" --isolation="posix/cpu,posix/mem"
--launcher="posix" --launcher_dir="/mesos/build/src" --logbufsecs="0" --logging_level="INFO"
--max_completed_executors_per_framework="150" --oversubscribed_resources_interval="15secs"
--perf_duration="10secs" --perf_interval="1mins" --qos_correction_interval_min="0ns" --quiet="false"
--recover="reconnect" --recovery_timeout="15mins" --registration_backoff_factor="10ms" --resources="cpus:2;gpus:0;mem:1024;disk:1024;ports:[31000-32000]"
--revocable_cpu_low_priority="true" --runtime_dir="/tmp/Endpoint_SlaveEndpointTest_NoAuthorizer_0_soKclI"
--sandbox_directory="/mnt/mesos/sandbox" --strict="true" --switch_user="true" --systemd_enable_support="true"
--systemd_runtime_directory="/run/systemd/system" --version="false" --work_dir="/tmp/Endpoint_SlaveEndpointTest_NoAuthorizer_0_79GIIg"
I0323 23:20:01.391154   886 credentials.hpp:86] Loading credential for authentication from
'/tmp/Endpoint_SlaveEndpointTest_NoAuthorizer_0_soKclI/credential'
I0323 23:20:01.391227   886 slave.cpp:243] Agent using credential for: test-principal
I0323 23:20:01.391239   886 credentials.hpp:37] Loading credentials for authentication from
'/tmp/Endpoint_SlaveEndpointTest_NoAuthorizer_0_soKclI/http_credentials'
I0323 23:20:01.391330   886 http.cpp:957] Creating default 'basic' HTTP authenticator for
realm 'mesos-agent-readonly'
I0323 23:20:01.391371   886 http.cpp:957] Creating default 'basic' HTTP authenticator for
realm 'mesos-agent-readwrite'
I0323 23:20:01.391708   886 slave.cpp:430] Agent resources: cpus(*):2; mem(*):1024; disk(*):1024;
ports(*):[31000-32000]
I0323 23:20:01.391736   886 slave.cpp:438] Agent attributes: [  ]
I0323 23:20:01.391739   886 slave.cpp:443] Agent hostname: df90cfdea248
I0323 23:20:01.391789   892 status_update_manager.cpp:177] Pausing sending status updates
I0323 23:20:01.392119   896 state.cpp:62] Recovering state from '/tmp/Endpoint_SlaveEndpointTest_NoAuthorizer_0_79GIIg/meta'
I0323 23:20:01.392235   881 status_update_manager.cpp:203] Recovering status update manager
I0323 23:20:01.392377   888 containerizer.cpp:608] Recovering containerizer
I0323 23:20:01.392899   875 provisioner.cpp:410] Provisioner recovery complete
I0323 23:20:01.393146   879 slave.cpp:5638] Finished recovery
I0323 23:20:01.393496   879 slave.cpp:5820] Querying resource estimator for oversubscribable
resources
I0323 23:20:01.393669   887 slave.cpp:5834] Received oversubscribable resources {} from the
resource estimator
I0323 23:20:01.394359   877 process.cpp:3705] Handling HTTP event for process 'slave(715)'
with path: '/slave(715)/monitor/statistics'
I0323 23:20:01.394778   885 http.cpp:918] Authorizing principal 'test-principal' to GET the
'/monitor/statistics' endpoint
I0323 23:20:01.395980   875 slave.cpp:693] Agent terminating
[       OK ] Endpoint/SlaveEndpointTest.NoAuthorizer/0 (12 ms)
[ RUN      ] Endpoint/SlaveEndpointTest.NoAuthorizer/1
I0323 23:20:01.400738 26722 containerizer.cpp:221] Using isolation: posix/cpu,posix/mem,filesystem/posix,network/cni
W0323 23:20:01.401021 26722 backend.cpp:76] Failed to create 'aufs' backend: AufsBackend requires
root privileges
W0323 23:20:01.401062 26722 backend.cpp:76] Failed to create 'bind' backend: BindBackend requires
root privileges
I0323 23:20:01.401075 26722 provisioner.cpp:249] Using default backend 'copy'
I0323 23:20:01.401572 26722 cluster.cpp:446] Creating default 'local' authorizer
I0323 23:20:01.402086   880 slave.cpp:210] Mesos agent started on (716)@172.17.0.2:44436
I0323 23:20:01.402112   880 slave.cpp:211] Flags at startup: --acls="" --appc_simple_discovery_uri_prefix="http://"
--appc_store_dir="/tmp/mesos/store/appc" --authenticate_http_readonly="true" --authenticate_http_readwrite="true"
--authenticatee="crammd5" --authentication_backoff_factor="1secs" --authorizer="local" --cgroups_cpu_enable_pids_and_tids_count="false"
--cgroups_enable_cfs="false" --cgroups_hierarchy="/sys/fs/cgroup" --cgroups_limit_swap="false"
--cgroups_root="mesos" --container_disk_watch_interval="15secs" --containerizers="mesos" --credential="/tmp/Endpoint_SlaveEndpointTest_NoAuthorizer_1_DiPFVu/credential"
--default_role="*" --disk_watch_interval="1mins" --docker="docker" --docker_kill_orphans="true"
--docker_registry="https://registry-1.docker.io" --docker_remove_delay="6hrs" --docker_socket="/var/run/docker.sock"
--docker_stop_timeout="0ns" --docker_store_dir="/tmp/mesos/store/docker" --docker_volume_checkpoint_dir="/var/run/mesos/isolators/docker/volume"
--enforce_container_disk_quota="false" --executor_registration_timeout="1mins" --executor_shutdown_grace_period="5secs"
--fetcher_cache_dir="/tmp/Endpoint_SlaveEndpointTest_NoAuthorizer_1_DiPFVu/fetch" --fetcher_cache_size="2GB"
--frameworks_home="" --gc_delay="1weeks" --gc_disk_headroom="0.1" --hadoop_home="" --help="false"
--hostname_lookup="true" --http_authenticators="basic" --http_command_executor="false" --http_credentials="/tmp/Endpoint_SlaveEndpointTest_NoAuthorizer_1_DiPFVu/http_credentials"
--http_heartbeat_interval="30secs" --initialize_driver_logging="true" --isolation="posix/cpu,posix/mem"
--launcher="posix" --launcher_dir="/mesos/build/src" --logbufsecs="0" --logging_level="INFO"
--max_completed_executors_per_framework="150" --oversubscribed_resources_interval="15secs"
--perf_duration="10secs" --perf_interval="1mins" --qos_correction_interval_min="0ns" --quiet="false"
--recover="reconnect" --recovery_timeout="15mins" --registration_backoff_factor="10ms" --resources="cpus:2;gpus:0;mem:1024;disk:1024;ports:[31000-32000]"
--revocable_cpu_low_priority="true" --runtime_dir="/tmp/Endpoint_SlaveEndpointTest_NoAuthorizer_1_DiPFVu"
--sandbox_directory="/mnt/mesos/sandbox" --strict="true" --switch_user="true" --systemd_enable_support="true"
--systemd_runtime_directory="/run/systemd/system" --version="false" --work_dir="/tmp/Endpoint_SlaveEndpointTest_NoAuthorizer_1_K0Whh3"
I0323 23:20:01.402483   880 credentials.hpp:86] Loading credential for authentication from
'/tmp/Endpoint_SlaveEndpointTest_NoAuthorizer_1_DiPFVu/credential'
I0323 23:20:01.402575   880 slave.cpp:243] Agent using credential for: test-principal
I0323 23:20:01.402585   880 credentials.hpp:37] Loading credentials for authentication from
'/tmp/Endpoint_SlaveEndpointTest_NoAuthorizer_1_DiPFVu/http_credentials'
I0323 23:20:01.402675   880 http.cpp:957] Creating default 'basic' HTTP authenticator for
realm 'mesos-agent-readonly'
I0323 23:20:01.402725   880 http.cpp:957] Creating default 'basic' HTTP authenticator for
realm 'mesos-agent-readwrite'
I0323 23:20:01.403084   880 slave.cpp:430] Agent resources: cpus(*):2; mem(*):1024; disk(*):1024;
ports(*):[31000-32000]
I0323 23:20:01.403112   880 slave.cpp:438] Agent attributes: [  ]
I0323 23:20:01.403116   880 slave.cpp:443] Agent hostname: df90cfdea248
I0323 23:20:01.403187   889 status_update_manager.cpp:177] Pausing sending status updates
I0323 23:20:01.403518   879 state.cpp:62] Recovering state from '/tmp/Endpoint_SlaveEndpointTest_NoAuthorizer_1_K0Whh3/meta'
I0323 23:20:01.403686   881 status_update_manager.cpp:203] Recovering status update manager
I0323 23:20:01.403758   880 containerizer.cpp:608] Recovering containerizer
I0323 23:20:01.404171   875 provisioner.cpp:410] Provisioner recovery complete
I0323 23:20:01.404284   882 slave.cpp:5638] Finished recovery
I0323 23:20:01.404657   882 slave.cpp:5820] Querying resource estimator for oversubscribable
resources
I0323 23:20:01.404834   886 slave.cpp:5834] Received oversubscribable resources {} from the
resource estimator
I0323 23:20:01.405401   885 process.cpp:3705] Handling HTTP event for process 'slave(716)'
with path: '/slave(716)/monitor/statistics.json'
I0323 23:20:01.405880   879 http.cpp:918] Authorizing principal 'test-principal' to GET the
'/monitor/statistics.json' endpoint
I0323 23:20:01.407204   874 slave.cpp:693] Agent terminating
[       OK ] Endpoint/SlaveEndpointTest.NoAuthorizer/1 (11 ms)
[ RUN      ] Endpoint/SlaveEndpointTest.NoAuthorizer/2
I0323 23:20:01.412083 26722 containerizer.cpp:221] Using isolation: posix/cpu,posix/mem,filesystem/posix,network/cni
W0323 23:20:01.412323 26722 backend.cpp:76] Failed to create 'aufs' backend: AufsBackend requires
root privileges
W0323 23:20:01.412364 26722 backend.cpp:76] Failed to create 'bind' backend: BindBackend requires
root privileges
I0323 23:20:01.412374 26722 provisioner.cpp:249] Using default backend 'copy'
I0323 23:20:01.412833 26722 cluster.cpp:446] Creating default 'local' authorizer
I0323 23:20:01.413218   876 slave.cpp:210] Mesos agent started on (717)@172.17.0.2:44436
I0323 23:20:01.413259   876 slave.cpp:211] Flags at startup: --acls="" --appc_simple_discovery_uri_prefix="http://"
--appc_store_dir="/tmp/mesos/store/appc" --authenticate_http_readonly="true" --authenticate_http_readwrite="true"
--authenticatee="crammd5" --authentication_backoff_factor="1secs" --authorizer="local" --cgroups_cpu_enable_pids_and_tids_count="false"
--cgroups_enable_cfs="false" --cgroups_hierarchy="/sys/fs/cgroup" --cgroups_limit_swap="false"
--cgroups_root="mesos" --container_disk_watch_interval="15secs" --containerizers="mesos" --credential="/tmp/Endpoint_SlaveEndpointTest_NoAuthorizer_2_q3hRCh/credential"
--default_role="*" --disk_watch_interval="1mins" --docker="docker" --docker_kill_orphans="true"
--docker_registry="https://registry-1.docker.io" --docker_remove_delay="6hrs" --docker_socket="/var/run/docker.sock"
--docker_stop_timeout="0ns" --docker_store_dir="/tmp/mesos/store/docker" --docker_volume_checkpoint_dir="/var/run/mesos/isolators/docker/volume"
--enforce_container_disk_quota="false" --executor_registration_timeout="1mins" --executor_shutdown_grace_period="5secs"
--fetcher_cache_dir="/tmp/Endpoint_SlaveEndpointTest_NoAuthorizer_2_q3hRCh/fetch" --fetcher_cache_size="2GB"
--frameworks_home="" --gc_delay="1weeks" --gc_disk_headroom="0.1" --hadoop_home="" --help="false"
--hostname_lookup="true" --http_authenticators="basic" --http_command_executor="false" --http_credentials="/tmp/Endpoint_SlaveEndpointTest_NoAuthorizer_2_q3hRCh/http_credentials"
--http_heartbeat_interval="30secs" --initialize_driver_logging="true" --isolation="posix/cpu,posix/mem"
--launcher="posix" --launcher_dir="/mesos/build/src" --logbufsecs="0" --logging_level="INFO"
--max_completed_executors_per_framework="150" --oversubscribed_resources_interval="15secs"
--perf_duration="10secs" --perf_interval="1mins" --qos_correction_interval_min="0ns" --quiet="false"
--recover="reconnect" --recovery_timeout="15mins" --registration_backoff_factor="10ms" --resources="cpus:2;gpus:0;mem:1024;disk:1024;ports:[31000-32000]"
--revocable_cpu_low_priority="true" --runtime_dir="/tmp/Endpoint_SlaveEndpointTest_NoAuthorizer_2_q3hRCh"
--sandbox_directory="/mnt/mesos/sandbox" --strict="true" --switch_user="true" --systemd_enable_support="true"
--systemd_runtime_directory="/run/systemd/system" --version="false" --work_dir="/tmp/Endpoint_SlaveEndpointTest_NoAuthorizer_2_JjaNWP"
I0323 23:20:01.413555   876 credentials.hpp:86] Loading credential for authentication from
'/tmp/Endpoint_SlaveEndpointTest_NoAuthorizer_2_q3hRCh/credential'
I0323 23:20:01.413633   876 slave.cpp:243] Agent using credential for: test-principal
I0323 23:20:01.413647   876 credentials.hpp:37] Loading credentials for authentication from
'/tmp/Endpoint_SlaveEndpointTest_NoAuthorizer_2_q3hRCh/http_credentials'
I0323 23:20:01.413730   876 http.cpp:957] Creating default 'basic' HTTP authenticator for
realm 'mesos-agent-readonly'
I0323 23:20:01.413781   876 http.cpp:957] Creating default 'basic' HTTP authenticator for
realm 'mesos-agent-readwrite'
I0323 23:20:01.414247   876 slave.cpp:430] Agent resources: cpus(*):2; mem(*):1024; disk(*):1024;
ports(*):[31000-32000]
I0323 23:20:01.414284   876 slave.cpp:438] Agent attributes: [  ]
I0323 23:20:01.414291   876 slave.cpp:443] Agent hostname: df90cfdea248
I0323 23:20:01.414341   881 status_update_manager.cpp:177] Pausing sending status updates
I0323 23:20:01.414724   878 state.cpp:62] Recovering state from '/tmp/Endpoint_SlaveEndpointTest_NoAuthorizer_2_JjaNWP/meta'
I0323 23:20:01.414849   889 status_update_manager.cpp:203] Recovering status update manager
I0323 23:20:01.414974   875 containerizer.cpp:608] Recovering containerizer
I0323 23:20:01.415588   896 provisioner.cpp:410] Provisioner recovery complete
I0323 23:20:01.415807   885 slave.cpp:5638] Finished recovery
I0323 23:20:01.416661   885 slave.cpp:5820] Querying resource estimator for oversubscribable
resources
I0323 23:20:01.416754   885 slave.cpp:5834] Received oversubscribable resources {} from the
resource estimator
I0323 23:20:01.417349   883 process.cpp:3705] Handling HTTP event for process 'slave(717)'
with path: '/slave(717)/containers'
I0323 23:20:01.418015   896 http.cpp:918] Authorizing principal 'test-principal' to GET the
'/containers' endpoint
I0323 23:20:01.419523   894 slave.cpp:693] Agent terminating
[       OK ] Endpoint/SlaveEndpointTest.NoAuthorizer/2 (12 ms)
[----------] 9 tests from Endpoint/SlaveEndpointTest (244 ms total)

[----------] Global test environment tear-down
[==========] 1476 tests from 164 test cases ran. (201504 ms total)
[  PASSED  ] 1475 tests.
[  FAILED  ] 1 test, listed below:
[  FAILED  ] ContainerLoggerTest.LOGROTATE_RotateInSandbox

 1 FAILED TEST
  YOU HAVE 12 DISABLED TESTS

make[3]: *** [CMakeFiles/check] Error 1
make[3]: Leaving directory `/mesos/build'
make[2]: *** [CMakeFiles/check.dir/all] Error 2
make[2]: Leaving directory `/mesos/build'
make[1]: *** [CMakeFiles/check.dir/rule] Error 2
make[1]: Leaving directory `/mesos/build'
make: *** [check] Error 2
+ docker rmi mesos-1490309279-5355
Untagged: mesos-1490309279-5355:latest
Deleted: sha256:85be48d2ad145649002650d804c772b2c1bb8ea74979d59cce3b0c95375c2c38
Deleted: sha256:29c3b25b235c5807d47f79e7392e91468de63de3e4ea5f5a1e32b07eff260031
Deleted: sha256:832b638e77aa6b63f16a02ddbe1a2ad5984256e14a515c1dc2320ae5b00c928b
Deleted: sha256:91bc472f67b8c639c527468b9f6ad2f2478bfb6f165bcf21dd05c50c51a0abb5
Deleted: sha256:d22ff04beee48e95409736886043d54031d07c916171908d97c0b1378555aa0f
Deleted: sha256:d3b2f4fa4eb1ba92139bc1d125a7116b8c68d67bbc8f37481ab8b04cd8fb89d4
Deleted: sha256:aafacb4d11470a74e141b4718ff86e0164db3b705c7328c917dee6765d8cee0d
Deleted: sha256:b7ca9fb953766ec1d925f8d7b27b8292671f631661677605f26c1a9b74a0d9b8
Deleted: sha256:73da5b585b5e4463c2bedca6afd4774808080fa60306607ea0a9b9584343a833
Deleted: sha256:1b1c37a9f91a919585c8048b618e70af6873bd491b46414edf6be40967f8114d
Deleted: sha256:0fe3926acdbd0eeb84daa34801203d9a50d74ad8c4c42b54b23a646862e0242c
Deleted: sha256:93dfbc49167823a98be0f504b0ed53343ac00aff2d3db371c903561241d3d7f9
Deleted: sha256:ab26437e4bb234375a9ba75682ab67dcc2016a0c31ca49613ecdfe89782cd272
Deleted: sha256:c5f3697aadbaf26905f0e0e86252a4d36ae2c828fc93ddd0a761cf680c8722d6
Deleted: sha256:a08353568ab7f08036d395a3cbe367c27b7ec93669dfd20c12e70379195b705d
Deleted: sha256:6bdde9c9c71b23e7a50b722fd7d59c436a737bcdf63923dbfdf1d5dd36d0388b
Deleted: sha256:7fd60dfe512ac08b30e93424cae0608cdb6b3a8b9b15c0fac963d123e80e4530
Deleted: sha256:52e2556fef7b484a16f3e7543f72603ff6d1b126fb3850e009b20a13687c8503
Deleted: sha256:c6afb4b4f94eb078655b8b38ce6700509fe83a1e3a87ff0648ee3263e053a090
Deleted: sha256:07a8485ca4e83f62598acc468ce685fdbcf4cc38a99cc432f9659092d9e8063e
Deleted: sha256:e88214207c9f273a22176d685bf71c4b45ef21fcf3f48bbb47a938ba10320a00
Deleted: sha256:d4aa5a5ad6484b85c318d24fe4405632288e3f520b7d24de51a2758dfae8cf98
Deleted: sha256:4bae8acf26ff1dc4adf7e7e5d563ed4803c6bbe3730ba656bb4ddc9f3a804989
Deleted: sha256:6f66d48f53d5958a3921da06ad0fd9867b209b49eed2a84f5dfbad2f961887a9
Build step 'Execute shell' marked build as failure

Mime
View raw message