mesos-builds mailing list archives

Site index · List index
Message view « Date » · « Thread »
Top « Date » · « Thread »
From Apache Jenkins Server <jenk...@builds.apache.org>
Subject Build failed in Jenkins: Mesos-Buildbot » cmake,gcc,--verbose,GLOG_v=1 MESOS_VERBOSE=1,centos:7,(docker||Hadoop)&&(!ubuntu-us1)&&(!ubuntu-eu2) #3366
Date Mon, 13 Mar 2017 23:21:21 GMT
See <https://builds.apache.org/job/Mesos-Buildbot/BUILDTOOL=cmake,COMPILER=gcc,CONFIGURATION=--verbose,ENVIRONMENT=GLOG_v=1%20MESOS_VERBOSE=1,OS=centos%3A7,label_exp=(docker%7C%7CHadoop)&&(!ubuntu-us1)&&(!ubuntu-eu2)/3366/display/redirect?page=changes>

Changes:

[bmahler] Replace `.get().` in favor of the `->` operator in tests.

------------------------------------------
[...truncated 23.48 MB...]
I0313 23:21:15.149344 24428 status_update_manager.cpp:203] Recovering status update manager
I0313 23:21:15.149441 24430 containerizer.cpp:608] Recovering containerizer
I0313 23:21:15.150142 24430 provisioner.cpp:410] Provisioner recovery complete
I0313 23:21:15.150389 24432 slave.cpp:5564] Finished recovery
I0313 23:21:15.150837 24432 slave.cpp:5746] Querying resource estimator for oversubscribable
resources
I0313 23:21:15.150996 24423 slave.cpp:5760] Received oversubscribable resources {} from the
resource estimator
I0313 23:21:15.151747 24430 process.cpp:3705] Handling HTTP event for process 'slave(702)'
with path: '/slave(702)/monitor/statistics.json'
I0313 23:21:15.152393 24431 http.cpp:916] Authorizing principal 'test-principal' to GET the
'/monitor/statistics.json' endpoint
I0313 23:21:15.154042 24420 slave.cpp:808] Agent terminating
[       OK ] Endpoint/SlaveEndpointTest.AuthorizedRequest/1 (13 ms)
[ RUN      ] Endpoint/SlaveEndpointTest.AuthorizedRequest/2
I0313 23:21:15.159014 24418 containerizer.cpp:221] Using isolation: posix/cpu,posix/mem,filesystem/posix,network/cni
W0313 23:21:15.159278 24418 backend.cpp:76] Failed to create 'aufs' backend: AufsBackend requires
root privileges
W0313 23:21:15.159314 24418 backend.cpp:76] Failed to create 'bind' backend: BindBackend requires
root privileges
I0313 23:21:15.159379 24418 provisioner.cpp:249] Using default backend 'copy'
I0313 23:21:15.160576 24424 slave.cpp:215] Mesos agent started on (703)@172.17.0.3:41282
I0313 23:21:15.160595 24424 slave.cpp:216] Flags at startup: --acls="" --appc_simple_discovery_uri_prefix="http://"
--appc_store_dir="/tmp/mesos/store/appc" --authenticate_http_readonly="true" --authenticate_http_readwrite="true"
--authenticatee="crammd5" --authentication_backoff_factor="1secs" --authorizer="local" --cgroups_cpu_enable_pids_and_tids_count="false"
--cgroups_enable_cfs="false" --cgroups_hierarchy="/sys/fs/cgroup" --cgroups_limit_swap="false"
--cgroups_root="mesos" --container_disk_watch_interval="15secs" --containerizers="mesos" --credential="/tmp/Endpoint_SlaveEndpointTest_AuthorizedRequest_2_Uq3EnI/credential"
--default_role="*" --disk_watch_interval="1mins" --docker="docker" --docker_kill_orphans="true"
--docker_registry="https://registry-1.docker.io" --docker_remove_delay="6hrs" --docker_socket="/var/run/docker.sock"
--docker_stop_timeout="0ns" --docker_store_dir="/tmp/mesos/store/docker" --docker_volume_checkpoint_dir="/var/run/mesos/isolators/docker/volume"
--enforce_container_disk_quota="false" --executor_registration_timeout="1mins" --executor_shutdown_grace_period="5secs"
--fetcher_cache_dir="/tmp/Endpoint_SlaveEndpointTest_AuthorizedRequest_2_Uq3EnI/fetch" --fetcher_cache_size="2GB"
--frameworks_home="" --gc_delay="1weeks" --gc_disk_headroom="0.1" --hadoop_home="" --help="false"
--hostname_lookup="true" --http_authenticators="basic" --http_command_executor="false" --http_credentials="/tmp/Endpoint_SlaveEndpointTest_AuthorizedRequest_2_Uq3EnI/http_credentials"
--http_heartbeat_interval="30secs" --initialize_driver_logging="true" --isolation="posix/cpu,posix/mem"
--launcher="posix" --launcher_dir="/mesos/build/src" --logbufsecs="0" --logging_level="INFO"
--max_completed_executors_per_framework="150" --oversubscribed_resources_interval="15secs"
--perf_duration="10secs" --perf_interval="1mins" --qos_correction_interval_min="0ns" --quiet="false"
--recover="reconnect" --recovery_timeout="15mins" --registration_backoff_factor="10ms" --resources="cpus:2;gpus:0;mem:1024;disk:1024;ports:[31000-32000]"
--revocable_cpu_low_priority="true" --runtime_dir="/tmp/Endpoint_SlaveEndpointTest_AuthorizedRequest_2_Uq3EnI"
--sandbox_directory="/mnt/mesos/sandbox" --strict="true" --switch_user="true" --systemd_enable_support="true"
--systemd_runtime_directory="/run/systemd/system" --version="false" --work_dir="/tmp/Endpoint_SlaveEndpointTest_AuthorizedRequest_2_qQ3Bbe"
I0313 23:21:15.160888 24424 credentials.hpp:86] Loading credential for authentication from
'/tmp/Endpoint_SlaveEndpointTest_AuthorizedRequest_2_Uq3EnI/credential'
I0313 23:21:15.160984 24424 slave.cpp:358] Agent using credential for: test-principal
I0313 23:21:15.160998 24424 credentials.hpp:37] Loading credentials for authentication from
'/tmp/Endpoint_SlaveEndpointTest_AuthorizedRequest_2_Uq3EnI/http_credentials'
I0313 23:21:15.161093 24424 http.cpp:964] Using default 'basic' HTTP authenticator for realm
'mesos-agent-readonly'
I0313 23:21:15.161144 24424 http.cpp:964] Using default 'basic' HTTP authenticator for realm
'mesos-agent-readwrite'
I0313 23:21:15.161490 24424 slave.cpp:545] Agent resources: cpus(*):2; mem(*):1024; disk(*):1024;
ports(*):[31000-32000]
I0313 23:21:15.161531 24424 slave.cpp:553] Agent attributes: [  ]
I0313 23:21:15.161540 24424 slave.cpp:558] Agent hostname: cfe495f2955a
I0313 23:21:15.161609 24419 status_update_manager.cpp:177] Pausing sending status updates
I0313 23:21:15.161968 24434 state.cpp:62] Recovering state from '/tmp/Endpoint_SlaveEndpointTest_AuthorizedRequest_2_qQ3Bbe/meta'
I0313 23:21:15.162117 24430 status_update_manager.cpp:203] Recovering status update manager
I0313 23:21:15.162266 24422 containerizer.cpp:608] Recovering containerizer
I0313 23:21:15.162747 24430 provisioner.cpp:410] Provisioner recovery complete
I0313 23:21:15.162936 24430 slave.cpp:5564] Finished recovery
I0313 23:21:15.163355 24430 slave.cpp:5746] Querying resource estimator for oversubscribable
resources
I0313 23:21:15.163573 24433 slave.cpp:5760] Received oversubscribable resources {} from the
resource estimator
I0313 23:21:15.164376 24427 process.cpp:3705] Handling HTTP event for process 'slave(703)'
with path: '/slave(703)/containers'
I0313 23:21:15.164850 24430 http.cpp:916] Authorizing principal 'test-principal' to GET the
'/containers' endpoint
I0313 23:21:15.166497 24434 slave.cpp:808] Agent terminating
[       OK ] Endpoint/SlaveEndpointTest.AuthorizedRequest/2 (12 ms)
[ RUN      ] Endpoint/SlaveEndpointTest.UnauthorizedRequest/0
I0313 23:21:15.172128 24418 containerizer.cpp:221] Using isolation: posix/cpu,posix/mem,filesystem/posix,network/cni
W0313 23:21:15.172457 24418 backend.cpp:76] Failed to create 'aufs' backend: AufsBackend requires
root privileges
W0313 23:21:15.172500 24418 backend.cpp:76] Failed to create 'bind' backend: BindBackend requires
root privileges
I0313 23:21:15.172516 24418 provisioner.cpp:249] Using default backend 'copy'
I0313 23:21:15.173879 24423 slave.cpp:215] Mesos agent started on (704)@172.17.0.3:41282
I0313 23:21:15.173898 24423 slave.cpp:216] Flags at startup: --acls="" --appc_simple_discovery_uri_prefix="http://"
--appc_store_dir="/tmp/mesos/store/appc" --authenticate_http_readonly="true" --authenticate_http_readwrite="true"
--authenticatee="crammd5" --authentication_backoff_factor="1secs" --authorizer="local" --cgroups_cpu_enable_pids_and_tids_count="false"
--cgroups_enable_cfs="false" --cgroups_hierarchy="/sys/fs/cgroup" --cgroups_limit_swap="false"
--cgroups_root="mesos" --container_disk_watch_interval="15secs" --containerizers="mesos" --credential="/tmp/Endpoint_SlaveEndpointTest_UnauthorizedRequest_0_qGXKgF/credential"
--default_role="*" --disk_watch_interval="1mins" --docker="docker" --docker_kill_orphans="true"
--docker_registry="https://registry-1.docker.io" --docker_remove_delay="6hrs" --docker_socket="/var/run/docker.sock"
--docker_stop_timeout="0ns" --docker_store_dir="/tmp/mesos/store/docker" --docker_volume_checkpoint_dir="/var/run/mesos/isolators/docker/volume"
--enforce_container_disk_quota="false" --executor_registration_timeout="1mins" --executor_shutdown_grace_period="5secs"
--fetcher_cache_dir="/tmp/Endpoint_SlaveEndpointTest_UnauthorizedRequest_0_qGXKgF/fetch" --fetcher_cache_size="2GB"
--frameworks_home="" --gc_delay="1weeks" --gc_disk_headroom="0.1" --hadoop_home="" --help="false"
--hostname_lookup="true" --http_authenticators="basic" --http_command_executor="false" --http_credentials="/tmp/Endpoint_SlaveEndpointTest_UnauthorizedRequest_0_qGXKgF/http_credentials"
--http_heartbeat_interval="30secs" --initialize_driver_logging="true" --isolation="posix/cpu,posix/mem"
--launcher="posix" --launcher_dir="/mesos/build/src" --logbufsecs="0" --logging_level="INFO"
--max_completed_executors_per_framework="150" --oversubscribed_resources_interval="15secs"
--perf_duration="10secs" --perf_interval="1mins" --qos_correction_interval_min="0ns" --quiet="false"
--recover="reconnect" --recovery_timeout="15mins" --registration_backoff_factor="10ms" --resources="cpus:2;gpus:0;mem:1024;disk:1024;ports:[31000-32000]"
--revocable_cpu_low_priority="true" --runtime_dir="/tmp/Endpoint_SlaveEndpointTest_UnauthorizedRequest_0_qGXKgF"
--sandbox_directory="/mnt/mesos/sandbox" --strict="true" --switch_user="true" --systemd_enable_support="true"
--systemd_runtime_directory="/run/systemd/system" --version="false" --work_dir="/tmp/Endpoint_SlaveEndpointTest_UnauthorizedRequest_0_od0C2a"
I0313 23:21:15.174283 24423 credentials.hpp:86] Loading credential for authentication from
'/tmp/Endpoint_SlaveEndpointTest_UnauthorizedRequest_0_qGXKgF/credential'
I0313 23:21:15.174376 24423 slave.cpp:358] Agent using credential for: test-principal
I0313 23:21:15.174393 24423 credentials.hpp:37] Loading credentials for authentication from
'/tmp/Endpoint_SlaveEndpointTest_UnauthorizedRequest_0_qGXKgF/http_credentials'
I0313 23:21:15.174505 24423 http.cpp:964] Using default 'basic' HTTP authenticator for realm
'mesos-agent-readonly'
I0313 23:21:15.174556 24423 http.cpp:964] Using default 'basic' HTTP authenticator for realm
'mesos-agent-readwrite'
I0313 23:21:15.174983 24423 slave.cpp:545] Agent resources: cpus(*):2; mem(*):1024; disk(*):1024;
ports(*):[31000-32000]
I0313 23:21:15.175027 24423 slave.cpp:553] Agent attributes: [  ]
I0313 23:21:15.175040 24423 slave.cpp:558] Agent hostname: cfe495f2955a
I0313 23:21:15.175149 24424 status_update_manager.cpp:177] Pausing sending status updates
I0313 23:21:15.175474 24425 state.cpp:62] Recovering state from '/tmp/Endpoint_SlaveEndpointTest_UnauthorizedRequest_0_od0C2a/meta'
I0313 23:21:15.175695 24423 status_update_manager.cpp:203] Recovering status update manager
I0313 23:21:15.175813 24431 containerizer.cpp:608] Recovering containerizer
I0313 23:21:15.176430 24434 provisioner.cpp:410] Provisioner recovery complete
I0313 23:21:15.176728 24424 slave.cpp:5564] Finished recovery
I0313 23:21:15.177232 24424 slave.cpp:5746] Querying resource estimator for oversubscribable
resources
I0313 23:21:15.177376 24431 slave.cpp:5760] Received oversubscribable resources {} from the
resource estimator
I0313 23:21:15.178114 24430 process.cpp:3705] Handling HTTP event for process 'slave(704)'
with path: '/slave(704)/monitor/statistics'
I0313 23:21:15.178985 24433 http.cpp:916] Authorizing principal 'test-principal' to GET the
'/monitor/statistics' endpoint
I0313 23:21:15.180380 24430 slave.cpp:808] Agent terminating
[       OK ] Endpoint/SlaveEndpointTest.UnauthorizedRequest/0 (13 ms)
[ RUN      ] Endpoint/SlaveEndpointTest.UnauthorizedRequest/1
I0313 23:21:15.185675 24418 containerizer.cpp:221] Using isolation: posix/cpu,posix/mem,filesystem/posix,network/cni
W0313 23:21:15.186033 24418 backend.cpp:76] Failed to create 'aufs' backend: AufsBackend requires
root privileges
W0313 23:21:15.186076 24418 backend.cpp:76] Failed to create 'bind' backend: BindBackend requires
root privileges
I0313 23:21:15.186091 24418 provisioner.cpp:249] Using default backend 'copy'
I0313 23:21:15.187662 24433 slave.cpp:215] Mesos agent started on (705)@172.17.0.3:41282
I0313 23:21:15.187819 24433 slave.cpp:216] Flags at startup: --acls="" --appc_simple_discovery_uri_prefix="http://"
--appc_store_dir="/tmp/mesos/store/appc" --authenticate_http_readonly="true" --authenticate_http_readwrite="true"
--authenticatee="crammd5" --authentication_backoff_factor="1secs" --authorizer="local" --cgroups_cpu_enable_pids_and_tids_count="false"
--cgroups_enable_cfs="false" --cgroups_hierarchy="/sys/fs/cgroup" --cgroups_limit_swap="false"
--cgroups_root="mesos" --container_disk_watch_interval="15secs" --containerizers="mesos" --credential="/tmp/Endpoint_SlaveEndpointTest_UnauthorizedRequest_1_yq1IiC/credential"
--default_role="*" --disk_watch_interval="1mins" --docker="docker" --docker_kill_orphans="true"
--docker_registry="https://registry-1.docker.io" --docker_remove_delay="6hrs" --docker_socket="/var/run/docker.sock"
--docker_stop_timeout="0ns" --docker_store_dir="/tmp/mesos/store/docker" --docker_volume_checkpoint_dir="/var/run/mesos/isolators/docker/volume"
--enforce_container_disk_quota="false" --executor_registration_timeout="1mins" --executor_shutdown_grace_period="5secs"
--fetcher_cache_dir="/tmp/Endpoint_SlaveEndpointTest_UnauthorizedRequest_1_yq1IiC/fetch" --fetcher_cache_size="2GB"
--frameworks_home="" --gc_delay="1weeks" --gc_disk_headroom="0.1" --hadoop_home="" --help="false"
--hostname_lookup="true" --http_authenticators="basic" --http_command_executor="false" --http_credentials="/tmp/Endpoint_SlaveEndpointTest_UnauthorizedRequest_1_yq1IiC/http_credentials"
--http_heartbeat_interval="30secs" --initialize_driver_logging="true" --isolation="posix/cpu,posix/mem"
--launcher="posix" --launcher_dir="/mesos/build/src" --logbufsecs="0" --logging_level="INFO"
--max_completed_executors_per_framework="150" --oversubscribed_resources_interval="15secs"
--perf_duration="10secs" --perf_interval="1mins" --qos_correction_interval_min="0ns" --quiet="false"
--recover="reconnect" --recovery_timeout="15mins" --registration_backoff_factor="10ms" --resources="cpus:2;gpus:0;mem:1024;disk:1024;ports:[31000-32000]"
--revocable_cpu_low_priority="true" --runtime_dir="/tmp/Endpoint_SlaveEndpointTest_UnauthorizedRequest_1_yq1IiC"
--sandbox_directory="/mnt/mesos/sandbox" --strict="true" --switch_user="true" --systemd_enable_support="true"
--systemd_runtime_directory="/run/systemd/system" --version="false" --work_dir="/tmp/Endpoint_SlaveEndpointTest_UnauthorizedRequest_1_43lo27"
I0313 23:21:15.188149 24433 credentials.hpp:86] Loading credential for authentication from
'/tmp/Endpoint_SlaveEndpointTest_UnauthorizedRequest_1_yq1IiC/credential'
I0313 23:21:15.188314 24433 slave.cpp:358] Agent using credential for: test-principal
I0313 23:21:15.188328 24433 credentials.hpp:37] Loading credentials for authentication from
'/tmp/Endpoint_SlaveEndpointTest_UnauthorizedRequest_1_yq1IiC/http_credentials'
I0313 23:21:15.188459 24433 http.cpp:964] Using default 'basic' HTTP authenticator for realm
'mesos-agent-readonly'
I0313 23:21:15.188511 24433 http.cpp:964] Using default 'basic' HTTP authenticator for realm
'mesos-agent-readwrite'
I0313 23:21:15.189210 24433 slave.cpp:545] Agent resources: cpus(*):2; mem(*):1024; disk(*):1024;
ports(*):[31000-32000]
I0313 23:21:15.189246 24433 slave.cpp:553] Agent attributes: [  ]
I0313 23:21:15.189256 24433 slave.cpp:558] Agent hostname: cfe495f2955a
I0313 23:21:15.189424 24421 status_update_manager.cpp:177] Pausing sending status updates
I0313 23:21:15.189713 24427 state.cpp:62] Recovering state from '/tmp/Endpoint_SlaveEndpointTest_UnauthorizedRequest_1_43lo27/meta'
I0313 23:21:15.189945 24421 status_update_manager.cpp:203] Recovering status update manager
I0313 23:21:15.190048 24424 containerizer.cpp:608] Recovering containerizer
I0313 23:21:15.190654 24419 provisioner.cpp:410] Provisioner recovery complete
I0313 23:21:15.190909 24425 slave.cpp:5564] Finished recovery
I0313 23:21:15.191326 24425 slave.cpp:5746] Querying resource estimator for oversubscribable
resources
I0313 23:21:15.191630 24431 slave.cpp:5760] Received oversubscribable resources {} from the
resource estimator
I0313 23:21:15.192538 24423 process.cpp:3705] Handling HTTP event for process 'slave(705)'
with path: '/slave(705)/monitor/statistics.json'
I0313 23:21:15.193022 24427 http.cpp:916] Authorizing principal 'test-principal' to GET the
'/monitor/statistics.json' endpoint
I0313 23:21:15.194339 24424 slave.cpp:808] Agent terminating
[       OK ] Endpoint/SlaveEndpointTest.UnauthorizedRequest/1 (13 ms)
[ RUN      ] Endpoint/SlaveEndpointTest.UnauthorizedRequest/2
I0313 23:21:15.199492 24418 containerizer.cpp:221] Using isolation: posix/cpu,posix/mem,filesystem/posix,network/cni
W0313 23:21:15.199767 24418 backend.cpp:76] Failed to create 'aufs' backend: AufsBackend requires
root privileges
W0313 23:21:15.199805 24418 backend.cpp:76] Failed to create 'bind' backend: BindBackend requires
root privileges
I0313 23:21:15.199816 24418 provisioner.cpp:249] Using default backend 'copy'
I0313 23:21:15.201122 24427 slave.cpp:215] Mesos agent started on (706)@172.17.0.3:41282
I0313 23:21:15.201138 24427 slave.cpp:216] Flags at startup: --acls="" --appc_simple_discovery_uri_prefix="http://"
--appc_store_dir="/tmp/mesos/store/appc" --authenticate_http_readonly="true" --authenticate_http_readwrite="true"
--authenticatee="crammd5" --authentication_backoff_factor="1secs" --authorizer="local" --cgroups_cpu_enable_pids_and_tids_count="false"
--cgroups_enable_cfs="false" --cgroups_hierarchy="/sys/fs/cgroup" --cgroups_limit_swap="false"
--cgroups_root="mesos" --container_disk_watch_interval="15secs" --containerizers="mesos" --credential="/tmp/Endpoint_SlaveEndpointTest_UnauthorizedRequest_2_aabQtz/credential"
--default_role="*" --disk_watch_interval="1mins" --docker="docker" --docker_kill_orphans="true"
--docker_registry="https://registry-1.docker.io" --docker_remove_delay="6hrs" --docker_socket="/var/run/docker.sock"
--docker_stop_timeout="0ns" --docker_store_dir="/tmp/mesos/store/docker" --docker_volume_checkpoint_dir="/var/run/mesos/isolators/docker/volume"
--enforce_container_disk_quota="false" --executor_registration_timeout="1mins" --executor_shutdown_grace_period="5secs"
--fetcher_cache_dir="/tmp/Endpoint_SlaveEndpointTest_UnauthorizedRequest_2_aabQtz/fetch" --fetcher_cache_size="2GB"
--frameworks_home="" --gc_delay="1weeks" --gc_disk_headroom="0.1" --hadoop_home="" --help="false"
--hostname_lookup="true" --http_authenticators="basic" --http_command_executor="false" --http_credentials="/tmp/Endpoint_SlaveEndpointTest_UnauthorizedRequest_2_aabQtz/http_credentials"
--http_heartbeat_interval="30secs" --initialize_driver_logging="true" --isolation="posix/cpu,posix/mem"
--launcher="posix" --launcher_dir="/mesos/build/src" --logbufsecs="0" --logging_level="INFO"
--max_completed_executors_per_framework="150" --oversubscribed_resources_interval="15secs"
--perf_duration="10secs" --perf_interval="1mins" --qos_correction_interval_min="0ns" --quiet="false"
--recover="reconnect" --recovery_timeout="15mins" --registration_backoff_factor="10ms" --resources="cpus:2;gpus:0;mem:1024;disk:1024;ports:[31000-32000]"
--revocable_cpu_low_priority="true" --runtime_dir="/tmp/Endpoint_SlaveEndpointTest_UnauthorizedRequest_2_aabQtz"
--sandbox_directory="/mnt/mesos/sandbox" --strict="true" --switch_user="true" --systemd_enable_support="true"
--systemd_runtime_directory="/run/systemd/system" --version="false" --work_dir="/tmp/Endpoint_SlaveEndpointTest_UnauthorizedRequest_2_iEXdb5"
I0313 23:21:15.201455 24427 credentials.hpp:86] Loading credential for authentication from
'/tmp/Endpoint_SlaveEndpointTest_UnauthorizedRequest_2_aabQtz/credential'
I0313 23:21:15.201550 24427 slave.cpp:358] Agent using credential for: test-principal
I0313 23:21:15.201565 24427 credentials.hpp:37] Loading credentials for authentication from
'/tmp/Endpoint_SlaveEndpointTest_UnauthorizedRequest_2_aabQtz/http_credentials'
I0313 23:21:15.201658 24427 http.cpp:964] Using default 'basic' HTTP authenticator for realm
'mesos-agent-readonly'
I0313 23:21:15.201705 24427 http.cpp:964] Using default 'basic' HTTP authenticator for realm
'mesos-agent-readwrite'
I0313 23:21:15.202193 24427 slave.cpp:545] Agent resources: cpus(*):2; mem(*):1024; disk(*):1024;
ports(*):[31000-32000]
I0313 23:21:15.202229 24427 slave.cpp:553] Agent attributes: [  ]
I0313 23:21:15.202234 24427 slave.cpp:558] Agent hostname: cfe495f2955a
I0313 23:21:15.202365 24419 status_update_manager.cpp:177] Pausing sending status updates
I0313 23:21:15.202635 24424 state.cpp:62] Recovering state from '/tmp/Endpoint_SlaveEndpointTest_UnauthorizedRequest_2_iEXdb5/meta'
I0313 23:21:15.202764 24424 status_update_manager.cpp:203] Recovering status update manager
I0313 23:21:15.202848 24429 containerizer.cpp:608] Recovering containerizer
I0313 23:21:15.203439 24420 provisioner.cpp:410] Provisioner recovery complete
I0313 23:21:15.203654 24426 slave.cpp:5564] Finished recovery
I0313 23:21:15.204180 24426 slave.cpp:5746] Querying resource estimator for oversubscribable
resources
I0313 23:21:15.204311 24432 slave.cpp:5760] Received oversubscribable resources {} from the
resource estimator
I0313 23:21:15.205107 24421 process.cpp:3705] Handling HTTP event for process 'slave(706)'
with path: '/slave(706)/containers'
I0313 23:21:15.205677 24433 http.cpp:916] Authorizing principal 'test-principal' to GET the
'/containers' endpoint
I0313 23:21:15.206831 24418 slave.cpp:808] Agent terminating
[       OK ] Endpoint/SlaveEndpointTest.UnauthorizedRequest/2 (12 ms)
[ RUN      ] Endpoint/SlaveEndpointTest.NoAuthorizer/0
I0313 23:21:15.212754 24418 containerizer.cpp:221] Using isolation: posix/cpu,posix/mem,filesystem/posix,network/cni
W0313 23:21:15.213078 24418 backend.cpp:76] Failed to create 'aufs' backend: AufsBackend requires
root privileges
W0313 23:21:15.213122 24418 backend.cpp:76] Failed to create 'bind' backend: BindBackend requires
root privileges
I0313 23:21:15.213140 24418 provisioner.cpp:249] Using default backend 'copy'
I0313 23:21:15.213755 24418 cluster.cpp:446] Creating default 'local' authorizer
I0313 23:21:15.214316 24430 slave.cpp:215] Mesos agent started on (707)@172.17.0.3:41282
I0313 23:21:15.214339 24430 slave.cpp:216] Flags at startup: --acls="" --appc_simple_discovery_uri_prefix="http://"
--appc_store_dir="/tmp/mesos/store/appc" --authenticate_http_readonly="true" --authenticate_http_readwrite="true"
--authenticatee="crammd5" --authentication_backoff_factor="1secs" --authorizer="local" --cgroups_cpu_enable_pids_and_tids_count="false"
--cgroups_enable_cfs="false" --cgroups_hierarchy="/sys/fs/cgroup" --cgroups_limit_swap="false"
--cgroups_root="mesos" --container_disk_watch_interval="15secs" --containerizers="mesos" --credential="/tmp/Endpoint_SlaveEndpointTest_NoAuthorizer_0_ihZgNw/credential"
--default_role="*" --disk_watch_interval="1mins" --docker="docker" --docker_kill_orphans="true"
--docker_registry="https://registry-1.docker.io" --docker_remove_delay="6hrs" --docker_socket="/var/run/docker.sock"
--docker_stop_timeout="0ns" --docker_store_dir="/tmp/mesos/store/docker" --docker_volume_checkpoint_dir="/var/run/mesos/isolators/docker/volume"
--enforce_container_disk_quota="false" --executor_registration_timeout="1mins" --executor_shutdown_grace_period="5secs"
--fetcher_cache_dir="/tmp/Endpoint_SlaveEndpointTest_NoAuthorizer_0_ihZgNw/fetch" --fetcher_cache_size="2GB"
--frameworks_home="" --gc_delay="1weeks" --gc_disk_headroom="0.1" --hadoop_home="" --help="false"
--hostname_lookup="true" --http_authenticators="basic" --http_command_executor="false" --http_credentials="/tmp/Endpoint_SlaveEndpointTest_NoAuthorizer_0_ihZgNw/http_credentials"
--http_heartbeat_interval="30secs" --initialize_driver_logging="true" --isolation="posix/cpu,posix/mem"
--launcher="posix" --launcher_dir="/mesos/build/src" --logbufsecs="0" --logging_level="INFO"
--max_completed_executors_per_framework="150" --oversubscribed_resources_interval="15secs"
--perf_duration="10secs" --perf_interval="1mins" --qos_correction_interval_min="0ns" --quiet="false"
--recover="reconnect" --recovery_timeout="15mins" --registration_backoff_factor="10ms" --resources="cpus:2;gpus:0;mem:1024;disk:1024;ports:[31000-32000]"
--revocable_cpu_low_priority="true" --runtime_dir="/tmp/Endpoint_SlaveEndpointTest_NoAuthorizer_0_ihZgNw"
--sandbox_directory="/mnt/mesos/sandbox" --strict="true" --switch_user="true" --systemd_enable_support="true"
--systemd_runtime_directory="/run/systemd/system" --version="false" --work_dir="/tmp/Endpoint_SlaveEndpointTest_NoAuthorizer_0_adKzs2"
I0313 23:21:15.214695 24430 credentials.hpp:86] Loading credential for authentication from
'/tmp/Endpoint_SlaveEndpointTest_NoAuthorizer_0_ihZgNw/credential'
I0313 23:21:15.214815 24430 slave.cpp:358] Agent using credential for: test-principal
I0313 23:21:15.214828 24430 credentials.hpp:37] Loading credentials for authentication from
'/tmp/Endpoint_SlaveEndpointTest_NoAuthorizer_0_ihZgNw/http_credentials'
I0313 23:21:15.214929 24430 http.cpp:964] Using default 'basic' HTTP authenticator for realm
'mesos-agent-readonly'
I0313 23:21:15.214980 24430 http.cpp:964] Using default 'basic' HTTP authenticator for realm
'mesos-agent-readwrite'
I0313 23:21:15.215438 24430 slave.cpp:545] Agent resources: cpus(*):2; mem(*):1024; disk(*):1024;
ports(*):[31000-32000]
I0313 23:21:15.215476 24430 slave.cpp:553] Agent attributes: [  ]
I0313 23:21:15.215483 24430 slave.cpp:558] Agent hostname: cfe495f2955a
I0313 23:21:15.215572 24431 status_update_manager.cpp:177] Pausing sending status updates
I0313 23:21:15.215878 24434 state.cpp:62] Recovering state from '/tmp/Endpoint_SlaveEndpointTest_NoAuthorizer_0_adKzs2/meta'
I0313 23:21:15.216091 24434 status_update_manager.cpp:203] Recovering status update manager
I0313 23:21:15.216226 24429 containerizer.cpp:608] Recovering containerizer
I0313 23:21:15.216753 24423 provisioner.cpp:410] Provisioner recovery complete
I0313 23:21:15.216936 24420 slave.cpp:5564] Finished recovery
I0313 23:21:15.217401 24420 slave.cpp:5746] Querying resource estimator for oversubscribable
resources
I0313 23:21:15.217571 24430 slave.cpp:5760] Received oversubscribable resources {} from the
resource estimator
I0313 23:21:15.218318 24428 process.cpp:3705] Handling HTTP event for process 'slave(707)'
with path: '/slave(707)/monitor/statistics'
I0313 23:21:15.218835 24433 http.cpp:916] Authorizing principal 'test-principal' to GET the
'/monitor/statistics' endpoint
I0313 23:21:15.220289 24426 slave.cpp:808] Agent terminating
[       OK ] Endpoint/SlaveEndpointTest.NoAuthorizer/0 (12 ms)
[ RUN      ] Endpoint/SlaveEndpointTest.NoAuthorizer/1
I0313 23:21:15.225159 24418 containerizer.cpp:221] Using isolation: posix/cpu,posix/mem,filesystem/posix,network/cni
W0313 23:21:15.225455 24418 backend.cpp:76] Failed to create 'aufs' backend: AufsBackend requires
root privileges
W0313 23:21:15.225492 24418 backend.cpp:76] Failed to create 'bind' backend: BindBackend requires
root privileges
I0313 23:21:15.225503 24418 provisioner.cpp:249] Using default backend 'copy'
I0313 23:21:15.226018 24418 cluster.cpp:446] Creating default 'local' authorizer
I0313 23:21:15.226478 24420 slave.cpp:215] Mesos agent started on (708)@172.17.0.3:41282
I0313 23:21:15.226492 24420 slave.cpp:216] Flags at startup: --acls="" --appc_simple_discovery_uri_prefix="http://"
--appc_store_dir="/tmp/mesos/store/appc" --authenticate_http_readonly="true" --authenticate_http_readwrite="true"
--authenticatee="crammd5" --authentication_backoff_factor="1secs" --authorizer="local" --cgroups_cpu_enable_pids_and_tids_count="false"
--cgroups_enable_cfs="false" --cgroups_hierarchy="/sys/fs/cgroup" --cgroups_limit_swap="false"
--cgroups_root="mesos" --container_disk_watch_interval="15secs" --containerizers="mesos" --credential="/tmp/Endpoint_SlaveEndpointTest_NoAuthorizer_1_soI7eu/credential"
--default_role="*" --disk_watch_interval="1mins" --docker="docker" --docker_kill_orphans="true"
--docker_registry="https://registry-1.docker.io" --docker_remove_delay="6hrs" --docker_socket="/var/run/docker.sock"
--docker_stop_timeout="0ns" --docker_store_dir="/tmp/mesos/store/docker" --docker_volume_checkpoint_dir="/var/run/mesos/isolators/docker/volume"
--enforce_container_disk_quota="false" --executor_registration_timeout="1mins" --executor_shutdown_grace_period="5secs"
--fetcher_cache_dir="/tmp/Endpoint_SlaveEndpointTest_NoAuthorizer_1_soI7eu/fetch" --fetcher_cache_size="2GB"
--frameworks_home="" --gc_delay="1weeks" --gc_disk_headroom="0.1" --hadoop_home="" --help="false"
--hostname_lookup="true" --http_authenticators="basic" --http_command_executor="false" --http_credentials="/tmp/Endpoint_SlaveEndpointTest_NoAuthorizer_1_soI7eu/http_credentials"
--http_heartbeat_interval="30secs" --initialize_driver_logging="true" --isolation="posix/cpu,posix/mem"
--launcher="posix" --launcher_dir="/mesos/build/src" --logbufsecs="0" --logging_level="INFO"
--max_completed_executors_per_framework="150" --oversubscribed_resources_interval="15secs"
--perf_duration="10secs" --perf_interval="1mins" --qos_correction_interval_min="0ns" --quiet="false"
--recover="reconnect" --recovery_timeout="15mins" --registration_backoff_factor="10ms" --resources="cpus:2;gpus:0;mem:1024;disk:1024;ports:[31000-32000]"
--revocable_cpu_low_priority="true" --runtime_dir="/tmp/Endpoint_SlaveEndpointTest_NoAuthorizer_1_soI7eu"
--sandbox_directory="/mnt/mesos/sandbox" --strict="true" --switch_user="true" --systemd_enable_support="true"
--systemd_runtime_directory="/run/systemd/system" --version="false" --work_dir="/tmp/Endpoint_SlaveEndpointTest_NoAuthorizer_1_QeHlSZ"
I0313 23:21:15.226789 24420 credentials.hpp:86] Loading credential for authentication from
'/tmp/Endpoint_SlaveEndpointTest_NoAuthorizer_1_soI7eu/credential'
I0313 23:21:15.226872 24420 slave.cpp:358] Agent using credential for: test-principal
I0313 23:21:15.226886 24420 credentials.hpp:37] Loading credentials for authentication from
'/tmp/Endpoint_SlaveEndpointTest_NoAuthorizer_1_soI7eu/http_credentials'
I0313 23:21:15.226972 24420 http.cpp:964] Using default 'basic' HTTP authenticator for realm
'mesos-agent-readonly'
I0313 23:21:15.227145 24420 http.cpp:964] Using default 'basic' HTTP authenticator for realm
'mesos-agent-readwrite'
I0313 23:21:15.227634 24420 slave.cpp:545] Agent resources: cpus(*):2; mem(*):1024; disk(*):1024;
ports(*):[31000-32000]
I0313 23:21:15.227670 24420 slave.cpp:553] Agent attributes: [  ]
I0313 23:21:15.227677 24420 slave.cpp:558] Agent hostname: cfe495f2955a
I0313 23:21:15.227747 24424 status_update_manager.cpp:177] Pausing sending status updates
I0313 23:21:15.228119 24426 state.cpp:62] Recovering state from '/tmp/Endpoint_SlaveEndpointTest_NoAuthorizer_1_QeHlSZ/meta'
I0313 23:21:15.228322 24423 status_update_manager.cpp:203] Recovering status update manager
I0313 23:21:15.228451 24419 containerizer.cpp:608] Recovering containerizer
I0313 23:21:15.229035 24423 provisioner.cpp:410] Provisioner recovery complete
I0313 23:21:15.229346 24428 slave.cpp:5564] Finished recovery
I0313 23:21:15.229795 24428 slave.cpp:5746] Querying resource estimator for oversubscribable
resources
I0313 23:21:15.230096 24431 slave.cpp:5760] Received oversubscribable resources {} from the
resource estimator
I0313 23:21:15.230854 24425 process.cpp:3705] Handling HTTP event for process 'slave(708)'
with path: '/slave(708)/monitor/statistics.json'
I0313 23:21:15.231307 24431 http.cpp:916] Authorizing principal 'test-principal' to GET the
'/monitor/statistics.json' endpoint
I0313 23:21:15.232651 24426 slave.cpp:808] Agent terminating
[       OK ] Endpoint/SlaveEndpointTest.NoAuthorizer/1 (11 ms)
[ RUN      ] Endpoint/SlaveEndpointTest.NoAuthorizer/2
I0313 23:21:15.237476 24418 containerizer.cpp:221] Using isolation: posix/cpu,posix/mem,filesystem/posix,network/cni
W0313 23:21:15.237748 24418 backend.cpp:76] Failed to create 'aufs' backend: AufsBackend requires
root privileges
W0313 23:21:15.237795 24418 backend.cpp:76] Failed to create 'bind' backend: BindBackend requires
root privileges
I0313 23:21:15.237834 24418 provisioner.cpp:249] Using default backend 'copy'
I0313 23:21:15.238392 24418 cluster.cpp:446] Creating default 'local' authorizer
I0313 23:21:15.238860 24425 slave.cpp:215] Mesos agent started on (709)@172.17.0.3:41282
I0313 23:21:15.238878 24425 slave.cpp:216] Flags at startup: --acls="" --appc_simple_discovery_uri_prefix="http://"
--appc_store_dir="/tmp/mesos/store/appc" --authenticate_http_readonly="true" --authenticate_http_readwrite="true"
--authenticatee="crammd5" --authentication_backoff_factor="1secs" --authorizer="local" --cgroups_cpu_enable_pids_and_tids_count="false"
--cgroups_enable_cfs="false" --cgroups_hierarchy="/sys/fs/cgroup" --cgroups_limit_swap="false"
--cgroups_root="mesos" --container_disk_watch_interval="15secs" --containerizers="mesos" --credential="/tmp/Endpoint_SlaveEndpointTest_NoAuthorizer_2_0CBYOr/credential"
--default_role="*" --disk_watch_interval="1mins" --docker="docker" --docker_kill_orphans="true"
--docker_registry="https://registry-1.docker.io" --docker_remove_delay="6hrs" --docker_socket="/var/run/docker.sock"
--docker_stop_timeout="0ns" --docker_store_dir="/tmp/mesos/store/docker" --docker_volume_checkpoint_dir="/var/run/mesos/isolators/docker/volume"
--enforce_container_disk_quota="false" --executor_registration_timeout="1mins" --executor_shutdown_grace_period="5secs"
--fetcher_cache_dir="/tmp/Endpoint_SlaveEndpointTest_NoAuthorizer_2_0CBYOr/fetch" --fetcher_cache_size="2GB"
--frameworks_home="" --gc_delay="1weeks" --gc_disk_headroom="0.1" --hadoop_home="" --help="false"
--hostname_lookup="true" --http_authenticators="basic" --http_command_executor="false" --http_credentials="/tmp/Endpoint_SlaveEndpointTest_NoAuthorizer_2_0CBYOr/http_credentials"
--http_heartbeat_interval="30secs" --initialize_driver_logging="true" --isolation="posix/cpu,posix/mem"
--launcher="posix" --launcher_dir="/mesos/build/src" --logbufsecs="0" --logging_level="INFO"
--max_completed_executors_per_framework="150" --oversubscribed_resources_interval="15secs"
--perf_duration="10secs" --perf_interval="1mins" --qos_correction_interval_min="0ns" --quiet="false"
--recover="reconnect" --recovery_timeout="15mins" --registration_backoff_factor="10ms" --resources="cpus:2;gpus:0;mem:1024;disk:1024;ports:[31000-32000]"
--revocable_cpu_low_priority="true" --runtime_dir="/tmp/Endpoint_SlaveEndpointTest_NoAuthorizer_2_0CBYOr"
--sandbox_directory="/mnt/mesos/sandbox" --strict="true" --switch_user="true" --systemd_enable_support="true"
--systemd_runtime_directory="/run/systemd/system" --version="false" --work_dir="/tmp/Endpoint_SlaveEndpointTest_NoAuthorizer_2_YJQcqX"
I0313 23:21:15.239178 24425 credentials.hpp:86] Loading credential for authentication from
'/tmp/Endpoint_SlaveEndpointTest_NoAuthorizer_2_0CBYOr/credential'
I0313 23:21:15.239279 24425 slave.cpp:358] Agent using credential for: test-principal
I0313 23:21:15.239295 24425 credentials.hpp:37] Loading credentials for authentication from
'/tmp/Endpoint_SlaveEndpointTest_NoAuthorizer_2_0CBYOr/http_credentials'
I0313 23:21:15.239388 24425 http.cpp:964] Using default 'basic' HTTP authenticator for realm
'mesos-agent-readonly'
I0313 23:21:15.239439 24425 http.cpp:964] Using default 'basic' HTTP authenticator for realm
'mesos-agent-readwrite'
I0313 23:21:15.239784 24425 slave.cpp:545] Agent resources: cpus(*):2; mem(*):1024; disk(*):1024;
ports(*):[31000-32000]
I0313 23:21:15.239820 24425 slave.cpp:553] Agent attributes: [  ]
I0313 23:21:15.239832 24425 slave.cpp:558] Agent hostname: cfe495f2955a
I0313 23:21:15.239959 24423 status_update_manager.cpp:177] Pausing sending status updates
I0313 23:21:15.240286 24432 state.cpp:62] Recovering state from '/tmp/Endpoint_SlaveEndpointTest_NoAuthorizer_2_YJQcqX/meta'
I0313 23:21:15.240449 24424 status_update_manager.cpp:203] Recovering status update manager
I0313 23:21:15.240654 24419 containerizer.cpp:608] Recovering containerizer
I0313 23:21:15.241271 24431 provisioner.cpp:410] Provisioner recovery complete
I0313 23:21:15.241534 24426 slave.cpp:5564] Finished recovery
I0313 23:21:15.242008 24426 slave.cpp:5746] Querying resource estimator for oversubscribable
resources
I0313 23:21:15.242147 24429 slave.cpp:5760] Received oversubscribable resources {} from the
resource estimator
I0313 23:21:15.242842 24428 process.cpp:3705] Handling HTTP event for process 'slave(709)'
with path: '/slave(709)/containers'
I0313 23:21:15.243383 24425 http.cpp:916] Authorizing principal 'test-principal' to GET the
'/containers' endpoint
I0313 23:21:15.244765 24426 slave.cpp:808] Agent terminating
[       OK ] Endpoint/SlaveEndpointTest.NoAuthorizer/2 (12 ms)
[----------] 9 tests from Endpoint/SlaveEndpointTest (118 ms total)

[----------] Global test environment tear-down
[==========] 1462 tests from 160 test cases ran. (188636 ms total)
[  PASSED  ] 1461 tests.
[  FAILED  ] 1 test, listed below:
[  FAILED  ] OversubscriptionTest.RescindRevocableOfferWithIncreasedRevocable

 1 FAILED TEST
  YOU HAVE 12 DISABLED TESTS

make[3]: Leaving directory `/mesos/build'
make[3]: *** [CMakeFiles/check] Error 1
make[2]: *** [CMakeFiles/check.dir/all] Error 2
make[2]: Leaving directory `/mesos/build'
make[1]: *** [CMakeFiles/check.dir/rule] Error 2
make[1]: Leaving directory `/mesos/build'
make: *** [check] Error 2
+ docker rmi mesos-1489444380-24791
Untagged: mesos-1489444380-24791:latest
Deleted: sha256:94c6a54b5de9f8e9efcdd9496ff46fa43cec71c48ac319eb45dafde2c11b26ed
Deleted: sha256:52add97ac00a94946fb21985df69507637c23593b2ef1cb4822a023d97425f4e
Deleted: sha256:dfcac3acae7dd27966539a009ddde3ef4f03b19110c1105bf82885611298dccc
Deleted: sha256:02ab3b186f05c04339af3370f3ee0b95226633a449d14839c67ad702a241a6d4
Deleted: sha256:679563cbc70869cba6b743f0f51d8e02ac2aae9c7d79fd953042b345b37c1764
Deleted: sha256:287c6d709f78a5735843a3062629943d9d0ecbc136e6364d22fac91a3d2def29
Deleted: sha256:5d704d4de88bb64647ac343ef1b93c2a7953fdad08eff07e61ca2209e6e48dd0
Deleted: sha256:9256c8ff77939f2b27ea5114adbf84a85084185833e0482c2e228053751b5f02
Deleted: sha256:c68218016750e41731bd137193b845bd3499adbdf75154519ab007f436170f24
Deleted: sha256:b9f498d640b9ff0e2e8081d50958e0abbc50b6c071e813ebd923851b7b8369ed
Deleted: sha256:8c7b5017d6f48428ba707429994b75d0bd63ce1f47bb1aafc86d519fa6bdf356
Deleted: sha256:9d8f3f8fc8401e199eda1efaa0623812baf428b67b9a31a1329153e0c4742810
Deleted: sha256:2a0dc02040f31a09ed254c67697b4d93da42e07fd439a88a8822dff332f8057f
Deleted: sha256:f74d1c9b38b17fdeef411dc672532f5a2e26bd155d5ba5bb80e9cb84b1c5b6b4
Deleted: sha256:b4450f5136a7c14f262a47176dc5957458cb9ce3d381324a4c8a43df55689482
Deleted: sha256:7421d45fa6946ecc74744c3a7ce3f41f9d307cbe9cad3c5ee182e56f807bc6ed
Deleted: sha256:7013b04173985f439d5f9e22d1c6d42e717e96359edce589f8a763f92ada0e65
Deleted: sha256:1554b83e6086e243402aac1f278c07106d8a01e007063ee2342588b2753ef931
Deleted: sha256:976b795e12076c53e190801de63d4e398ec7a3726622a9623ebdd327cd8b9525
Deleted: sha256:92f1e0a7355296ac3624b3ba33d50b9a3675c529acc493df243fb81888b0acf2
Deleted: sha256:dbe790ac7fea69f68d6006b4726901d66f0dce98dadc19a7a279d27b0fc2e696
Deleted: sha256:18a6cc8b4274d7c2b28c29c6d2b2abda3534a99ec1bc2c1c44f77b8c4e9973ec
Deleted: sha256:266119228273b88b6ffdb3166f0395634c7b7c23f5c7729ba5a42a31c303be42
Deleted: sha256:797ca8fc50a24500fd9e0ebf616a4d066b59b7be51fd7475d60c7ab19c938d2c
Deleted: sha256:46d1098e39127e683dc7a2acda0cf71c4679e02cf6e8ebdcc066166a3a4c3ad9
Deleted: sha256:67591570dd29de0e124ee89d50458b098dbd83b12d73e5fdaf8b4dcbd4ea50f8
Build step 'Execute shell' marked build as failure

Mime
View raw message