mesos-builds mailing list archives

Site index · List index
Message view « Date » · « Thread »
Top « Date » · « Thread »
From Apache Jenkins Server <jenk...@builds.apache.org>
Subject Build failed in Jenkins: Mesos-Buildbot » autotools,gcc,--verbose,GLOG_v=1 MESOS_VERBOSE=1,centos:7,(docker||Hadoop)&&(!ubuntu-us1)&&(!ubuntu-eu2) #3367
Date Tue, 14 Mar 2017 01:10:10 GMT
See <https://builds.apache.org/job/Mesos-Buildbot/BUILDTOOL=autotools,COMPILER=gcc,CONFIGURATION=--verbose,ENVIRONMENT=GLOG_v=1%20MESOS_VERBOSE=1,OS=centos%3A7,label_exp=(docker%7C%7CHadoop)&&(!ubuntu-us1)&&(!ubuntu-eu2)/3367/display/redirect?page=changes>

Changes:

[bmahler] Added a test to ensure allocation roles are exposed in master API.

------------------------------------------
[...truncated 25.64 MB...]
I0314 01:09:57.744552 31473 containerizer.cpp:608] Recovering containerizer
I0314 01:09:57.746764 31473 provisioner.cpp:410] Provisioner recovery complete
I0314 01:09:57.747318 31472 slave.cpp:5564] Finished recovery
I0314 01:09:57.747830 31472 slave.cpp:5746] Querying resource estimator for oversubscribable
resources
I0314 01:09:57.748121 31478 slave.cpp:5760] Received oversubscribable resources {} from the
resource estimator
I0314 01:09:57.751129 31482 process.cpp:3705] Handling HTTP event for process 'slave(706)'
with path: '/slave(706)/monitor/statistics.json'
I0314 01:09:57.753051 31476 http.cpp:916] Authorizing principal 'test-principal' to GET the
'/monitor/statistics.json' endpoint
I0314 01:09:57.758888 31480 slave.cpp:808] Agent terminating
[       OK ] Endpoint/SlaveEndpointTest.AuthorizedRequest/1 (81 ms)
[ RUN      ] Endpoint/SlaveEndpointTest.AuthorizedRequest/2
I0314 01:09:57.788794 31450 containerizer.cpp:221] Using isolation: posix/cpu,posix/mem,filesystem/posix,network/cni
W0314 01:09:57.789556 31450 backend.cpp:76] Failed to create 'aufs' backend: AufsBackend requires
root privileges
W0314 01:09:57.789674 31450 backend.cpp:76] Failed to create 'bind' backend: BindBackend requires
root privileges
I0314 01:09:57.789722 31450 provisioner.cpp:249] Using default backend 'copy'
I0314 01:09:57.794437 31484 slave.cpp:215] Mesos agent started on (707)@172.17.0.3:57792
I0314 01:09:57.794481 31484 slave.cpp:216] Flags at startup: --acls="" --appc_simple_discovery_uri_prefix="http://"
--appc_store_dir="/tmp/mesos/store/appc" --authenticate_http_readonly="true" --authenticate_http_readwrite="true"
--authenticatee="crammd5" --authentication_backoff_factor="1secs" --authorizer="local" --cgroups_cpu_enable_pids_and_tids_count="false"
--cgroups_enable_cfs="false" --cgroups_hierarchy="/sys/fs/cgroup" --cgroups_limit_swap="false"
--cgroups_root="mesos" --container_disk_watch_interval="15secs" --containerizers="mesos" --credential="/tmp/Endpoint_SlaveEndpointTest_AuthorizedRequest_2_RsFkQG/credential"
--default_role="*" --disk_watch_interval="1mins" --docker="docker" --docker_kill_orphans="true"
--docker_registry="https://registry-1.docker.io" --docker_remove_delay="6hrs" --docker_socket="/var/run/docker.sock"
--docker_stop_timeout="0ns" --docker_store_dir="/tmp/mesos/store/docker" --docker_volume_checkpoint_dir="/var/run/mesos/isolators/docker/volume"
--enforce_container_disk_quota="false" --executor_registration_timeout="1mins" --executor_shutdown_grace_period="5secs"
--fetcher_cache_dir="/tmp/Endpoint_SlaveEndpointTest_AuthorizedRequest_2_RsFkQG/fetch" --fetcher_cache_size="2GB"
--frameworks_home="" --gc_delay="1weeks" --gc_disk_headroom="0.1" --hadoop_home="" --help="false"
--hostname_lookup="true" --http_authenticators="basic" --http_command_executor="false" --http_credentials="/tmp/Endpoint_SlaveEndpointTest_AuthorizedRequest_2_RsFkQG/http_credentials"
--http_heartbeat_interval="30secs" --initialize_driver_logging="true" --isolation="posix/cpu,posix/mem"
--launcher="posix" --launcher_dir="/mesos/mesos-1.3.0/_build/src" --logbufsecs="0" --logging_level="INFO"
--max_completed_executors_per_framework="150" --oversubscribed_resources_interval="15secs"
--perf_duration="10secs" --perf_interval="1mins" --qos_correction_interval_min="0ns" --quiet="false"
--recover="reconnect" --recovery_timeout="15mins" --registration_backoff_factor="10ms" --resources="cpus:2;gpus:0;mem:1024;disk:1024;ports:[31000-32000]"
--revocable_cpu_low_priority="true" --runtime_dir="/tmp/Endpoint_SlaveEndpointTest_AuthorizedRequest_2_RsFkQG"
--sandbox_directory="/mnt/mesos/sandbox" --strict="true" --switch_user="true" --systemd_enable_support="true"
--systemd_runtime_directory="/run/systemd/system" --version="false" --work_dir="/tmp/Endpoint_SlaveEndpointTest_AuthorizedRequest_2_kUJXlw"
I0314 01:09:57.795215 31484 credentials.hpp:86] Loading credential for authentication from
'/tmp/Endpoint_SlaveEndpointTest_AuthorizedRequest_2_RsFkQG/credential'
I0314 01:09:57.795450 31484 slave.cpp:358] Agent using credential for: test-principal
I0314 01:09:57.795478 31484 credentials.hpp:37] Loading credentials for authentication from
'/tmp/Endpoint_SlaveEndpointTest_AuthorizedRequest_2_RsFkQG/http_credentials'
I0314 01:09:57.795796 31484 http.cpp:964] Using default 'basic' HTTP authenticator for realm
'mesos-agent-readonly'
I0314 01:09:57.795963 31484 http.cpp:964] Using default 'basic' HTTP authenticator for realm
'mesos-agent-readwrite'
I0314 01:09:57.798014 31484 slave.cpp:545] Agent resources: cpus(*):2; mem(*):1024; disk(*):1024;
ports(*):[31000-32000]
I0314 01:09:57.798142 31484 slave.cpp:553] Agent attributes: [  ]
I0314 01:09:57.798164 31484 slave.cpp:558] Agent hostname: d309e68a3630
I0314 01:09:57.798333 31480 status_update_manager.cpp:177] Pausing sending status updates
I0314 01:09:57.800354 31484 state.cpp:62] Recovering state from '/tmp/Endpoint_SlaveEndpointTest_AuthorizedRequest_2_kUJXlw/meta'
I0314 01:09:57.800787 31484 status_update_manager.cpp:203] Recovering status update manager
I0314 01:09:57.800989 31484 containerizer.cpp:608] Recovering containerizer
I0314 01:09:57.802917 31484 provisioner.cpp:410] Provisioner recovery complete
I0314 01:09:57.803419 31484 slave.cpp:5564] Finished recovery
I0314 01:09:57.804641 31484 slave.cpp:5746] Querying resource estimator for oversubscribable
resources
I0314 01:09:57.805090 31484 slave.cpp:5760] Received oversubscribable resources {} from the
resource estimator
I0314 01:09:57.812068 31475 process.cpp:3705] Handling HTTP event for process 'slave(707)'
with path: '/slave(707)/containers'
I0314 01:09:57.814221 31474 http.cpp:916] Authorizing principal 'test-principal' to GET the
'/containers' endpoint
I0314 01:09:57.819500 31480 slave.cpp:808] Agent terminating
[       OK ] Endpoint/SlaveEndpointTest.AuthorizedRequest/2 (53 ms)
[ RUN      ] Endpoint/SlaveEndpointTest.UnauthorizedRequest/0
I0314 01:09:57.851888 31450 containerizer.cpp:221] Using isolation: posix/cpu,posix/mem,filesystem/posix,network/cni
W0314 01:09:57.852622 31450 backend.cpp:76] Failed to create 'aufs' backend: AufsBackend requires
root privileges
W0314 01:09:57.852778 31450 backend.cpp:76] Failed to create 'bind' backend: BindBackend requires
root privileges
I0314 01:09:57.852836 31450 provisioner.cpp:249] Using default backend 'copy'
I0314 01:09:57.857319 31475 slave.cpp:215] Mesos agent started on (708)@172.17.0.3:57792
I0314 01:09:57.857353 31475 slave.cpp:216] Flags at startup: --acls="" --appc_simple_discovery_uri_prefix="http://"
--appc_store_dir="/tmp/mesos/store/appc" --authenticate_http_readonly="true" --authenticate_http_readwrite="true"
--authenticatee="crammd5" --authentication_backoff_factor="1secs" --authorizer="local" --cgroups_cpu_enable_pids_and_tids_count="false"
--cgroups_enable_cfs="false" --cgroups_hierarchy="/sys/fs/cgroup" --cgroups_limit_swap="false"
--cgroups_root="mesos" --container_disk_watch_interval="15secs" --containerizers="mesos" --credential="/tmp/Endpoint_SlaveEndpointTest_UnauthorizedRequest_0_aiftkn/credential"
--default_role="*" --disk_watch_interval="1mins" --docker="docker" --docker_kill_orphans="true"
--docker_registry="https://registry-1.docker.io" --docker_remove_delay="6hrs" --docker_socket="/var/run/docker.sock"
--docker_stop_timeout="0ns" --docker_store_dir="/tmp/mesos/store/docker" --docker_volume_checkpoint_dir="/var/run/mesos/isolators/docker/volume"
--enforce_container_disk_quota="false" --executor_registration_timeout="1mins" --executor_shutdown_grace_period="5secs"
--fetcher_cache_dir="/tmp/Endpoint_SlaveEndpointTest_UnauthorizedRequest_0_aiftkn/fetch" --fetcher_cache_size="2GB"
--frameworks_home="" --gc_delay="1weeks" --gc_disk_headroom="0.1" --hadoop_home="" --help="false"
--hostname_lookup="true" --http_authenticators="basic" --http_command_executor="false" --http_credentials="/tmp/Endpoint_SlaveEndpointTest_UnauthorizedRequest_0_aiftkn/http_credentials"
--http_heartbeat_interval="30secs" --initialize_driver_logging="true" --isolation="posix/cpu,posix/mem"
--launcher="posix" --launcher_dir="/mesos/mesos-1.3.0/_build/src" --logbufsecs="0" --logging_level="INFO"
--max_completed_executors_per_framework="150" --oversubscribed_resources_interval="15secs"
--perf_duration="10secs" --perf_interval="1mins" --qos_correction_interval_min="0ns" --quiet="false"
--recover="reconnect" --recovery_timeout="15mins" --registration_backoff_factor="10ms" --resources="cpus:2;gpus:0;mem:1024;disk:1024;ports:[31000-32000]"
--revocable_cpu_low_priority="true" --runtime_dir="/tmp/Endpoint_SlaveEndpointTest_UnauthorizedRequest_0_aiftkn"
--sandbox_directory="/mnt/mesos/sandbox" --strict="true" --switch_user="true" --systemd_enable_support="true"
--systemd_runtime_directory="/run/systemd/system" --version="false" --work_dir="/tmp/Endpoint_SlaveEndpointTest_UnauthorizedRequest_0_uzg5Fc"
I0314 01:09:57.858029 31475 credentials.hpp:86] Loading credential for authentication from
'/tmp/Endpoint_SlaveEndpointTest_UnauthorizedRequest_0_aiftkn/credential'
I0314 01:09:57.858247 31475 slave.cpp:358] Agent using credential for: test-principal
I0314 01:09:57.858273 31475 credentials.hpp:37] Loading credentials for authentication from
'/tmp/Endpoint_SlaveEndpointTest_UnauthorizedRequest_0_aiftkn/http_credentials'
I0314 01:09:57.858563 31475 http.cpp:964] Using default 'basic' HTTP authenticator for realm
'mesos-agent-readonly'
I0314 01:09:57.858731 31475 http.cpp:964] Using default 'basic' HTTP authenticator for realm
'mesos-agent-readwrite'
I0314 01:09:57.860389 31475 slave.cpp:545] Agent resources: cpus(*):2; mem(*):1024; disk(*):1024;
ports(*):[31000-32000]
I0314 01:09:57.860484 31475 slave.cpp:553] Agent attributes: [  ]
I0314 01:09:57.860502 31475 slave.cpp:558] Agent hostname: d309e68a3630
I0314 01:09:57.860712 31484 status_update_manager.cpp:177] Pausing sending status updates
I0314 01:09:57.862345 31475 state.cpp:62] Recovering state from '/tmp/Endpoint_SlaveEndpointTest_UnauthorizedRequest_0_uzg5Fc/meta'
I0314 01:09:57.862805 31469 status_update_manager.cpp:203] Recovering status update manager
I0314 01:09:57.863112 31474 containerizer.cpp:608] Recovering containerizer
I0314 01:09:57.864711 31475 provisioner.cpp:410] Provisioner recovery complete
I0314 01:09:57.865098 31482 slave.cpp:5564] Finished recovery
I0314 01:09:57.865664 31482 slave.cpp:5746] Querying resource estimator for oversubscribable
resources
I0314 01:09:57.865962 31476 slave.cpp:5760] Received oversubscribable resources {} from the
resource estimator
I0314 01:09:57.868603 31476 process.cpp:3705] Handling HTTP event for process 'slave(708)'
with path: '/slave(708)/monitor/statistics'
I0314 01:09:57.869925 31471 http.cpp:916] Authorizing principal 'test-principal' to GET the
'/monitor/statistics' endpoint
I0314 01:09:57.872941 31479 slave.cpp:808] Agent terminating
[       OK ] Endpoint/SlaveEndpointTest.UnauthorizedRequest/0 (51 ms)
[ RUN      ] Endpoint/SlaveEndpointTest.UnauthorizedRequest/1
I0314 01:09:57.900099 31450 containerizer.cpp:221] Using isolation: posix/cpu,posix/mem,filesystem/posix,network/cni
W0314 01:09:57.900763 31450 backend.cpp:76] Failed to create 'aufs' backend: AufsBackend requires
root privileges
W0314 01:09:57.900869 31450 backend.cpp:76] Failed to create 'bind' backend: BindBackend requires
root privileges
I0314 01:09:57.900905 31450 provisioner.cpp:249] Using default backend 'copy'
I0314 01:09:57.904700 31472 slave.cpp:215] Mesos agent started on (709)@172.17.0.3:57792
I0314 01:09:57.904723 31472 slave.cpp:216] Flags at startup: --acls="" --appc_simple_discovery_uri_prefix="http://"
--appc_store_dir="/tmp/mesos/store/appc" --authenticate_http_readonly="true" --authenticate_http_readwrite="true"
--authenticatee="crammd5" --authentication_backoff_factor="1secs" --authorizer="local" --cgroups_cpu_enable_pids_and_tids_count="false"
--cgroups_enable_cfs="false" --cgroups_hierarchy="/sys/fs/cgroup" --cgroups_limit_swap="false"
--cgroups_root="mesos" --container_disk_watch_interval="15secs" --containerizers="mesos" --credential="/tmp/Endpoint_SlaveEndpointTest_UnauthorizedRequest_1_Wozfn4/credential"
--default_role="*" --disk_watch_interval="1mins" --docker="docker" --docker_kill_orphans="true"
--docker_registry="https://registry-1.docker.io" --docker_remove_delay="6hrs" --docker_socket="/var/run/docker.sock"
--docker_stop_timeout="0ns" --docker_store_dir="/tmp/mesos/store/docker" --docker_volume_checkpoint_dir="/var/run/mesos/isolators/docker/volume"
--enforce_container_disk_quota="false" --executor_registration_timeout="1mins" --executor_shutdown_grace_period="5secs"
--fetcher_cache_dir="/tmp/Endpoint_SlaveEndpointTest_UnauthorizedRequest_1_Wozfn4/fetch" --fetcher_cache_size="2GB"
--frameworks_home="" --gc_delay="1weeks" --gc_disk_headroom="0.1" --hadoop_home="" --help="false"
--hostname_lookup="true" --http_authenticators="basic" --http_command_executor="false" --http_credentials="/tmp/Endpoint_SlaveEndpointTest_UnauthorizedRequest_1_Wozfn4/http_credentials"
--http_heartbeat_interval="30secs" --initialize_driver_logging="true" --isolation="posix/cpu,posix/mem"
--launcher="posix" --launcher_dir="/mesos/mesos-1.3.0/_build/src" --logbufsecs="0" --logging_level="INFO"
--max_completed_executors_per_framework="150" --oversubscribed_resources_interval="15secs"
--perf_duration="10secs" --perf_interval="1mins" --qos_correction_interval_min="0ns" --quiet="false"
--recover="reconnect" --recovery_timeout="15mins" --registration_backoff_factor="10ms" --resources="cpus:2;gpus:0;mem:1024;disk:1024;ports:[31000-32000]"
--revocable_cpu_low_priority="true" --runtime_dir="/tmp/Endpoint_SlaveEndpointTest_UnauthorizedRequest_1_Wozfn4"
--sandbox_directory="/mnt/mesos/sandbox" --strict="true" --switch_user="true" --systemd_enable_support="true"
--systemd_runtime_directory="/run/systemd/system" --version="false" --work_dir="/tmp/Endpoint_SlaveEndpointTest_UnauthorizedRequest_1_SrwEAT"
I0314 01:09:57.905272 31472 credentials.hpp:86] Loading credential for authentication from
'/tmp/Endpoint_SlaveEndpointTest_UnauthorizedRequest_1_Wozfn4/credential'
I0314 01:09:57.931895 31472 slave.cpp:358] Agent using credential for: test-principal
I0314 01:09:57.931951 31472 credentials.hpp:37] Loading credentials for authentication from
'/tmp/Endpoint_SlaveEndpointTest_UnauthorizedRequest_1_Wozfn4/http_credentials'
I0314 01:09:57.932267 31472 http.cpp:964] Using default 'basic' HTTP authenticator for realm
'mesos-agent-readonly'
I0314 01:09:57.932490 31472 http.cpp:964] Using default 'basic' HTTP authenticator for realm
'mesos-agent-readwrite'
I0314 01:09:57.934044 31472 slave.cpp:545] Agent resources: cpus(*):2; mem(*):1024; disk(*):1024;
ports(*):[31000-32000]
I0314 01:09:57.934165 31472 slave.cpp:553] Agent attributes: [  ]
I0314 01:09:57.934181 31472 slave.cpp:558] Agent hostname: d309e68a3630
I0314 01:09:57.936053 31472 status_update_manager.cpp:177] Pausing sending status updates
I0314 01:09:57.936902 31472 state.cpp:62] Recovering state from '/tmp/Endpoint_SlaveEndpointTest_UnauthorizedRequest_1_SrwEAT/meta'
I0314 01:09:57.937443 31472 status_update_manager.cpp:203] Recovering status update manager
I0314 01:09:57.937655 31472 containerizer.cpp:608] Recovering containerizer
I0314 01:09:57.939872 31473 provisioner.cpp:410] Provisioner recovery complete
I0314 01:09:57.940408 31478 slave.cpp:5564] Finished recovery
I0314 01:09:57.941084 31478 slave.cpp:5746] Querying resource estimator for oversubscribable
resources
I0314 01:09:57.941367 31482 slave.cpp:5760] Received oversubscribable resources {} from the
resource estimator
I0314 01:09:57.944475 31470 process.cpp:3705] Handling HTTP event for process 'slave(709)'
with path: '/slave(709)/monitor/statistics.json'
I0314 01:09:57.946249 31470 http.cpp:916] Authorizing principal 'test-principal' to GET the
'/monitor/statistics.json' endpoint
I0314 01:09:57.949368 31470 slave.cpp:808] Agent terminating
[       OK ] Endpoint/SlaveEndpointTest.UnauthorizedRequest/1 (60 ms)
[ RUN      ] Endpoint/SlaveEndpointTest.UnauthorizedRequest/2
I0314 01:09:57.985556 31450 containerizer.cpp:221] Using isolation: posix/cpu,posix/mem,filesystem/posix,network/cni
W0314 01:09:57.986274 31450 backend.cpp:76] Failed to create 'aufs' backend: AufsBackend requires
root privileges
W0314 01:09:57.986419 31450 backend.cpp:76] Failed to create 'bind' backend: BindBackend requires
root privileges
I0314 01:09:57.986464 31450 provisioner.cpp:249] Using default backend 'copy'
I0314 01:09:57.992107 31472 slave.cpp:215] Mesos agent started on (710)@172.17.0.3:57792
I0314 01:09:57.992465 31472 slave.cpp:216] Flags at startup: --acls="" --appc_simple_discovery_uri_prefix="http://"
--appc_store_dir="/tmp/mesos/store/appc" --authenticate_http_readonly="true" --authenticate_http_readwrite="true"
--authenticatee="crammd5" --authentication_backoff_factor="1secs" --authorizer="local" --cgroups_cpu_enable_pids_and_tids_count="false"
--cgroups_enable_cfs="false" --cgroups_hierarchy="/sys/fs/cgroup" --cgroups_limit_swap="false"
--cgroups_root="mesos" --container_disk_watch_interval="15secs" --containerizers="mesos" --credential="/tmp/Endpoint_SlaveEndpointTest_UnauthorizedRequest_2_sWlEcM/credential"
--default_role="*" --disk_watch_interval="1mins" --docker="docker" --docker_kill_orphans="true"
--docker_registry="https://registry-1.docker.io" --docker_remove_delay="6hrs" --docker_socket="/var/run/docker.sock"
--docker_stop_timeout="0ns" --docker_store_dir="/tmp/mesos/store/docker" --docker_volume_checkpoint_dir="/var/run/mesos/isolators/docker/volume"
--enforce_container_disk_quota="false" --executor_registration_timeout="1mins" --executor_shutdown_grace_period="5secs"
--fetcher_cache_dir="/tmp/Endpoint_SlaveEndpointTest_UnauthorizedRequest_2_sWlEcM/fetch" --fetcher_cache_size="2GB"
--frameworks_home="" --gc_delay="1weeks" --gc_disk_headroom="0.1" --hadoop_home="" --help="false"
--hostname_lookup="true" --http_authenticators="basic" --http_command_executor="false" --http_credentials="/tmp/Endpoint_SlaveEndpointTest_UnauthorizedRequest_2_sWlEcM/http_credentials"
--http_heartbeat_interval="30secs" --initialize_driver_logging="true" --isolation="posix/cpu,posix/mem"
--launcher="posix" --launcher_dir="/mesos/mesos-1.3.0/_build/src" --logbufsecs="0" --logging_level="INFO"
--max_completed_executors_per_framework="150" --oversubscribed_resources_interval="15secs"
--perf_duration="10secs" --perf_interval="1mins" --qos_correction_interval_min="0ns" --quiet="false"
--recover="reconnect" --recovery_timeout="15mins" --registration_backoff_factor="10ms" --resources="cpus:2;gpus:0;mem:1024;disk:1024;ports:[31000-32000]"
--revocable_cpu_low_priority="true" --runtime_dir="/tmp/Endpoint_SlaveEndpointTest_UnauthorizedRequest_2_sWlEcM"
--sandbox_directory="/mnt/mesos/sandbox" --strict="true" --switch_user="true" --systemd_enable_support="true"
--systemd_runtime_directory="/run/systemd/system" --version="false" --work_dir="/tmp/Endpoint_SlaveEndpointTest_UnauthorizedRequest_2_S3OhcB"
I0314 01:09:57.993520 31472 credentials.hpp:86] Loading credential for authentication from
'/tmp/Endpoint_SlaveEndpointTest_UnauthorizedRequest_2_sWlEcM/credential'
I0314 01:09:57.993811 31472 slave.cpp:358] Agent using credential for: test-principal
I0314 01:09:57.993902 31472 credentials.hpp:37] Loading credentials for authentication from
'/tmp/Endpoint_SlaveEndpointTest_UnauthorizedRequest_2_sWlEcM/http_credentials'
I0314 01:09:57.994277 31472 http.cpp:964] Using default 'basic' HTTP authenticator for realm
'mesos-agent-readonly'
I0314 01:09:57.994534 31472 http.cpp:964] Using default 'basic' HTTP authenticator for realm
'mesos-agent-readwrite'
I0314 01:09:57.996778 31472 slave.cpp:545] Agent resources: cpus(*):2; mem(*):1024; disk(*):1024;
ports(*):[31000-32000]
I0314 01:09:57.996978 31472 slave.cpp:553] Agent attributes: [  ]
I0314 01:09:57.997040 31472 slave.cpp:558] Agent hostname: d309e68a3630
I0314 01:09:57.997325 31484 status_update_manager.cpp:177] Pausing sending status updates
I0314 01:09:58.000360 31483 state.cpp:62] Recovering state from '/tmp/Endpoint_SlaveEndpointTest_UnauthorizedRequest_2_S3OhcB/meta'
I0314 01:09:58.000898 31482 status_update_manager.cpp:203] Recovering status update manager
I0314 01:09:58.001117 31469 containerizer.cpp:608] Recovering containerizer
I0314 01:09:58.003355 31469 provisioner.cpp:410] Provisioner recovery complete
I0314 01:09:58.003963 31469 slave.cpp:5564] Finished recovery
I0314 01:09:58.004529 31469 slave.cpp:5746] Querying resource estimator for oversubscribable
resources
I0314 01:09:58.005182 31469 slave.cpp:5760] Received oversubscribable resources {} from the
resource estimator
I0314 01:09:58.009490 31481 process.cpp:3705] Handling HTTP event for process 'slave(710)'
with path: '/slave(710)/containers'
I0314 01:09:58.011505 31473 http.cpp:916] Authorizing principal 'test-principal' to GET the
'/containers' endpoint
I0314 01:09:58.015347 31450 slave.cpp:808] Agent terminating
[       OK ] Endpoint/SlaveEndpointTest.UnauthorizedRequest/2 (71 ms)
[ RUN      ] Endpoint/SlaveEndpointTest.NoAuthorizer/0
I0314 01:09:58.045869 31450 containerizer.cpp:221] Using isolation: posix/cpu,posix/mem,filesystem/posix,network/cni
W0314 01:09:58.046790 31450 backend.cpp:76] Failed to create 'aufs' backend: AufsBackend requires
root privileges
W0314 01:09:58.046926 31450 backend.cpp:76] Failed to create 'bind' backend: BindBackend requires
root privileges
I0314 01:09:58.046972 31450 provisioner.cpp:249] Using default backend 'copy'
I0314 01:09:58.049101 31450 cluster.cpp:446] Creating default 'local' authorizer
I0314 01:09:58.054533 31470 slave.cpp:215] Mesos agent started on (711)@172.17.0.3:57792
I0314 01:09:58.054572 31470 slave.cpp:216] Flags at startup: --acls="" --appc_simple_discovery_uri_prefix="http://"
--appc_store_dir="/tmp/mesos/store/appc" --authenticate_http_readonly="true" --authenticate_http_readwrite="true"
--authenticatee="crammd5" --authentication_backoff_factor="1secs" --authorizer="local" --cgroups_cpu_enable_pids_and_tids_count="false"
--cgroups_enable_cfs="false" --cgroups_hierarchy="/sys/fs/cgroup" --cgroups_limit_swap="false"
--cgroups_root="mesos" --container_disk_watch_interval="15secs" --containerizers="mesos" --credential="/tmp/Endpoint_SlaveEndpointTest_NoAuthorizer_0_ch4kDt/credential"
--default_role="*" --disk_watch_interval="1mins" --docker="docker" --docker_kill_orphans="true"
--docker_registry="https://registry-1.docker.io" --docker_remove_delay="6hrs" --docker_socket="/var/run/docker.sock"
--docker_stop_timeout="0ns" --docker_store_dir="/tmp/mesos/store/docker" --docker_volume_checkpoint_dir="/var/run/mesos/isolators/docker/volume"
--enforce_container_disk_quota="false" --executor_registration_timeout="1mins" --executor_shutdown_grace_period="5secs"
--fetcher_cache_dir="/tmp/Endpoint_SlaveEndpointTest_NoAuthorizer_0_ch4kDt/fetch" --fetcher_cache_size="2GB"
--frameworks_home="" --gc_delay="1weeks" --gc_disk_headroom="0.1" --hadoop_home="" --help="false"
--hostname_lookup="true" --http_authenticators="basic" --http_command_executor="false" --http_credentials="/tmp/Endpoint_SlaveEndpointTest_NoAuthorizer_0_ch4kDt/http_credentials"
--http_heartbeat_interval="30secs" --initialize_driver_logging="true" --isolation="posix/cpu,posix/mem"
--launcher="posix" --launcher_dir="/mesos/mesos-1.3.0/_build/src" --logbufsecs="0" --logging_level="INFO"
--max_completed_executors_per_framework="150" --oversubscribed_resources_interval="15secs"
--perf_duration="10secs" --perf_interval="1mins" --qos_correction_interval_min="0ns" --quiet="false"
--recover="reconnect" --recovery_timeout="15mins" --registration_backoff_factor="10ms" --resources="cpus:2;gpus:0;mem:1024;disk:1024;ports:[31000-32000]"
--revocable_cpu_low_priority="true" --runtime_dir="/tmp/Endpoint_SlaveEndpointTest_NoAuthorizer_0_ch4kDt"
--sandbox_directory="/mnt/mesos/sandbox" --strict="true" --switch_user="true" --systemd_enable_support="true"
--systemd_runtime_directory="/run/systemd/system" --version="false" --work_dir="/tmp/Endpoint_SlaveEndpointTest_NoAuthorizer_0_KlSDzj"
I0314 01:09:58.055308 31470 credentials.hpp:86] Loading credential for authentication from
'/tmp/Endpoint_SlaveEndpointTest_NoAuthorizer_0_ch4kDt/credential'
I0314 01:09:58.055562 31470 slave.cpp:358] Agent using credential for: test-principal
I0314 01:09:58.055939 31470 credentials.hpp:37] Loading credentials for authentication from
'/tmp/Endpoint_SlaveEndpointTest_NoAuthorizer_0_ch4kDt/http_credentials'
I0314 01:09:58.056262 31470 http.cpp:964] Using default 'basic' HTTP authenticator for realm
'mesos-agent-readonly'
I0314 01:09:58.056447 31470 http.cpp:964] Using default 'basic' HTTP authenticator for realm
'mesos-agent-readwrite'
I0314 01:09:58.058084 31470 slave.cpp:545] Agent resources: cpus(*):2; mem(*):1024; disk(*):1024;
ports(*):[31000-32000]
I0314 01:09:58.058203 31470 slave.cpp:553] Agent attributes: [  ]
I0314 01:09:58.058220 31470 slave.cpp:558] Agent hostname: d309e68a3630
I0314 01:09:58.058364 31483 status_update_manager.cpp:177] Pausing sending status updates
I0314 01:09:58.061380 31483 state.cpp:62] Recovering state from '/tmp/Endpoint_SlaveEndpointTest_NoAuthorizer_0_KlSDzj/meta'
I0314 01:09:58.061942 31483 status_update_manager.cpp:203] Recovering status update manager
I0314 01:09:58.062155 31483 containerizer.cpp:608] Recovering containerizer
I0314 01:09:58.064173 31483 provisioner.cpp:410] Provisioner recovery complete
I0314 01:09:58.064637 31483 slave.cpp:5564] Finished recovery
I0314 01:09:58.065191 31483 slave.cpp:5746] Querying resource estimator for oversubscribable
resources
I0314 01:09:58.065879 31483 slave.cpp:5760] Received oversubscribable resources {} from the
resource estimator
I0314 01:09:58.073196 31479 process.cpp:3705] Handling HTTP event for process 'slave(711)'
with path: '/slave(711)/monitor/statistics'
I0314 01:09:58.076002 31479 http.cpp:916] Authorizing principal 'test-principal' to GET the
'/monitor/statistics' endpoint
I0314 01:09:58.084255 31450 slave.cpp:808] Agent terminating
[       OK ] Endpoint/SlaveEndpointTest.NoAuthorizer/0 (63 ms)
[ RUN      ] Endpoint/SlaveEndpointTest.NoAuthorizer/1
I0314 01:09:58.105041 31450 containerizer.cpp:221] Using isolation: posix/cpu,posix/mem,filesystem/posix,network/cni
W0314 01:09:58.105773 31450 backend.cpp:76] Failed to create 'aufs' backend: AufsBackend requires
root privileges
W0314 01:09:58.105913 31450 backend.cpp:76] Failed to create 'bind' backend: BindBackend requires
root privileges
I0314 01:09:58.105962 31450 provisioner.cpp:249] Using default backend 'copy'
I0314 01:09:58.107954 31450 cluster.cpp:446] Creating default 'local' authorizer
I0314 01:09:58.111021 31484 slave.cpp:215] Mesos agent started on (712)@172.17.0.3:57792
I0314 01:09:58.111055 31484 slave.cpp:216] Flags at startup: --acls="" --appc_simple_discovery_uri_prefix="http://"
--appc_store_dir="/tmp/mesos/store/appc" --authenticate_http_readonly="true" --authenticate_http_readwrite="true"
--authenticatee="crammd5" --authentication_backoff_factor="1secs" --authorizer="local" --cgroups_cpu_enable_pids_and_tids_count="false"
--cgroups_enable_cfs="false" --cgroups_hierarchy="/sys/fs/cgroup" --cgroups_limit_swap="false"
--cgroups_root="mesos" --container_disk_watch_interval="15secs" --containerizers="mesos" --credential="/tmp/Endpoint_SlaveEndpointTest_NoAuthorizer_1_YFVtOc/credential"
--default_role="*" --disk_watch_interval="1mins" --docker="docker" --docker_kill_orphans="true"
--docker_registry="https://registry-1.docker.io" --docker_remove_delay="6hrs" --docker_socket="/var/run/docker.sock"
--docker_stop_timeout="0ns" --docker_store_dir="/tmp/mesos/store/docker" --docker_volume_checkpoint_dir="/var/run/mesos/isolators/docker/volume"
--enforce_container_disk_quota="false" --executor_registration_timeout="1mins" --executor_shutdown_grace_period="5secs"
--fetcher_cache_dir="/tmp/Endpoint_SlaveEndpointTest_NoAuthorizer_1_YFVtOc/fetch" --fetcher_cache_size="2GB"
--frameworks_home="" --gc_delay="1weeks" --gc_disk_headroom="0.1" --hadoop_home="" --help="false"
--hostname_lookup="true" --http_authenticators="basic" --http_command_executor="false" --http_credentials="/tmp/Endpoint_SlaveEndpointTest_NoAuthorizer_1_YFVtOc/http_credentials"
--http_heartbeat_interval="30secs" --initialize_driver_logging="true" --isolation="posix/cpu,posix/mem"
--launcher="posix" --launcher_dir="/mesos/mesos-1.3.0/_build/src" --logbufsecs="0" --logging_level="INFO"
--max_completed_executors_per_framework="150" --oversubscribed_resources_interval="15secs"
--perf_duration="10secs" --perf_interval="1mins" --qos_correction_interval_min="0ns" --quiet="false"
--recover="reconnect" --recovery_timeout="15mins" --registration_backoff_factor="10ms" --resources="cpus:2;gpus:0;mem:1024;disk:1024;ports:[31000-32000]"
--revocable_cpu_low_priority="true" --runtime_dir="/tmp/Endpoint_SlaveEndpointTest_NoAuthorizer_1_YFVtOc"
--sandbox_directory="/mnt/mesos/sandbox" --strict="true" --switch_user="true" --systemd_enable_support="true"
--systemd_runtime_directory="/run/systemd/system" --version="false" --work_dir="/tmp/Endpoint_SlaveEndpointTest_NoAuthorizer_1_qCUAu1"
I0314 01:09:58.111793 31484 credentials.hpp:86] Loading credential for authentication from
'/tmp/Endpoint_SlaveEndpointTest_NoAuthorizer_1_YFVtOc/credential'
I0314 01:09:58.112026 31484 slave.cpp:358] Agent using credential for: test-principal
I0314 01:09:58.112052 31484 credentials.hpp:37] Loading credentials for authentication from
'/tmp/Endpoint_SlaveEndpointTest_NoAuthorizer_1_YFVtOc/http_credentials'
I0314 01:09:58.112350 31484 http.cpp:964] Using default 'basic' HTTP authenticator for realm
'mesos-agent-readonly'
I0314 01:09:58.112536 31484 http.cpp:964] Using default 'basic' HTTP authenticator for realm
'mesos-agent-readwrite'
I0314 01:09:58.114434 31484 slave.cpp:545] Agent resources: cpus(*):2; mem(*):1024; disk(*):1024;
ports(*):[31000-32000]
I0314 01:09:58.114576 31484 slave.cpp:553] Agent attributes: [  ]
I0314 01:09:58.114599 31484 slave.cpp:558] Agent hostname: d309e68a3630
I0314 01:09:58.114804 31482 status_update_manager.cpp:177] Pausing sending status updates
I0314 01:09:58.117259 31470 state.cpp:62] Recovering state from '/tmp/Endpoint_SlaveEndpointTest_NoAuthorizer_1_qCUAu1/meta'
I0314 01:09:58.118010 31470 status_update_manager.cpp:203] Recovering status update manager
I0314 01:09:58.118341 31470 containerizer.cpp:608] Recovering containerizer
I0314 01:09:58.120561 31484 provisioner.cpp:410] Provisioner recovery complete
I0314 01:09:58.121217 31470 slave.cpp:5564] Finished recovery
I0314 01:09:58.121976 31470 slave.cpp:5746] Querying resource estimator for oversubscribable
resources
I0314 01:09:58.122357 31469 slave.cpp:5760] Received oversubscribable resources {} from the
resource estimator
I0314 01:09:58.126179 31473 process.cpp:3705] Handling HTTP event for process 'slave(712)'
with path: '/slave(712)/monitor/statistics.json'
I0314 01:09:58.128320 31474 http.cpp:916] Authorizing principal 'test-principal' to GET the
'/monitor/statistics.json' endpoint
I0314 01:09:58.133102 31450 slave.cpp:808] Agent terminating
[       OK ] Endpoint/SlaveEndpointTest.NoAuthorizer/1 (125 ms)
[ RUN      ] Endpoint/SlaveEndpointTest.NoAuthorizer/2
I0314 01:09:58.233294 31450 containerizer.cpp:221] Using isolation: posix/cpu,posix/mem,filesystem/posix,network/cni
W0314 01:09:58.234058 31450 backend.cpp:76] Failed to create 'aufs' backend: AufsBackend requires
root privileges
W0314 01:09:58.234192 31450 backend.cpp:76] Failed to create 'bind' backend: BindBackend requires
root privileges
I0314 01:09:58.234238 31450 provisioner.cpp:249] Using default backend 'copy'
I0314 01:09:58.236351 31450 cluster.cpp:446] Creating default 'local' authorizer
I0314 01:09:58.238872 31480 slave.cpp:215] Mesos agent started on (713)@172.17.0.3:57792
I0314 01:09:58.238914 31480 slave.cpp:216] Flags at startup: --acls="" --appc_simple_discovery_uri_prefix="http://"
--appc_store_dir="/tmp/mesos/store/appc" --authenticate_http_readonly="true" --authenticate_http_readwrite="true"
--authenticatee="crammd5" --authentication_backoff_factor="1secs" --authorizer="local" --cgroups_cpu_enable_pids_and_tids_count="false"
--cgroups_enable_cfs="false" --cgroups_hierarchy="/sys/fs/cgroup" --cgroups_limit_swap="false"
--cgroups_root="mesos" --container_disk_watch_interval="15secs" --containerizers="mesos" --credential="/tmp/Endpoint_SlaveEndpointTest_NoAuthorizer_2_Gnww8W/credential"
--default_role="*" --disk_watch_interval="1mins" --docker="docker" --docker_kill_orphans="true"
--docker_registry="https://registry-1.docker.io" --docker_remove_delay="6hrs" --docker_socket="/var/run/docker.sock"
--docker_stop_timeout="0ns" --docker_store_dir="/tmp/mesos/store/docker" --docker_volume_checkpoint_dir="/var/run/mesos/isolators/docker/volume"
--enforce_container_disk_quota="false" --executor_registration_timeout="1mins" --executor_shutdown_grace_period="5secs"
--fetcher_cache_dir="/tmp/Endpoint_SlaveEndpointTest_NoAuthorizer_2_Gnww8W/fetch" --fetcher_cache_size="2GB"
--frameworks_home="" --gc_delay="1weeks" --gc_disk_headroom="0.1" --hadoop_home="" --help="false"
--hostname_lookup="true" --http_authenticators="basic" --http_command_executor="false" --http_credentials="/tmp/Endpoint_SlaveEndpointTest_NoAuthorizer_2_Gnww8W/http_credentials"
--http_heartbeat_interval="30secs" --initialize_driver_logging="true" --isolation="posix/cpu,posix/mem"
--launcher="posix" --launcher_dir="/mesos/mesos-1.3.0/_build/src" --logbufsecs="0" --logging_level="INFO"
--max_completed_executors_per_framework="150" --oversubscribed_resources_interval="15secs"
--perf_duration="10secs" --perf_interval="1mins" --qos_correction_interval_min="0ns" --quiet="false"
--recover="reconnect" --recovery_timeout="15mins" --registration_backoff_factor="10ms" --resources="cpus:2;gpus:0;mem:1024;disk:1024;ports:[31000-32000]"
--revocable_cpu_low_priority="true" --runtime_dir="/tmp/Endpoint_SlaveEndpointTest_NoAuthorizer_2_Gnww8W"
--sandbox_directory="/mnt/mesos/sandbox" --strict="true" --switch_user="true" --systemd_enable_support="true"
--systemd_runtime_directory="/run/systemd/system" --version="false" --work_dir="/tmp/Endpoint_SlaveEndpointTest_NoAuthorizer_2_frS0tL"
I0314 01:09:58.239797 31480 credentials.hpp:86] Loading credential for authentication from
'/tmp/Endpoint_SlaveEndpointTest_NoAuthorizer_2_Gnww8W/credential'
I0314 01:09:58.240038 31480 slave.cpp:358] Agent using credential for: test-principal
I0314 01:09:58.240061 31480 credentials.hpp:37] Loading credentials for authentication from
'/tmp/Endpoint_SlaveEndpointTest_NoAuthorizer_2_Gnww8W/http_credentials'
I0314 01:09:58.240361 31480 http.cpp:964] Using default 'basic' HTTP authenticator for realm
'mesos-agent-readonly'
I0314 01:09:58.240552 31480 http.cpp:964] Using default 'basic' HTTP authenticator for realm
'mesos-agent-readwrite'
I0314 01:09:58.241946 31480 slave.cpp:545] Agent resources: cpus(*):2; mem(*):1024; disk(*):1024;
ports(*):[31000-32000]
I0314 01:09:58.242038 31480 slave.cpp:553] Agent attributes: [  ]
I0314 01:09:58.242054 31480 slave.cpp:558] Agent hostname: d309e68a3630
I0314 01:09:58.242229 31474 status_update_manager.cpp:177] Pausing sending status updates
I0314 01:09:58.244390 31473 state.cpp:62] Recovering state from '/tmp/Endpoint_SlaveEndpointTest_NoAuthorizer_2_frS0tL/meta'
I0314 01:09:58.244839 31473 status_update_manager.cpp:203] Recovering status update manager
I0314 01:09:58.245069 31479 containerizer.cpp:608] Recovering containerizer
I0314 01:09:58.246767 31483 provisioner.cpp:410] Provisioner recovery complete
I0314 01:09:58.247182 31475 slave.cpp:5564] Finished recovery
I0314 01:09:58.286331 31475 slave.cpp:5746] Querying resource estimator for oversubscribable
resources
I0314 01:09:58.286945 31475 slave.cpp:5760] Received oversubscribable resources {} from the
resource estimator
I0314 01:09:58.293812 31474 process.cpp:3705] Handling HTTP event for process 'slave(713)'
with path: '/slave(713)/containers'
I0314 01:09:58.296185 31475 http.cpp:916] Authorizing principal 'test-principal' to GET the
'/containers' endpoint
I0314 01:09:58.307067 31469 slave.cpp:808] Agent terminating
[       OK ] Endpoint/SlaveEndpointTest.NoAuthorizer/2 (110 ms)
[----------] 9 tests from Endpoint/SlaveEndpointTest (790 ms total)

[----------] Global test environment tear-down
[==========] 1513 tests from 168 test cases ran. (835025 ms total)
[  PASSED  ] 1512 tests.
[  FAILED  ] 1 test, listed below:
[  FAILED  ] ContentType/AgentAPITest.LaunchNestedContainerSessionDisconnected/1, where GetParam()
= application/json

 1 FAILED TEST
  YOU HAVE 12 DISABLED TESTS

make[4]: *** [check-local] Error 1
make[4]: Leaving directory `/mesos/mesos-1.3.0/_build/src'
make[3]: *** [check-am] Error 2
make[3]: Leaving directory `/mesos/mesos-1.3.0/_build/src'
make[2]: *** [check] Error 2
make[2]: Leaving directory `/mesos/mesos-1.3.0/_build/src'
make[1]: *** [check-recursive] Error 1
make[1]: Leaving directory `/mesos/mesos-1.3.0/_build'
make: *** [distcheck] Error 1
+ docker rmi mesos-1489449569-5169
Untagged: mesos-1489449569-5169:latest
Deleted: sha256:988d238a99106b85cbab9058cae821f5c0d0a0ad3b5cee8c3000d067c047fa3a
Deleted: sha256:800d0307b89b7f7eddaa4ecee113756815200578462b79f3847d5645e0ec4230
Deleted: sha256:c710bf85bf705d2fb983e023cfb86cf034cd3d723dcff962144952b7472dc921
Deleted: sha256:28a5073172e9c5180e34ce7d9208f26b15035d4d1e29ad07119082624f52d8e9
Deleted: sha256:d9ebf101f4b1427fc72b913fc7614a6da1a8373fae9eb457e2eb1e5c2be0b326
Deleted: sha256:6ed604ece10431c2f80717a6b46a7db2681a8a998eff608cd73e846a8c7e1200
Deleted: sha256:3fa9f29ae4b326e5b6eba29a38910db51759fec31623bb457170bd5186bb6fb6
Deleted: sha256:ed67eebd1df5f380c798b9379fe95e00260ccb3e5486a06c604516e3923e17ab
Deleted: sha256:b2bd5498ee8c09d62c395cf596f1fd07fb8dd9b239efd50dd66b10ec9953abb7
Deleted: sha256:6225ae196d12f3d36773e9e02603c59d0df7b8982419b16222b64fbefecdd38f
Deleted: sha256:78060c50676d97c0c91de3818020342bf13704b44ff40d1d7f1cb72ffff49ebf
Deleted: sha256:972e2816137a28c51c4a188941828030ad4eed5fd5e1778f279ab73a9f71bae2
Deleted: sha256:d56370d5388d3526dc6f1926b2ea91d7103d0b4e562a02effaf8856924a2f376
Deleted: sha256:75a4745e56fb72d1eb07a143501620b5c7e3515361e2c368807a81175bfd51a5
Deleted: sha256:cfd9f8e47fc6a44bce02455f982d7e41db930591cec7195201b528026f76d924
Deleted: sha256:ea5ddfbf7efb8ebe017a869f636e357bbfd14805d5fcbf5d467c0609798f2022
Deleted: sha256:ace369cdc0831c3baafb6ae324e64a0a8609f80894bf799c2c63a1d2988ec1e1
Deleted: sha256:c11824547be37172a2c785262ce29bdd420b0e84a72e123f9202221513dc3632
Deleted: sha256:dd4a33537550f47b0d583b37066e73b26f79664cd31b215b31e8b6acb03466ac
Deleted: sha256:03a121e1cbc57c599c0930834fe6c543a51c5cdf1b6408e76e4b530bd90bd030
Deleted: sha256:d5fae6c209f7f928bf07d7c7e5eec2cd23659e0112732ef50fbd2b29198bdda7
Deleted: sha256:9da118c56fabbabeceb45980aecf0cbbd7082484c48de323a7b0e8f756b9d10b
Deleted: sha256:094efd9bc7fae369636d0fb79b3f8f9d7f0fee8fc5422ac4ceeda053ad5b811c
Deleted: sha256:d6d4f161ce2667d1a7351c329f2dff5b033bab4b396248999ea4919a96abb938
Deleted: sha256:109bd433b9c89d77af773d3d3140014a2a818078aa1c473592fe0891b1410b68
Build step 'Execute shell' marked build as failure

Mime
View raw message