mesos-builds mailing list archives

Site index · List index
Message view « Date » · « Thread »
Top « Date » · « Thread »
From Apache Jenkins Server <jenk...@builds.apache.org>
Subject Build failed in Jenkins: Mesos-Buildbot » cmake,gcc,--verbose --enable-libevent --enable-ssl,GLOG_v=1 MESOS_VERBOSE=1,centos:7,(docker||Hadoop)&&(!ubuntu-us1)&&(!ubuntu-eu2) #3436
Date Thu, 30 Mar 2017 11:36:39 GMT
See <https://builds.apache.org/job/Mesos-Buildbot/BUILDTOOL=cmake,COMPILER=gcc,CONFIGURATION=--verbose%20--enable-libevent%20--enable-ssl,ENVIRONMENT=GLOG_v=1%20MESOS_VERBOSE=1,OS=centos%3A7,label_exp=(docker%7C%7CHadoop)&&(!ubuntu-us1)&&(!ubuntu-eu2)/3436/display/redirect?page=changes>

Changes:

[alexr] Linked tickets with JIRAs in Mesos 1.1.1 blogpost.

------------------------------------------
[...truncated 1.70 MB...]
I0330 11:36:26.923507 25085 openssl.cpp:435] Will only verify peer certificate if presented!
NOTE: Set LIBPROCESS_SSL_REQUIRE_CERT=1 to require peer certificate verification
I0330 11:36:26.926954 25085 process.cpp:1247] libprocess is initialized on 172.17.0.3:48767
with 16 worker threads
[       OK ] Scheme/HTTPTest.PipeFailure/0 (293 ms)
[ RUN      ] Scheme/HTTPTest.PipeFailure/1
I0330 11:36:26.929522 25085 process.cpp:1247] libprocess is initialized on 172.17.0.3:57431
with 16 worker threads
[       OK ] Scheme/HTTPTest.PipeFailure/1 (2 ms)
[ RUN      ] Scheme/HTTPTest.PipeReaderCloses/0
I0330 11:36:27.333256 25085 openssl.cpp:419] CA file path is unspecified! NOTE: Set CA file
path with LIBPROCESS_SSL_CA_FILE=<filepath>
I0330 11:36:27.333271 25085 openssl.cpp:424] CA directory path unspecified! NOTE: Set CA directory
path with LIBPROCESS_SSL_CA_DIR=<dirpath>
I0330 11:36:27.333276 25085 openssl.cpp:429] Will not verify peer certificate!
NOTE: Set LIBPROCESS_SSL_VERIFY_CERT=1 to enable peer certificate verification
I0330 11:36:27.333279 25085 openssl.cpp:435] Will only verify peer certificate if presented!
NOTE: Set LIBPROCESS_SSL_REQUIRE_CERT=1 to require peer certificate verification
I0330 11:36:27.334687 25085 process.cpp:1247] libprocess is initialized on 172.17.0.3:58162
with 16 worker threads
[       OK ] Scheme/HTTPTest.PipeReaderCloses/0 (406 ms)
[ RUN      ] Scheme/HTTPTest.PipeReaderCloses/1
I0330 11:36:27.336637 25085 process.cpp:1247] libprocess is initialized on 172.17.0.3:37534
with 16 worker threads
[       OK ] Scheme/HTTPTest.PipeReaderCloses/1 (1 ms)
[ RUN      ] Scheme/HTTPTest.Encode/0
I0330 11:36:27.662003 25085 openssl.cpp:419] CA file path is unspecified! NOTE: Set CA file
path with LIBPROCESS_SSL_CA_FILE=<filepath>
I0330 11:36:27.662029 25085 openssl.cpp:424] CA directory path unspecified! NOTE: Set CA directory
path with LIBPROCESS_SSL_CA_DIR=<dirpath>
I0330 11:36:27.662035 25085 openssl.cpp:429] Will not verify peer certificate!
NOTE: Set LIBPROCESS_SSL_VERIFY_CERT=1 to enable peer certificate verification
I0330 11:36:27.662040 25085 openssl.cpp:435] Will only verify peer certificate if presented!
NOTE: Set LIBPROCESS_SSL_REQUIRE_CERT=1 to require peer certificate verification
I0330 11:36:27.666899 25085 process.cpp:1247] libprocess is initialized on 172.17.0.3:54529
with 16 worker threads
[       OK ] Scheme/HTTPTest.Encode/0 (338 ms)
[ RUN      ] Scheme/HTTPTest.Encode/1
I0330 11:36:27.677286 25085 process.cpp:1247] libprocess is initialized on 172.17.0.3:50425
with 16 worker threads
[       OK ] Scheme/HTTPTest.Encode/1 (6 ms)
[ RUN      ] Scheme/HTTPTest.PathParse/0
I0330 11:36:28.460397 25085 openssl.cpp:419] CA file path is unspecified! NOTE: Set CA file
path with LIBPROCESS_SSL_CA_FILE=<filepath>
I0330 11:36:28.460419 25085 openssl.cpp:424] CA directory path unspecified! NOTE: Set CA directory
path with LIBPROCESS_SSL_CA_DIR=<dirpath>
I0330 11:36:28.460424 25085 openssl.cpp:429] Will not verify peer certificate!
NOTE: Set LIBPROCESS_SSL_VERIFY_CERT=1 to enable peer certificate verification
I0330 11:36:28.460428 25085 openssl.cpp:435] Will only verify peer certificate if presented!
NOTE: Set LIBPROCESS_SSL_REQUIRE_CERT=1 to require peer certificate verification
I0330 11:36:28.462513 25085 process.cpp:1247] libprocess is initialized on 172.17.0.3:52996
with 16 worker threads
[       OK ] Scheme/HTTPTest.PathParse/0 (782 ms)
[ RUN      ] Scheme/HTTPTest.PathParse/1
I0330 11:36:28.467384 25085 process.cpp:1247] libprocess is initialized on 172.17.0.3:34020
with 16 worker threads
[       OK ] Scheme/HTTPTest.PathParse/1 (5 ms)
[ RUN      ] Scheme/HTTPTest.Get/0
I0330 11:36:29.113340 25085 openssl.cpp:419] CA file path is unspecified! NOTE: Set CA file
path with LIBPROCESS_SSL_CA_FILE=<filepath>
I0330 11:36:29.113354 25085 openssl.cpp:424] CA directory path unspecified! NOTE: Set CA directory
path with LIBPROCESS_SSL_CA_DIR=<dirpath>
I0330 11:36:29.113359 25085 openssl.cpp:429] Will not verify peer certificate!
NOTE: Set LIBPROCESS_SSL_VERIFY_CERT=1 to enable peer certificate verification
I0330 11:36:29.113363 25085 openssl.cpp:435] Will only verify peer certificate if presented!
NOTE: Set LIBPROCESS_SSL_REQUIRE_CERT=1 to require peer certificate verification
I0330 11:36:29.115298 25085 process.cpp:1247] libprocess is initialized on 172.17.0.3:60466
with 16 worker threads
I0330 11:36:29.122200 26115 process.cpp:3705] Handling HTTP event for process '(83)' with
path: '/(83)/get'
I0330 11:36:29.126757 26115 process.cpp:3705] Handling HTTP event for process '(83)' with
path: '/(83)/get'
[       OK ] Scheme/HTTPTest.Get/0 (660 ms)
[ RUN      ] Scheme/HTTPTest.Get/1
I0330 11:36:29.129524 25085 process.cpp:1247] libprocess is initialized on 172.17.0.3:50253
with 16 worker threads
I0330 11:36:29.130281 26134 process.cpp:3705] Handling HTTP event for process '(84)' with
path: '/(84)/get'
I0330 11:36:29.131577 26130 process.cpp:3705] Handling HTTP event for process '(84)' with
path: '/(84)/get'
[       OK ] Scheme/HTTPTest.Get/1 (5 ms)
[ RUN      ] Scheme/HTTPTest.NestedGet/0
I0330 11:36:30.097371 25085 openssl.cpp:419] CA file path is unspecified! NOTE: Set CA file
path with LIBPROCESS_SSL_CA_FILE=<filepath>
I0330 11:36:30.097389 25085 openssl.cpp:424] CA directory path unspecified! NOTE: Set CA directory
path with LIBPROCESS_SSL_CA_DIR=<dirpath>
I0330 11:36:30.097393 25085 openssl.cpp:429] Will not verify peer certificate!
NOTE: Set LIBPROCESS_SSL_VERIFY_CERT=1 to enable peer certificate verification
I0330 11:36:30.097398 25085 openssl.cpp:435] Will only verify peer certificate if presented!
NOTE: Set LIBPROCESS_SSL_REQUIRE_CERT=1 to require peer certificate verification
I0330 11:36:30.104779 25085 process.cpp:1247] libprocess is initialized on 172.17.0.3:41348
with 16 worker threads
I0330 11:36:30.112295 26149 process.cpp:3705] Handling HTTP event for process '(85)' with
path: '/(85)//a/b/c'
I0330 11:36:30.119767 26143 process.cpp:3705] Handling HTTP event for process '(85)' with
path: '/(85)//a/b'
[       OK ] Scheme/HTTPTest.NestedGet/0 (989 ms)
[ RUN      ] Scheme/HTTPTest.NestedGet/1
I0330 11:36:30.124419 25085 process.cpp:1247] libprocess is initialized on 172.17.0.3:51124
with 16 worker threads
I0330 11:36:30.125087 26164 process.cpp:3705] Handling HTTP event for process '(86)' with
path: '/(86)//a/b/c'
I0330 11:36:30.126418 26168 process.cpp:3705] Handling HTTP event for process '(86)' with
path: '/(86)//a/b'
[       OK ] Scheme/HTTPTest.NestedGet/1 (6 ms)
[ RUN      ] Scheme/HTTPTest.StreamingGetComplete/0
I0330 11:36:30.395411 25085 openssl.cpp:419] CA file path is unspecified! NOTE: Set CA file
path with LIBPROCESS_SSL_CA_FILE=<filepath>
I0330 11:36:30.395431 25085 openssl.cpp:424] CA directory path unspecified! NOTE: Set CA directory
path with LIBPROCESS_SSL_CA_DIR=<dirpath>
I0330 11:36:30.395436 25085 openssl.cpp:429] Will not verify peer certificate!
NOTE: Set LIBPROCESS_SSL_VERIFY_CERT=1 to enable peer certificate verification
I0330 11:36:30.395439 25085 openssl.cpp:435] Will only verify peer certificate if presented!
NOTE: Set LIBPROCESS_SSL_REQUIRE_CERT=1 to require peer certificate verification
I0330 11:36:30.397305 25085 process.cpp:1247] libprocess is initialized on 172.17.0.3:45181
with 16 worker threads
I0330 11:36:30.402570 26182 process.cpp:3705] Handling HTTP event for process '(87)' with
path: '/(87)/pipe'
[       OK ] Scheme/HTTPTest.StreamingGetComplete/0 (316 ms)
[ RUN      ] Scheme/HTTPTest.StreamingGetComplete/1
I0330 11:36:30.444829 25085 process.cpp:1247] libprocess is initialized on 172.17.0.3:40479
with 16 worker threads
I0330 11:36:30.445575 26205 process.cpp:3705] Handling HTTP event for process '(88)' with
path: '/(88)/pipe'
[       OK ] Scheme/HTTPTest.StreamingGetComplete/1 (4 ms)
[ RUN      ] Scheme/HTTPTest.StreamingGetFailure/0
I0330 11:36:30.717469 25085 openssl.cpp:419] CA file path is unspecified! NOTE: Set CA file
path with LIBPROCESS_SSL_CA_FILE=<filepath>
I0330 11:36:30.717494 25085 openssl.cpp:424] CA directory path unspecified! NOTE: Set CA directory
path with LIBPROCESS_SSL_CA_DIR=<dirpath>
I0330 11:36:30.717501 25085 openssl.cpp:429] Will not verify peer certificate!
NOTE: Set LIBPROCESS_SSL_VERIFY_CERT=1 to enable peer certificate verification
I0330 11:36:30.717507 25085 openssl.cpp:435] Will only verify peer certificate if presented!
NOTE: Set LIBPROCESS_SSL_REQUIRE_CERT=1 to require peer certificate verification
I0330 11:36:30.719638 25085 process.cpp:1247] libprocess is initialized on 172.17.0.3:43580
with 16 worker threads
I0330 11:36:30.726272 26223 process.cpp:3705] Handling HTTP event for process '(89)' with
path: '/(89)/pipe'
I0330 11:36:30.766510 26214 process.cpp:1605] Failed to read from stream: oops
[       OK ] Scheme/HTTPTest.StreamingGetFailure/0 (320 ms)
[ RUN      ] Scheme/HTTPTest.StreamingGetFailure/1
I0330 11:36:30.769661 25085 process.cpp:1247] libprocess is initialized on 172.17.0.3:55809
with 16 worker threads
I0330 11:36:30.770498 26241 process.cpp:3705] Handling HTTP event for process '(90)' with
path: '/(90)/pipe'
I0330 11:36:30.771956 26238 process.cpp:1605] Failed to read from stream: oops
[       OK ] Scheme/HTTPTest.StreamingGetFailure/1 (5 ms)
[ RUN      ] Scheme/HTTPTest.PipeEquality/0
I0330 11:36:31.175119 25085 openssl.cpp:419] CA file path is unspecified! NOTE: Set CA file
path with LIBPROCESS_SSL_CA_FILE=<filepath>
I0330 11:36:31.175144 25085 openssl.cpp:424] CA directory path unspecified! NOTE: Set CA directory
path with LIBPROCESS_SSL_CA_DIR=<dirpath>
I0330 11:36:31.175149 25085 openssl.cpp:429] Will not verify peer certificate!
NOTE: Set LIBPROCESS_SSL_VERIFY_CERT=1 to enable peer certificate verification
I0330 11:36:31.175153 25085 openssl.cpp:435] Will only verify peer certificate if presented!
NOTE: Set LIBPROCESS_SSL_REQUIRE_CERT=1 to require peer certificate verification
I0330 11:36:31.176798 25085 process.cpp:1247] libprocess is initialized on 172.17.0.3:55076
with 16 worker threads
[       OK ] Scheme/HTTPTest.PipeEquality/0 (405 ms)
[ RUN      ] Scheme/HTTPTest.PipeEquality/1
I0330 11:36:31.179252 25085 process.cpp:1247] libprocess is initialized on 172.17.0.3:50071
with 16 worker threads
[       OK ] Scheme/HTTPTest.PipeEquality/1 (2 ms)
[ RUN      ] Scheme/HTTPTest.Post/0
I0330 11:36:31.496639 25085 openssl.cpp:419] CA file path is unspecified! NOTE: Set CA file
path with LIBPROCESS_SSL_CA_FILE=<filepath>
I0330 11:36:31.496654 25085 openssl.cpp:424] CA directory path unspecified! NOTE: Set CA directory
path with LIBPROCESS_SSL_CA_DIR=<dirpath>
I0330 11:36:31.496657 25085 openssl.cpp:429] Will not verify peer certificate!
NOTE: Set LIBPROCESS_SSL_VERIFY_CERT=1 to enable peer certificate verification
I0330 11:36:31.496661 25085 openssl.cpp:435] Will only verify peer certificate if presented!
NOTE: Set LIBPROCESS_SSL_REQUIRE_CERT=1 to require peer certificate verification
I0330 11:36:31.498694 25085 process.cpp:1247] libprocess is initialized on 172.17.0.3:52226
with 16 worker threads
I0330 11:36:31.504227 26282 process.cpp:3705] Handling HTTP event for process '(91)' with
path: '/(91)/post'
I0330 11:36:31.547832 26292 process.cpp:3705] Handling HTTP event for process '(91)' with
path: '/(91)/post'
[       OK ] Scheme/HTTPTest.Post/0 (408 ms)
[ RUN      ] Scheme/HTTPTest.Post/1
I0330 11:36:31.589171 25085 process.cpp:1247] libprocess is initialized on 172.17.0.3:40543
with 16 worker threads
I0330 11:36:31.590111 26301 process.cpp:3705] Handling HTTP event for process '(92)' with
path: '/(92)/post'
I0330 11:36:31.591625 26298 process.cpp:3705] Handling HTTP event for process '(92)' with
path: '/(92)/post'
[       OK ] Scheme/HTTPTest.Post/1 (5 ms)
[ RUN      ] Scheme/HTTPTest.Delete/0
I0330 11:36:31.831393 25085 openssl.cpp:419] CA file path is unspecified! NOTE: Set CA file
path with LIBPROCESS_SSL_CA_FILE=<filepath>
I0330 11:36:31.831420 25085 openssl.cpp:424] CA directory path unspecified! NOTE: Set CA directory
path with LIBPROCESS_SSL_CA_DIR=<dirpath>
I0330 11:36:31.831424 25085 openssl.cpp:429] Will not verify peer certificate!
NOTE: Set LIBPROCESS_SSL_VERIFY_CERT=1 to enable peer certificate verification
I0330 11:36:31.831429 25085 openssl.cpp:435] Will only verify peer certificate if presented!
NOTE: Set LIBPROCESS_SSL_REQUIRE_CERT=1 to require peer certificate verification
I0330 11:36:31.835289 25085 process.cpp:1247] libprocess is initialized on 172.17.0.3:48250
with 16 worker threads
I0330 11:36:31.840905 26317 process.cpp:3705] Handling HTTP event for process '(93)' with
path: '/(93)/delete'
[       OK ] Scheme/HTTPTest.Delete/0 (250 ms)
[ RUN      ] Scheme/HTTPTest.Delete/1
I0330 11:36:31.843950 25085 process.cpp:1247] libprocess is initialized on 172.17.0.3:37258
with 16 worker threads
I0330 11:36:31.844662 26342 process.cpp:3705] Handling HTTP event for process '(94)' with
path: '/(94)/delete'
[       OK ] Scheme/HTTPTest.Delete/1 (3 ms)
[ RUN      ] Scheme/HTTPTest.Request/0
I0330 11:36:32.276655 25085 openssl.cpp:419] CA file path is unspecified! NOTE: Set CA file
path with LIBPROCESS_SSL_CA_FILE=<filepath>
I0330 11:36:32.276685 25085 openssl.cpp:424] CA directory path unspecified! NOTE: Set CA directory
path with LIBPROCESS_SSL_CA_DIR=<dirpath>
I0330 11:36:32.276690 25085 openssl.cpp:429] Will not verify peer certificate!
NOTE: Set LIBPROCESS_SSL_VERIFY_CERT=1 to enable peer certificate verification
I0330 11:36:32.276695 25085 openssl.cpp:435] Will only verify peer certificate if presented!
NOTE: Set LIBPROCESS_SSL_REQUIRE_CERT=1 to require peer certificate verification
I0330 11:36:32.278697 25085 process.cpp:1247] libprocess is initialized on 172.17.0.3:48372
with 16 worker threads
I0330 11:36:32.284216 26357 process.cpp:3705] Handling HTTP event for process '(95)' with
path: '/(95)/request'
[       OK ] Scheme/HTTPTest.Request/0 (440 ms)
[ RUN      ] Scheme/HTTPTest.Request/1
I0330 11:36:32.287442 25085 process.cpp:1247] libprocess is initialized on 172.17.0.3:45108
with 16 worker threads
I0330 11:36:32.288128 26367 process.cpp:3705] Handling HTTP event for process '(96)' with
path: '/(96)/request'
[       OK ] Scheme/HTTPTest.Request/1 (8 ms)
[ RUN      ] Scheme/HTTPTest.QueryEncodeDecode/0
I0330 11:36:32.359148 25085 openssl.cpp:419] CA file path is unspecified! NOTE: Set CA file
path with LIBPROCESS_SSL_CA_FILE=<filepath>
I0330 11:36:32.359179 25085 openssl.cpp:424] CA directory path unspecified! NOTE: Set CA directory
path with LIBPROCESS_SSL_CA_DIR=<dirpath>
I0330 11:36:32.359184 25085 openssl.cpp:429] Will not verify peer certificate!
NOTE: Set LIBPROCESS_SSL_VERIFY_CERT=1 to enable peer certificate verification
I0330 11:36:32.359187 25085 openssl.cpp:435] Will only verify peer certificate if presented!
NOTE: Set LIBPROCESS_SSL_REQUIRE_CERT=1 to require peer certificate verification
I0330 11:36:32.363389 25085 process.cpp:1247] libprocess is initialized on 172.17.0.3:60479
with 16 worker threads
[       OK ] Scheme/HTTPTest.QueryEncodeDecode/0 (70 ms)
[ RUN      ] Scheme/HTTPTest.QueryEncodeDecode/1
I0330 11:36:32.366917 25085 process.cpp:1247] libprocess is initialized on 172.17.0.3:45786
with 16 worker threads
[       OK ] Scheme/HTTPTest.QueryEncodeDecode/1 (4 ms)
[ RUN      ] Scheme/HTTPTest.Headers/0
I0330 11:36:32.761487 25085 openssl.cpp:419] CA file path is unspecified! NOTE: Set CA file
path with LIBPROCESS_SSL_CA_FILE=<filepath>
I0330 11:36:32.761513 25085 openssl.cpp:424] CA directory path unspecified! NOTE: Set CA directory
path with LIBPROCESS_SSL_CA_DIR=<dirpath>
I0330 11:36:32.761518 25085 openssl.cpp:429] Will not verify peer certificate!
NOTE: Set LIBPROCESS_SSL_VERIFY_CERT=1 to enable peer certificate verification
I0330 11:36:32.761523 25085 openssl.cpp:435] Will only verify peer certificate if presented!
NOTE: Set LIBPROCESS_SSL_REQUIRE_CERT=1 to require peer certificate verification
I0330 11:36:32.763305 25085 process.cpp:1247] libprocess is initialized on 172.17.0.3:40552
with 16 worker threads
[       OK ] Scheme/HTTPTest.Headers/0 (396 ms)
[ RUN      ] Scheme/HTTPTest.Headers/1
I0330 11:36:32.765085 25085 process.cpp:1247] libprocess is initialized on 172.17.0.3:49973
with 16 worker threads
[       OK ] Scheme/HTTPTest.Headers/1 (2 ms)
[ RUN      ] Scheme/HTTPTest.CaseInsensitiveHeaders/0
I0330 11:36:33.340903 25085 openssl.cpp:419] CA file path is unspecified! NOTE: Set CA file
path with LIBPROCESS_SSL_CA_FILE=<filepath>
I0330 11:36:33.340927 25085 openssl.cpp:424] CA directory path unspecified! NOTE: Set CA directory
path with LIBPROCESS_SSL_CA_DIR=<dirpath>
I0330 11:36:33.340934 25085 openssl.cpp:429] Will not verify peer certificate!
NOTE: Set LIBPROCESS_SSL_VERIFY_CERT=1 to enable peer certificate verification
I0330 11:36:33.340940 25085 openssl.cpp:435] Will only verify peer certificate if presented!
NOTE: Set LIBPROCESS_SSL_REQUIRE_CERT=1 to require peer certificate verification
I0330 11:36:33.342988 25085 process.cpp:1247] libprocess is initialized on 172.17.0.3:51635
with 16 worker threads
[       OK ] Scheme/HTTPTest.CaseInsensitiveHeaders/0 (578 ms)
[ RUN      ] Scheme/HTTPTest.CaseInsensitiveHeaders/1
I0330 11:36:33.362187 25085 process.cpp:1247] libprocess is initialized on 172.17.0.3:47839
with 16 worker threads
[       OK ] Scheme/HTTPTest.CaseInsensitiveHeaders/1 (19 ms)
[ RUN      ] Scheme/HTTPTest.WWWAuthenticateHeader/0
*** Aborted at 1490873793 (unix time) try "date -d @1490873793" if you are using GNU date
***
PC: @     0x7f121433eb34 __memcpy_ssse3_back
*** SIGSEGV (@0x2624000) received by PID 25085 (TID 0x7f120afba700) from PID 39993344; stack
trace: ***
    @     0x7f1214de5370 (unknown)
    @     0x7f121433eb34 __memcpy_ssse3_back
    @     0x7f1214b8b8e0 (unknown)
    @     0x7f1214b8bf8c (unknown)
    @     0x7f1216ed5292 process::internal::dispatch()
    @     0x7f1216f1a116 process::dispatch<>()
    @     0x7f1216ed95f8 process::ProcessBase::route()
    @     0x7f1216e0d714 process::Help::initialize()
    @     0x7f1216ed62c1 process::ProcessManager::resume()
    @     0x7f1216edf2f7 _ZNSt6thread5_ImplISt12_Bind_simpleIFZN7process14ProcessManager12init_threadsEvEUt_vEEE6_M_runEv
    @     0x7f1214b82230 (unknown)
    @     0x7f1214ddddc5 start_thread
    @     0x7f12142eb73d __clone
make[3]: *** [CMakeFiles/check] Segmentation fault
make[3]: Leaving directory `/mesos/build'
make[2]: *** [CMakeFiles/check.dir/all] Error 2
make[2]: Leaving directory `/mesos/build'
make[1]: *** [CMakeFiles/check.dir/rule] Error 2
make[1]: Leaving directory `/mesos/build'
make: *** [check] Error 2
+ docker rmi mesos-1490871078-14403
Untagged: mesos-1490871078-14403:latest
Deleted: sha256:0885535396b45f5d08e85538a85104609a8a812635e6d18c201d67fd151ca3ff
Deleted: sha256:d7c5e26c72f0722bd91f498132c08c95e96396b8b770869879403df947ff8d59
Deleted: sha256:5282f14b5631d6c4e4eceae65c902ae5ec791804522e98e1eaa6827b491ccce0
Deleted: sha256:3bd483c60ec734a23a1331250221ab1cca98dc9b32a699d3863f1b665e0ebb4a
Deleted: sha256:bd8f8b158cbf70a1b17d3440faa0fcab2e9bc72cf32a75bdabd3d90ac74b188b
Deleted: sha256:ecb55bbe17664263185e80d3948b6e0bd4f2e70df97bd989ba910986697bb952
Deleted: sha256:5a407a2382c389a390e4f5b1afb8d6b6c16bdfb22c1704c2b99b558f4dc0d865
Deleted: sha256:c7992b2ddb1b24bf833609a62371de4994c25f9488c9b3c09cb1d55d55b2e95e
Deleted: sha256:365a5c080af64bd7d76d671fef9de4b0fb3b5752538fc2d209d71d1648d99fa8
Deleted: sha256:beda7b1ae31220e8e457f55108ef5343de4557bf7d26e23202bf5546036fe74b
Deleted: sha256:23627ca958acd1c0c35082cbd7d692ab8eb805a32bfa2ae474b7785a732d57f7
Deleted: sha256:b39a2fc920c20230498fb5d91636b563286d66ce3687d2dc84cf92225e5634d7
Deleted: sha256:e2eb876b883ab807607e4e3b2c3bb2981d5e47ab2bb519cf700105dc0e907de7
Deleted: sha256:cb1f7c21a018ebc6aacf3e2a4f430e43fae74cad04a309fe6ad7d62c31a8dcd3
Deleted: sha256:6aefd805b1edbb99f411f74ea9ca74c8ca393aca1b3b93472b5af650d8d9de9d
Deleted: sha256:ec71a278105f962b68ac1954aaa506b556bfe0066b65cefb81be7161ae926188
Deleted: sha256:dc6d10e1d65006c6a3b59b254c79473b8af6086c0f9800632e06adc51cd1e407
Deleted: sha256:8d6375b66ca5bb7730d710123f83463944abbc428599ea1083efdb871fc27825
Deleted: sha256:158aa8ce237ca4ed46696ed4c8cb16853464571eebfde0da61c9769477c79a3e
Deleted: sha256:4af9aa60f6d81eba0f43ce003253ee66db2f1d7e6d2fe61f395fdafed444ae72
Deleted: sha256:e52df74c9bbe708c123afc42c6096fabd31b37be95db22efd7310eee5ddd891b
Deleted: sha256:2d2d2e6cbcda9611579987455315c211d6f643b8dcdab49f6fc3a872728b2f67
Deleted: sha256:2a9b572cfd69d4bf50eb911d0b3fd11d847683f67d87b46d07f1a1091a682628
Deleted: sha256:8e13c089ace54b3568ded55eafc8a57a53e4453e5bc8ed049b03f35d9f075b9f
Deleted: sha256:75e4a64798ed36b678a572dd7e0b161daf46674c5a7ebb1834654c9e39509968
Build step 'Execute shell' marked build as failure

Mime
View raw message