mesos-builds mailing list archives

Site index · List index
Message view « Date » · « Thread »
Top « Date » · « Thread »
From Apache Jenkins Server <jenk...@builds.apache.org>
Subject Build failed in Jenkins: Mesos-Buildbot » autotools,gcc,--verbose,GLOG_v=1 MESOS_VERBOSE=1,centos:7,(docker||Hadoop)&&(!ubuntu-us1)&&(!ubuntu-eu2) #3439
Date Fri, 31 Mar 2017 11:59:22 GMT
See <https://builds.apache.org/job/Mesos-Buildbot/BUILDTOOL=autotools,COMPILER=gcc,CONFIGURATION=--verbose,ENVIRONMENT=GLOG_v=1%20MESOS_VERBOSE=1,OS=centos%3A7,label_exp=(docker%7C%7CHadoop)&&(!ubuntu-us1)&&(!ubuntu-eu2)/3439/display/redirect?page=changes>

Changes:

[alexr] Augmented release guide with GPG goodies and a formatting reminder.

[alexr] Replaced <br> tags with formatting in release guide for consistency.

------------------------------------------
[...truncated 26.05 MB...]
I0331 11:59:04.436728 31539 containerizer.cpp:608] Recovering containerizer
I0331 11:59:04.438648 31547 provisioner.cpp:410] Provisioner recovery complete
I0331 11:59:04.439188 31535 slave.cpp:5927] Finished recovery
I0331 11:59:04.439858 31535 slave.cpp:6109] Querying resource estimator for oversubscribable
resources
I0331 11:59:04.440366 31535 slave.cpp:6123] Received oversubscribable resources {} from the
resource estimator
I0331 11:59:04.444092 31537 process.cpp:3705] Handling HTTP event for process 'slave(722)'
with path: '/slave(722)/monitor/statistics.json'
I0331 11:59:04.446112 31537 http.cpp:936] Authorizing principal 'test-principal' to GET the
'/monitor/statistics.json' endpoint
I0331 11:59:04.451496 31514 slave.cpp:754] Agent terminating
[       OK ] Endpoint/SlaveEndpointTest.AuthorizedRequest/1 (41 ms)
[ RUN      ] Endpoint/SlaveEndpointTest.AuthorizedRequest/2
I0331 11:59:04.466358 31514 containerizer.cpp:221] Using isolation: posix/cpu,posix/mem,filesystem/posix,network/cni
W0331 11:59:04.467397 31514 backend.cpp:76] Failed to create 'aufs' backend: AufsBackend requires
root privileges
W0331 11:59:04.467738 31514 backend.cpp:76] Failed to create 'bind' backend: BindBackend requires
root privileges
I0331 11:59:04.467924 31514 provisioner.cpp:249] Using default backend 'copy'
I0331 11:59:04.472499 31544 slave.cpp:226] Mesos agent started on (723)@172.17.0.2:46465
I0331 11:59:04.472651 31544 slave.cpp:227] Flags at startup: --acls="" --appc_simple_discovery_uri_prefix="http://"
--appc_store_dir="/tmp/mesos/store/appc" --authenticate_http_readonly="true" --authenticate_http_readwrite="true"
--authenticatee="crammd5" --authentication_backoff_factor="1secs" --authorizer="local" --cgroups_cpu_enable_pids_and_tids_count="false"
--cgroups_enable_cfs="false" --cgroups_hierarchy="/sys/fs/cgroup" --cgroups_limit_swap="false"
--cgroups_root="mesos" --container_disk_watch_interval="15secs" --containerizers="mesos" --credential="/tmp/Endpoint_SlaveEndpointTest_AuthorizedRequest_2_Cs7XaD/credential"
--default_role="*" --disk_watch_interval="1mins" --docker="docker" --docker_kill_orphans="true"
--docker_registry="https://registry-1.docker.io" --docker_remove_delay="6hrs" --docker_socket="/var/run/docker.sock"
--docker_stop_timeout="0ns" --docker_store_dir="/tmp/mesos/store/docker" --docker_volume_checkpoint_dir="/var/run/mesos/isolators/docker/volume"
--enforce_container_disk_quota="false" --executor_registration_timeout="1mins" --executor_shutdown_grace_period="5secs"
--fetcher_cache_dir="/tmp/Endpoint_SlaveEndpointTest_AuthorizedRequest_2_Cs7XaD/fetch" --fetcher_cache_size="2GB"
--frameworks_home="" --gc_delay="1weeks" --gc_disk_headroom="0.1" --hadoop_home="" --help="false"
--hostname_lookup="true" --http_command_executor="false" --http_credentials="/tmp/Endpoint_SlaveEndpointTest_AuthorizedRequest_2_Cs7XaD/http_credentials"
--http_heartbeat_interval="30secs" --initialize_driver_logging="true" --isolation="posix/cpu,posix/mem"
--launcher="posix" --launcher_dir="/mesos/mesos-1.3.0/_build/src" --logbufsecs="0" --logging_level="INFO"
--max_completed_executors_per_framework="150" --oversubscribed_resources_interval="15secs"
--perf_duration="10secs" --perf_interval="1mins" --qos_correction_interval_min="0ns" --quiet="false"
--recover="reconnect" --recovery_timeout="15mins" --registration_backoff_factor="10ms" --resources="cpus:2;gpus:0;mem:1024;disk:1024;ports:[31000-32000]"
--revocable_cpu_low_priority="true" --runtime_dir="/tmp/Endpoint_SlaveEndpointTest_AuthorizedRequest_2_Cs7XaD"
--sandbox_directory="/mnt/mesos/sandbox" --strict="true" --switch_user="true" --systemd_enable_support="true"
--systemd_runtime_directory="/run/systemd/system" --version="false" --work_dir="/tmp/Endpoint_SlaveEndpointTest_AuthorizedRequest_2_cvyuEd"
I0331 11:59:04.473379 31544 credentials.hpp:86] Loading credential for authentication from
'/tmp/Endpoint_SlaveEndpointTest_AuthorizedRequest_2_Cs7XaD/credential'
I0331 11:59:04.473630 31544 slave.cpp:259] Agent using credential for: test-principal
I0331 11:59:04.473655 31544 credentials.hpp:37] Loading credentials for authentication from
'/tmp/Endpoint_SlaveEndpointTest_AuthorizedRequest_2_Cs7XaD/http_credentials'
I0331 11:59:04.474076 31544 http.cpp:975] Creating default 'basic' HTTP authenticator for
realm 'mesos-agent-readonly'
I0331 11:59:04.474280 31544 http.cpp:975] Creating default 'basic' HTTP authenticator for
realm 'mesos-agent-readwrite'
I0331 11:59:04.475577 31544 slave.cpp:492] Agent resources: cpus(*):2; mem(*):1024; disk(*):1024;
ports(*):[31000-32000]
I0331 11:59:04.475658 31544 slave.cpp:500] Agent attributes: [  ]
I0331 11:59:04.475682 31544 slave.cpp:505] Agent hostname: b2d3b8ed6291
I0331 11:59:04.475859 31546 status_update_manager.cpp:177] Pausing sending status updates
I0331 11:59:04.477327 31547 state.cpp:62] Recovering state from '/tmp/Endpoint_SlaveEndpointTest_AuthorizedRequest_2_cvyuEd/meta'
I0331 11:59:04.477704 31536 status_update_manager.cpp:203] Recovering status update manager
I0331 11:59:04.478008 31536 containerizer.cpp:608] Recovering containerizer
I0331 11:59:04.479593 31538 provisioner.cpp:410] Provisioner recovery complete
I0331 11:59:04.479984 31547 slave.cpp:5927] Finished recovery
I0331 11:59:04.490924 31547 slave.cpp:6109] Querying resource estimator for oversubscribable
resources
I0331 11:59:04.491598 31542 slave.cpp:6123] Received oversubscribable resources {} from the
resource estimator
I0331 11:59:04.495254 31540 process.cpp:3705] Handling HTTP event for process 'slave(723)'
with path: '/slave(723)/containers'
I0331 11:59:04.497603 31547 http.cpp:936] Authorizing principal 'test-principal' to GET the
'/containers' endpoint
I0331 11:59:04.505218 31545 slave.cpp:754] Agent terminating
[       OK ] Endpoint/SlaveEndpointTest.AuthorizedRequest/2 (61 ms)
[ RUN      ] Endpoint/SlaveEndpointTest.UnauthorizedRequest/0
I0331 11:59:04.525554 31514 containerizer.cpp:221] Using isolation: posix/cpu,posix/mem,filesystem/posix,network/cni
W0331 11:59:04.526093 31514 backend.cpp:76] Failed to create 'aufs' backend: AufsBackend requires
root privileges
W0331 11:59:04.526218 31514 backend.cpp:76] Failed to create 'bind' backend: BindBackend requires
root privileges
I0331 11:59:04.526264 31514 provisioner.cpp:249] Using default backend 'copy'
I0331 11:59:04.529618 31537 slave.cpp:226] Mesos agent started on (724)@172.17.0.2:46465
I0331 11:59:04.529667 31537 slave.cpp:227] Flags at startup: --acls="" --appc_simple_discovery_uri_prefix="http://"
--appc_store_dir="/tmp/mesos/store/appc" --authenticate_http_readonly="true" --authenticate_http_readwrite="true"
--authenticatee="crammd5" --authentication_backoff_factor="1secs" --authorizer="local" --cgroups_cpu_enable_pids_and_tids_count="false"
--cgroups_enable_cfs="false" --cgroups_hierarchy="/sys/fs/cgroup" --cgroups_limit_swap="false"
--cgroups_root="mesos" --container_disk_watch_interval="15secs" --containerizers="mesos" --credential="/tmp/Endpoint_SlaveEndpointTest_UnauthorizedRequest_0_QndCOh/credential"
--default_role="*" --disk_watch_interval="1mins" --docker="docker" --docker_kill_orphans="true"
--docker_registry="https://registry-1.docker.io" --docker_remove_delay="6hrs" --docker_socket="/var/run/docker.sock"
--docker_stop_timeout="0ns" --docker_store_dir="/tmp/mesos/store/docker" --docker_volume_checkpoint_dir="/var/run/mesos/isolators/docker/volume"
--enforce_container_disk_quota="false" --executor_registration_timeout="1mins" --executor_shutdown_grace_period="5secs"
--fetcher_cache_dir="/tmp/Endpoint_SlaveEndpointTest_UnauthorizedRequest_0_QndCOh/fetch" --fetcher_cache_size="2GB"
--frameworks_home="" --gc_delay="1weeks" --gc_disk_headroom="0.1" --hadoop_home="" --help="false"
--hostname_lookup="true" --http_command_executor="false" --http_credentials="/tmp/Endpoint_SlaveEndpointTest_UnauthorizedRequest_0_QndCOh/http_credentials"
--http_heartbeat_interval="30secs" --initialize_driver_logging="true" --isolation="posix/cpu,posix/mem"
--launcher="posix" --launcher_dir="/mesos/mesos-1.3.0/_build/src" --logbufsecs="0" --logging_level="INFO"
--max_completed_executors_per_framework="150" --oversubscribed_resources_interval="15secs"
--perf_duration="10secs" --perf_interval="1mins" --qos_correction_interval_min="0ns" --quiet="false"
--recover="reconnect" --recovery_timeout="15mins" --registration_backoff_factor="10ms" --resources="cpus:2;gpus:0;mem:1024;disk:1024;ports:[31000-32000]"
--revocable_cpu_low_priority="true" --runtime_dir="/tmp/Endpoint_SlaveEndpointTest_UnauthorizedRequest_0_QndCOh"
--sandbox_directory="/mnt/mesos/sandbox" --strict="true" --switch_user="true" --systemd_enable_support="true"
--systemd_runtime_directory="/run/systemd/system" --version="false" --work_dir="/tmp/Endpoint_SlaveEndpointTest_UnauthorizedRequest_0_otAh8R"
I0331 11:59:04.530542 31537 credentials.hpp:86] Loading credential for authentication from
'/tmp/Endpoint_SlaveEndpointTest_UnauthorizedRequest_0_QndCOh/credential'
I0331 11:59:04.530848 31537 slave.cpp:259] Agent using credential for: test-principal
I0331 11:59:04.530877 31537 credentials.hpp:37] Loading credentials for authentication from
'/tmp/Endpoint_SlaveEndpointTest_UnauthorizedRequest_0_QndCOh/http_credentials'
I0331 11:59:04.531208 31537 http.cpp:975] Creating default 'basic' HTTP authenticator for
realm 'mesos-agent-readonly'
I0331 11:59:04.531500 31537 http.cpp:975] Creating default 'basic' HTTP authenticator for
realm 'mesos-agent-readwrite'
I0331 11:59:04.533615 31537 slave.cpp:492] Agent resources: cpus(*):2; mem(*):1024; disk(*):1024;
ports(*):[31000-32000]
I0331 11:59:04.533748 31537 slave.cpp:500] Agent attributes: [  ]
I0331 11:59:04.533768 31537 slave.cpp:505] Agent hostname: b2d3b8ed6291
I0331 11:59:04.533977 31545 status_update_manager.cpp:177] Pausing sending status updates
I0331 11:59:04.535951 31541 state.cpp:62] Recovering state from '/tmp/Endpoint_SlaveEndpointTest_UnauthorizedRequest_0_otAh8R/meta'
I0331 11:59:04.536368 31544 status_update_manager.cpp:203] Recovering status update manager
I0331 11:59:04.536588 31548 containerizer.cpp:608] Recovering containerizer
I0331 11:59:04.538090 31545 provisioner.cpp:410] Provisioner recovery complete
I0331 11:59:04.538465 31541 slave.cpp:5927] Finished recovery
I0331 11:59:04.539075 31541 slave.cpp:6109] Querying resource estimator for oversubscribable
resources
I0331 11:59:04.539417 31543 slave.cpp:6123] Received oversubscribable resources {} from the
resource estimator
I0331 11:59:04.542851 31544 process.cpp:3705] Handling HTTP event for process 'slave(724)'
with path: '/slave(724)/monitor/statistics'
I0331 11:59:04.544996 31538 http.cpp:936] Authorizing principal 'test-principal' to GET the
'/monitor/statistics' endpoint
I0331 11:59:04.547977 31537 slave.cpp:754] Agent terminating
[       OK ] Endpoint/SlaveEndpointTest.UnauthorizedRequest/0 (48 ms)
[ RUN      ] Endpoint/SlaveEndpointTest.UnauthorizedRequest/1
I0331 11:59:04.573194 31514 containerizer.cpp:221] Using isolation: posix/cpu,posix/mem,filesystem/posix,network/cni
W0331 11:59:04.573710 31514 backend.cpp:76] Failed to create 'aufs' backend: AufsBackend requires
root privileges
W0331 11:59:04.573835 31514 backend.cpp:76] Failed to create 'bind' backend: BindBackend requires
root privileges
I0331 11:59:04.573882 31514 provisioner.cpp:249] Using default backend 'copy'
I0331 11:59:04.576705 31545 slave.cpp:226] Mesos agent started on (725)@172.17.0.2:46465
I0331 11:59:04.576730 31545 slave.cpp:227] Flags at startup: --acls="" --appc_simple_discovery_uri_prefix="http://"
--appc_store_dir="/tmp/mesos/store/appc" --authenticate_http_readonly="true" --authenticate_http_readwrite="true"
--authenticatee="crammd5" --authentication_backoff_factor="1secs" --authorizer="local" --cgroups_cpu_enable_pids_and_tids_count="false"
--cgroups_enable_cfs="false" --cgroups_hierarchy="/sys/fs/cgroup" --cgroups_limit_swap="false"
--cgroups_root="mesos" --container_disk_watch_interval="15secs" --containerizers="mesos" --credential="/tmp/Endpoint_SlaveEndpointTest_UnauthorizedRequest_1_TcJgXW/credential"
--default_role="*" --disk_watch_interval="1mins" --docker="docker" --docker_kill_orphans="true"
--docker_registry="https://registry-1.docker.io" --docker_remove_delay="6hrs" --docker_socket="/var/run/docker.sock"
--docker_stop_timeout="0ns" --docker_store_dir="/tmp/mesos/store/docker" --docker_volume_checkpoint_dir="/var/run/mesos/isolators/docker/volume"
--enforce_container_disk_quota="false" --executor_registration_timeout="1mins" --executor_shutdown_grace_period="5secs"
--fetcher_cache_dir="/tmp/Endpoint_SlaveEndpointTest_UnauthorizedRequest_1_TcJgXW/fetch" --fetcher_cache_size="2GB"
--frameworks_home="" --gc_delay="1weeks" --gc_disk_headroom="0.1" --hadoop_home="" --help="false"
--hostname_lookup="true" --http_command_executor="false" --http_credentials="/tmp/Endpoint_SlaveEndpointTest_UnauthorizedRequest_1_TcJgXW/http_credentials"
--http_heartbeat_interval="30secs" --initialize_driver_logging="true" --isolation="posix/cpu,posix/mem"
--launcher="posix" --launcher_dir="/mesos/mesos-1.3.0/_build/src" --logbufsecs="0" --logging_level="INFO"
--max_completed_executors_per_framework="150" --oversubscribed_resources_interval="15secs"
--perf_duration="10secs" --perf_interval="1mins" --qos_correction_interval_min="0ns" --quiet="false"
--recover="reconnect" --recovery_timeout="15mins" --registration_backoff_factor="10ms" --resources="cpus:2;gpus:0;mem:1024;disk:1024;ports:[31000-32000]"
--revocable_cpu_low_priority="true" --runtime_dir="/tmp/Endpoint_SlaveEndpointTest_UnauthorizedRequest_1_TcJgXW"
--sandbox_directory="/mnt/mesos/sandbox" --strict="true" --switch_user="true" --systemd_enable_support="true"
--systemd_runtime_directory="/run/systemd/system" --version="false" --work_dir="/tmp/Endpoint_SlaveEndpointTest_UnauthorizedRequest_1_Idcd9w"
I0331 11:59:04.577309 31545 credentials.hpp:86] Loading credential for authentication from
'/tmp/Endpoint_SlaveEndpointTest_UnauthorizedRequest_1_TcJgXW/credential'
I0331 11:59:04.577466 31545 slave.cpp:259] Agent using credential for: test-principal
I0331 11:59:04.577488 31545 credentials.hpp:37] Loading credentials for authentication from
'/tmp/Endpoint_SlaveEndpointTest_UnauthorizedRequest_1_TcJgXW/http_credentials'
I0331 11:59:04.577694 31545 http.cpp:975] Creating default 'basic' HTTP authenticator for
realm 'mesos-agent-readonly'
I0331 11:59:04.577826 31545 http.cpp:975] Creating default 'basic' HTTP authenticator for
realm 'mesos-agent-readwrite'
I0331 11:59:04.578999 31545 slave.cpp:492] Agent resources: cpus(*):2; mem(*):1024; disk(*):1024;
ports(*):[31000-32000]
I0331 11:59:04.579076 31545 slave.cpp:500] Agent attributes: [  ]
I0331 11:59:04.579088 31545 slave.cpp:505] Agent hostname: b2d3b8ed6291
I0331 11:59:04.579290 31533 status_update_manager.cpp:177] Pausing sending status updates
I0331 11:59:04.580577 31546 state.cpp:62] Recovering state from '/tmp/Endpoint_SlaveEndpointTest_UnauthorizedRequest_1_Idcd9w/meta'
I0331 11:59:04.581028 31542 status_update_manager.cpp:203] Recovering status update manager
I0331 11:59:04.581250 31543 containerizer.cpp:608] Recovering containerizer
I0331 11:59:04.582844 31537 provisioner.cpp:410] Provisioner recovery complete
I0331 11:59:04.583286 31545 slave.cpp:5927] Finished recovery
I0331 11:59:04.583760 31545 slave.cpp:6109] Querying resource estimator for oversubscribable
resources
I0331 11:59:04.584028 31545 slave.cpp:6123] Received oversubscribable resources {} from the
resource estimator
I0331 11:59:04.589104 31538 process.cpp:3705] Handling HTTP event for process 'slave(725)'
with path: '/slave(725)/monitor/statistics.json'
I0331 11:59:04.591264 31545 http.cpp:936] Authorizing principal 'test-principal' to GET the
'/monitor/statistics.json' endpoint
I0331 11:59:04.594574 31533 slave.cpp:754] Agent terminating
[       OK ] Endpoint/SlaveEndpointTest.UnauthorizedRequest/1 (32 ms)
[ RUN      ] Endpoint/SlaveEndpointTest.UnauthorizedRequest/2
I0331 11:59:04.614243 31514 containerizer.cpp:221] Using isolation: posix/cpu,posix/mem,filesystem/posix,network/cni
W0331 11:59:04.614754 31514 backend.cpp:76] Failed to create 'aufs' backend: AufsBackend requires
root privileges
W0331 11:59:04.614858 31514 backend.cpp:76] Failed to create 'bind' backend: BindBackend requires
root privileges
I0331 11:59:04.614892 31514 provisioner.cpp:249] Using default backend 'copy'
I0331 11:59:04.618212 31538 slave.cpp:226] Mesos agent started on (726)@172.17.0.2:46465
I0331 11:59:04.618237 31538 slave.cpp:227] Flags at startup: --acls="" --appc_simple_discovery_uri_prefix="http://"
--appc_store_dir="/tmp/mesos/store/appc" --authenticate_http_readonly="true" --authenticate_http_readwrite="true"
--authenticatee="crammd5" --authentication_backoff_factor="1secs" --authorizer="local" --cgroups_cpu_enable_pids_and_tids_count="false"
--cgroups_enable_cfs="false" --cgroups_hierarchy="/sys/fs/cgroup" --cgroups_limit_swap="false"
--cgroups_root="mesos" --container_disk_watch_interval="15secs" --containerizers="mesos" --credential="/tmp/Endpoint_SlaveEndpointTest_UnauthorizedRequest_2_3V1MwC/credential"
--default_role="*" --disk_watch_interval="1mins" --docker="docker" --docker_kill_orphans="true"
--docker_registry="https://registry-1.docker.io" --docker_remove_delay="6hrs" --docker_socket="/var/run/docker.sock"
--docker_stop_timeout="0ns" --docker_store_dir="/tmp/mesos/store/docker" --docker_volume_checkpoint_dir="/var/run/mesos/isolators/docker/volume"
--enforce_container_disk_quota="false" --executor_registration_timeout="1mins" --executor_shutdown_grace_period="5secs"
--fetcher_cache_dir="/tmp/Endpoint_SlaveEndpointTest_UnauthorizedRequest_2_3V1MwC/fetch" --fetcher_cache_size="2GB"
--frameworks_home="" --gc_delay="1weeks" --gc_disk_headroom="0.1" --hadoop_home="" --help="false"
--hostname_lookup="true" --http_command_executor="false" --http_credentials="/tmp/Endpoint_SlaveEndpointTest_UnauthorizedRequest_2_3V1MwC/http_credentials"
--http_heartbeat_interval="30secs" --initialize_driver_logging="true" --isolation="posix/cpu,posix/mem"
--launcher="posix" --launcher_dir="/mesos/mesos-1.3.0/_build/src" --logbufsecs="0" --logging_level="INFO"
--max_completed_executors_per_framework="150" --oversubscribed_resources_interval="15secs"
--perf_duration="10secs" --perf_interval="1mins" --qos_correction_interval_min="0ns" --quiet="false"
--recover="reconnect" --recovery_timeout="15mins" --registration_backoff_factor="10ms" --resources="cpus:2;gpus:0;mem:1024;disk:1024;ports:[31000-32000]"
--revocable_cpu_low_priority="true" --runtime_dir="/tmp/Endpoint_SlaveEndpointTest_UnauthorizedRequest_2_3V1MwC"
--sandbox_directory="/mnt/mesos/sandbox" --strict="true" --switch_user="true" --systemd_enable_support="true"
--systemd_runtime_directory="/run/systemd/system" --version="false" --work_dir="/tmp/Endpoint_SlaveEndpointTest_UnauthorizedRequest_2_vn89Bc"
I0331 11:59:04.618778 31538 credentials.hpp:86] Loading credential for authentication from
'/tmp/Endpoint_SlaveEndpointTest_UnauthorizedRequest_2_3V1MwC/credential'
I0331 11:59:04.618937 31538 slave.cpp:259] Agent using credential for: test-principal
I0331 11:59:04.618958 31538 credentials.hpp:37] Loading credentials for authentication from
'/tmp/Endpoint_SlaveEndpointTest_UnauthorizedRequest_2_3V1MwC/http_credentials'
I0331 11:59:04.619210 31538 http.cpp:975] Creating default 'basic' HTTP authenticator for
realm 'mesos-agent-readonly'
I0331 11:59:04.619349 31538 http.cpp:975] Creating default 'basic' HTTP authenticator for
realm 'mesos-agent-readwrite'
I0331 11:59:04.620610 31538 slave.cpp:492] Agent resources: cpus(*):2; mem(*):1024; disk(*):1024;
ports(*):[31000-32000]
I0331 11:59:04.620688 31538 slave.cpp:500] Agent attributes: [  ]
I0331 11:59:04.620702 31538 slave.cpp:505] Agent hostname: b2d3b8ed6291
I0331 11:59:04.620826 31535 status_update_manager.cpp:177] Pausing sending status updates
I0331 11:59:04.622593 31533 state.cpp:62] Recovering state from '/tmp/Endpoint_SlaveEndpointTest_UnauthorizedRequest_2_vn89Bc/meta'
I0331 11:59:04.623008 31533 status_update_manager.cpp:203] Recovering status update manager
I0331 11:59:04.623214 31535 containerizer.cpp:608] Recovering containerizer
I0331 11:59:04.624872 31536 provisioner.cpp:410] Provisioner recovery complete
I0331 11:59:04.625298 31541 slave.cpp:5927] Finished recovery
I0331 11:59:04.625893 31541 slave.cpp:6109] Querying resource estimator for oversubscribable
resources
I0331 11:59:04.626220 31541 slave.cpp:6123] Received oversubscribable resources {} from the
resource estimator
I0331 11:59:04.629673 31536 process.cpp:3705] Handling HTTP event for process 'slave(726)'
with path: '/slave(726)/containers'
I0331 11:59:04.631623 31536 http.cpp:936] Authorizing principal 'test-principal' to GET the
'/containers' endpoint
I0331 11:59:04.635334 31547 slave.cpp:754] Agent terminating
[       OK ] Endpoint/SlaveEndpointTest.UnauthorizedRequest/2 (32 ms)
[ RUN      ] Endpoint/SlaveEndpointTest.NoAuthorizer/0
I0331 11:59:04.647166 31514 containerizer.cpp:221] Using isolation: posix/cpu,posix/mem,filesystem/posix,network/cni
W0331 11:59:04.647891 31514 backend.cpp:76] Failed to create 'aufs' backend: AufsBackend requires
root privileges
W0331 11:59:04.648027 31514 backend.cpp:76] Failed to create 'bind' backend: BindBackend requires
root privileges
I0331 11:59:04.648083 31514 provisioner.cpp:249] Using default backend 'copy'
I0331 11:59:04.649955 31514 cluster.cpp:446] Creating default 'local' authorizer
I0331 11:59:04.651989 31543 slave.cpp:226] Mesos agent started on (727)@172.17.0.2:46465
I0331 11:59:04.652029 31543 slave.cpp:227] Flags at startup: --acls="" --appc_simple_discovery_uri_prefix="http://"
--appc_store_dir="/tmp/mesos/store/appc" --authenticate_http_readonly="true" --authenticate_http_readwrite="true"
--authenticatee="crammd5" --authentication_backoff_factor="1secs" --authorizer="local" --cgroups_cpu_enable_pids_and_tids_count="false"
--cgroups_enable_cfs="false" --cgroups_hierarchy="/sys/fs/cgroup" --cgroups_limit_swap="false"
--cgroups_root="mesos" --container_disk_watch_interval="15secs" --containerizers="mesos" --credential="/tmp/Endpoint_SlaveEndpointTest_NoAuthorizer_0_CC3Rsi/credential"
--default_role="*" --disk_watch_interval="1mins" --docker="docker" --docker_kill_orphans="true"
--docker_registry="https://registry-1.docker.io" --docker_remove_delay="6hrs" --docker_socket="/var/run/docker.sock"
--docker_stop_timeout="0ns" --docker_store_dir="/tmp/mesos/store/docker" --docker_volume_checkpoint_dir="/var/run/mesos/isolators/docker/volume"
--enforce_container_disk_quota="false" --executor_registration_timeout="1mins" --executor_shutdown_grace_period="5secs"
--fetcher_cache_dir="/tmp/Endpoint_SlaveEndpointTest_NoAuthorizer_0_CC3Rsi/fetch" --fetcher_cache_size="2GB"
--frameworks_home="" --gc_delay="1weeks" --gc_disk_headroom="0.1" --hadoop_home="" --help="false"
--hostname_lookup="true" --http_command_executor="false" --http_credentials="/tmp/Endpoint_SlaveEndpointTest_NoAuthorizer_0_CC3Rsi/http_credentials"
--http_heartbeat_interval="30secs" --initialize_driver_logging="true" --isolation="posix/cpu,posix/mem"
--launcher="posix" --launcher_dir="/mesos/mesos-1.3.0/_build/src" --logbufsecs="0" --logging_level="INFO"
--max_completed_executors_per_framework="150" --oversubscribed_resources_interval="15secs"
--perf_duration="10secs" --perf_interval="1mins" --qos_correction_interval_min="0ns" --quiet="false"
--recover="reconnect" --recovery_timeout="15mins" --registration_backoff_factor="10ms" --resources="cpus:2;gpus:0;mem:1024;disk:1024;ports:[31000-32000]"
--revocable_cpu_low_priority="true" --runtime_dir="/tmp/Endpoint_SlaveEndpointTest_NoAuthorizer_0_CC3Rsi"
--sandbox_directory="/mnt/mesos/sandbox" --strict="true" --switch_user="true" --systemd_enable_support="true"
--systemd_runtime_directory="/run/systemd/system" --version="false" --work_dir="/tmp/Endpoint_SlaveEndpointTest_NoAuthorizer_0_LM20sS"
I0331 11:59:04.652693 31543 credentials.hpp:86] Loading credential for authentication from
'/tmp/Endpoint_SlaveEndpointTest_NoAuthorizer_0_CC3Rsi/credential'
I0331 11:59:04.652993 31543 slave.cpp:259] Agent using credential for: test-principal
I0331 11:59:04.653036 31543 credentials.hpp:37] Loading credentials for authentication from
'/tmp/Endpoint_SlaveEndpointTest_NoAuthorizer_0_CC3Rsi/http_credentials'
I0331 11:59:04.653436 31543 http.cpp:975] Creating default 'basic' HTTP authenticator for
realm 'mesos-agent-readonly'
I0331 11:59:04.653687 31543 http.cpp:975] Creating default 'basic' HTTP authenticator for
realm 'mesos-agent-readwrite'
I0331 11:59:04.655225 31543 slave.cpp:492] Agent resources: cpus(*):2; mem(*):1024; disk(*):1024;
ports(*):[31000-32000]
I0331 11:59:04.655333 31543 slave.cpp:500] Agent attributes: [  ]
I0331 11:59:04.655349 31543 slave.cpp:505] Agent hostname: b2d3b8ed6291
I0331 11:59:04.656628 31546 status_update_manager.cpp:177] Pausing sending status updates
I0331 11:59:04.657186 31533 state.cpp:62] Recovering state from '/tmp/Endpoint_SlaveEndpointTest_NoAuthorizer_0_LM20sS/meta'
I0331 11:59:04.657627 31533 status_update_manager.cpp:203] Recovering status update manager
I0331 11:59:04.657868 31536 containerizer.cpp:608] Recovering containerizer
I0331 11:59:04.659934 31534 provisioner.cpp:410] Provisioner recovery complete
I0331 11:59:04.660431 31545 slave.cpp:5927] Finished recovery
I0331 11:59:04.661160 31545 slave.cpp:6109] Querying resource estimator for oversubscribable
resources
I0331 11:59:04.661563 31543 slave.cpp:6123] Received oversubscribable resources {} from the
resource estimator
I0331 11:59:04.667220 31536 process.cpp:3705] Handling HTTP event for process 'slave(727)'
with path: '/slave(727)/monitor/statistics'
I0331 11:59:04.668617 31540 http.cpp:936] Authorizing principal 'test-principal' to GET the
'/monitor/statistics' endpoint
I0331 11:59:04.672122 31540 slave.cpp:754] Agent terminating
[       OK ] Endpoint/SlaveEndpointTest.NoAuthorizer/0 (38 ms)
[ RUN      ] Endpoint/SlaveEndpointTest.NoAuthorizer/1
I0331 11:59:04.685629 31514 containerizer.cpp:221] Using isolation: posix/cpu,posix/mem,filesystem/posix,network/cni
W0331 11:59:04.686341 31514 backend.cpp:76] Failed to create 'aufs' backend: AufsBackend requires
root privileges
W0331 11:59:04.686472 31514 backend.cpp:76] Failed to create 'bind' backend: BindBackend requires
root privileges
I0331 11:59:04.686519 31514 provisioner.cpp:249] Using default backend 'copy'
I0331 11:59:04.688395 31514 cluster.cpp:446] Creating default 'local' authorizer
I0331 11:59:04.690788 31546 slave.cpp:226] Mesos agent started on (728)@172.17.0.2:46465
I0331 11:59:04.690830 31546 slave.cpp:227] Flags at startup: --acls="" --appc_simple_discovery_uri_prefix="http://"
--appc_store_dir="/tmp/mesos/store/appc" --authenticate_http_readonly="true" --authenticate_http_readwrite="true"
--authenticatee="crammd5" --authentication_backoff_factor="1secs" --authorizer="local" --cgroups_cpu_enable_pids_and_tids_count="false"
--cgroups_enable_cfs="false" --cgroups_hierarchy="/sys/fs/cgroup" --cgroups_limit_swap="false"
--cgroups_root="mesos" --container_disk_watch_interval="15secs" --containerizers="mesos" --credential="/tmp/Endpoint_SlaveEndpointTest_NoAuthorizer_1_RDXpNY/credential"
--default_role="*" --disk_watch_interval="1mins" --docker="docker" --docker_kill_orphans="true"
--docker_registry="https://registry-1.docker.io" --docker_remove_delay="6hrs" --docker_socket="/var/run/docker.sock"
--docker_stop_timeout="0ns" --docker_store_dir="/tmp/mesos/store/docker" --docker_volume_checkpoint_dir="/var/run/mesos/isolators/docker/volume"
--enforce_container_disk_quota="false" --executor_registration_timeout="1mins" --executor_shutdown_grace_period="5secs"
--fetcher_cache_dir="/tmp/Endpoint_SlaveEndpointTest_NoAuthorizer_1_RDXpNY/fetch" --fetcher_cache_size="2GB"
--frameworks_home="" --gc_delay="1weeks" --gc_disk_headroom="0.1" --hadoop_home="" --help="false"
--hostname_lookup="true" --http_command_executor="false" --http_credentials="/tmp/Endpoint_SlaveEndpointTest_NoAuthorizer_1_RDXpNY/http_credentials"
--http_heartbeat_interval="30secs" --initialize_driver_logging="true" --isolation="posix/cpu,posix/mem"
--launcher="posix" --launcher_dir="/mesos/mesos-1.3.0/_build/src" --logbufsecs="0" --logging_level="INFO"
--max_completed_executors_per_framework="150" --oversubscribed_resources_interval="15secs"
--perf_duration="10secs" --perf_interval="1mins" --qos_correction_interval_min="0ns" --quiet="false"
--recover="reconnect" --recovery_timeout="15mins" --registration_backoff_factor="10ms" --resources="cpus:2;gpus:0;mem:1024;disk:1024;ports:[31000-32000]"
--revocable_cpu_low_priority="true" --runtime_dir="/tmp/Endpoint_SlaveEndpointTest_NoAuthorizer_1_RDXpNY"
--sandbox_directory="/mnt/mesos/sandbox" --strict="true" --switch_user="true" --systemd_enable_support="true"
--systemd_runtime_directory="/run/systemd/system" --version="false" --work_dir="/tmp/Endpoint_SlaveEndpointTest_NoAuthorizer_1_6NAiHy"
I0331 11:59:04.691536 31546 credentials.hpp:86] Loading credential for authentication from
'/tmp/Endpoint_SlaveEndpointTest_NoAuthorizer_1_RDXpNY/credential'
I0331 11:59:04.691748 31546 slave.cpp:259] Agent using credential for: test-principal
I0331 11:59:04.691773 31546 credentials.hpp:37] Loading credentials for authentication from
'/tmp/Endpoint_SlaveEndpointTest_NoAuthorizer_1_RDXpNY/http_credentials'
I0331 11:59:04.692018 31546 http.cpp:975] Creating default 'basic' HTTP authenticator for
realm 'mesos-agent-readonly'
I0331 11:59:04.692245 31546 http.cpp:975] Creating default 'basic' HTTP authenticator for
realm 'mesos-agent-readwrite'
I0331 11:59:04.693603 31546 slave.cpp:492] Agent resources: cpus(*):2; mem(*):1024; disk(*):1024;
ports(*):[31000-32000]
I0331 11:59:04.693717 31546 slave.cpp:500] Agent attributes: [  ]
I0331 11:59:04.693739 31546 slave.cpp:505] Agent hostname: b2d3b8ed6291
I0331 11:59:04.694205 31542 status_update_manager.cpp:177] Pausing sending status updates
I0331 11:59:04.695520 31546 state.cpp:62] Recovering state from '/tmp/Endpoint_SlaveEndpointTest_NoAuthorizer_1_6NAiHy/meta'
I0331 11:59:04.695935 31542 status_update_manager.cpp:203] Recovering status update manager
I0331 11:59:04.696203 31535 containerizer.cpp:608] Recovering containerizer
I0331 11:59:04.697891 31538 provisioner.cpp:410] Provisioner recovery complete
I0331 11:59:04.698295 31548 slave.cpp:5927] Finished recovery
I0331 11:59:04.698896 31548 slave.cpp:6109] Querying resource estimator for oversubscribable
resources
I0331 11:59:04.699152 31544 slave.cpp:6123] Received oversubscribable resources {} from the
resource estimator
I0331 11:59:04.702386 31547 process.cpp:3705] Handling HTTP event for process 'slave(728)'
with path: '/slave(728)/monitor/statistics.json'
I0331 11:59:04.704046 31535 http.cpp:936] Authorizing principal 'test-principal' to GET the
'/monitor/statistics.json' endpoint
I0331 11:59:04.709451 31537 slave.cpp:754] Agent terminating
[       OK ] Endpoint/SlaveEndpointTest.NoAuthorizer/1 (45 ms)
[ RUN      ] Endpoint/SlaveEndpointTest.NoAuthorizer/2
I0331 11:59:04.731806 31514 containerizer.cpp:221] Using isolation: posix/cpu,posix/mem,filesystem/posix,network/cni
W0331 11:59:04.732329 31514 backend.cpp:76] Failed to create 'aufs' backend: AufsBackend requires
root privileges
W0331 11:59:04.732430 31514 backend.cpp:76] Failed to create 'bind' backend: BindBackend requires
root privileges
I0331 11:59:04.732465 31514 provisioner.cpp:249] Using default backend 'copy'
I0331 11:59:04.734200 31514 cluster.cpp:446] Creating default 'local' authorizer
I0331 11:59:04.736788 31540 slave.cpp:226] Mesos agent started on (729)@172.17.0.2:46465
I0331 11:59:04.736832 31540 slave.cpp:227] Flags at startup: --acls="" --appc_simple_discovery_uri_prefix="http://"
--appc_store_dir="/tmp/mesos/store/appc" --authenticate_http_readonly="true" --authenticate_http_readwrite="true"
--authenticatee="crammd5" --authentication_backoff_factor="1secs" --authorizer="local" --cgroups_cpu_enable_pids_and_tids_count="false"
--cgroups_enable_cfs="false" --cgroups_hierarchy="/sys/fs/cgroup" --cgroups_limit_swap="false"
--cgroups_root="mesos" --container_disk_watch_interval="15secs" --containerizers="mesos" --credential="/tmp/Endpoint_SlaveEndpointTest_NoAuthorizer_2_vOfEAF/credential"
--default_role="*" --disk_watch_interval="1mins" --docker="docker" --docker_kill_orphans="true"
--docker_registry="https://registry-1.docker.io" --docker_remove_delay="6hrs" --docker_socket="/var/run/docker.sock"
--docker_stop_timeout="0ns" --docker_store_dir="/tmp/mesos/store/docker" --docker_volume_checkpoint_dir="/var/run/mesos/isolators/docker/volume"
--enforce_container_disk_quota="false" --executor_registration_timeout="1mins" --executor_shutdown_grace_period="5secs"
--fetcher_cache_dir="/tmp/Endpoint_SlaveEndpointTest_NoAuthorizer_2_vOfEAF/fetch" --fetcher_cache_size="2GB"
--frameworks_home="" --gc_delay="1weeks" --gc_disk_headroom="0.1" --hadoop_home="" --help="false"
--hostname_lookup="true" --http_command_executor="false" --http_credentials="/tmp/Endpoint_SlaveEndpointTest_NoAuthorizer_2_vOfEAF/http_credentials"
--http_heartbeat_interval="30secs" --initialize_driver_logging="true" --isolation="posix/cpu,posix/mem"
--launcher="posix" --launcher_dir="/mesos/mesos-1.3.0/_build/src" --logbufsecs="0" --logging_level="INFO"
--max_completed_executors_per_framework="150" --oversubscribed_resources_interval="15secs"
--perf_duration="10secs" --perf_interval="1mins" --qos_correction_interval_min="0ns" --quiet="false"
--recover="reconnect" --recovery_timeout="15mins" --registration_backoff_factor="10ms" --resources="cpus:2;gpus:0;mem:1024;disk:1024;ports:[31000-32000]"
--revocable_cpu_low_priority="true" --runtime_dir="/tmp/Endpoint_SlaveEndpointTest_NoAuthorizer_2_vOfEAF"
--sandbox_directory="/mnt/mesos/sandbox" --strict="true" --switch_user="true" --systemd_enable_support="true"
--systemd_runtime_directory="/run/systemd/system" --version="false" --work_dir="/tmp/Endpoint_SlaveEndpointTest_NoAuthorizer_2_3s0Zmf"
I0331 11:59:04.737684 31540 credentials.hpp:86] Loading credential for authentication from
'/tmp/Endpoint_SlaveEndpointTest_NoAuthorizer_2_vOfEAF/credential'
I0331 11:59:04.754758 31540 slave.cpp:259] Agent using credential for: test-principal
I0331 11:59:04.754811 31540 credentials.hpp:37] Loading credentials for authentication from
'/tmp/Endpoint_SlaveEndpointTest_NoAuthorizer_2_vOfEAF/http_credentials'
I0331 11:59:04.755080 31540 http.cpp:975] Creating default 'basic' HTTP authenticator for
realm 'mesos-agent-readonly'
I0331 11:59:04.755370 31540 http.cpp:975] Creating default 'basic' HTTP authenticator for
realm 'mesos-agent-readwrite'
I0331 11:59:04.756794 31540 slave.cpp:492] Agent resources: cpus(*):2; mem(*):1024; disk(*):1024;
ports(*):[31000-32000]
I0331 11:59:04.756922 31540 slave.cpp:500] Agent attributes: [  ]
I0331 11:59:04.756953 31540 slave.cpp:505] Agent hostname: b2d3b8ed6291
I0331 11:59:04.757138 31544 status_update_manager.cpp:177] Pausing sending status updates
I0331 11:59:04.759518 31540 state.cpp:62] Recovering state from '/tmp/Endpoint_SlaveEndpointTest_NoAuthorizer_2_3s0Zmf/meta'
I0331 11:59:04.760072 31540 status_update_manager.cpp:203] Recovering status update manager
I0331 11:59:04.760253 31540 containerizer.cpp:608] Recovering containerizer
I0331 11:59:04.762501 31540 provisioner.cpp:410] Provisioner recovery complete
I0331 11:59:04.763103 31546 slave.cpp:5927] Finished recovery
I0331 11:59:04.763625 31546 slave.cpp:6109] Querying resource estimator for oversubscribable
resources
I0331 11:59:04.764292 31546 slave.cpp:6123] Received oversubscribable resources {} from the
resource estimator
I0331 11:59:04.769083 31545 process.cpp:3705] Handling HTTP event for process 'slave(729)'
with path: '/slave(729)/containers'
I0331 11:59:04.771083 31539 http.cpp:936] Authorizing principal 'test-principal' to GET the
'/containers' endpoint
I0331 11:59:04.779817 31542 slave.cpp:754] Agent terminating
[       OK ] Endpoint/SlaveEndpointTest.NoAuthorizer/2 (65 ms)
[----------] 9 tests from Endpoint/SlaveEndpointTest (436 ms total)

[----------] Global test environment tear-down
[==========] 1524 tests from 172 test cases ran. (607431 ms total)
[  PASSED  ] 1523 tests.
[  FAILED  ] 1 test, listed below:
[  FAILED  ] ContentType/AgentAPITest.LaunchNestedContainerSession/1, where GetParam() = application/json

 1 FAILED TEST
  YOU HAVE 12 DISABLED TESTS

make[4]: *** [check-local] Error 1
make[4]: Leaving directory `/mesos/mesos-1.3.0/_build/src'
make[3]: *** [check-am] Error 2
make[3]: Leaving directory `/mesos/mesos-1.3.0/_build/src'
make[2]: *** [check] Error 2
make[2]: Leaving directory `/mesos/mesos-1.3.0/_build/src'
make[1]: *** [check-recursive] Error 1
make[1]: Leaving directory `/mesos/mesos-1.3.0/_build'
make: *** [distcheck] Error 1
+ docker rmi mesos-1490958280-6535
Untagged: mesos-1490958280-6535:latest
Deleted: sha256:1cd6b7214c2a798367021f2ede1c30d96775cb055c29d540c5ca95850867762a
Deleted: sha256:ea16f0058db5198d4874ac891eec0f170691c03a5aa115c513ca166450e8394d
Deleted: sha256:52f51ce5244f62d8401ea7594687f05a7be68e907d6640261e447387b478ef74
Deleted: sha256:6ff8fbbeabf97b0c88610e573716940294adf7a3d4088c4bc5fb0d8145850dd1
Deleted: sha256:5c9d5e46e950b0a9395874decafdc6b0102e7e2b7bbc640142f4775b4619725f
Deleted: sha256:45c873f921f840cdc5e6a802e975a06762846d2187d42eb309a596b2bd3c7a04
Deleted: sha256:c8b694e18ea111731ab94af2715b52d9def4e9e909b285509d05f03d5a7f37a9
Deleted: sha256:a093ba524e872fa184264d4daa9723eaf0eb101429ed3baea9425b1f33970c98
Deleted: sha256:bcc5c04d1c4801fcf0e3cb0455efae9e6d3b63e1ca517624d4fafd3ba4930261
Deleted: sha256:351445aef7d5eeef36172b9b4a0d76df2d8b5778ce616675cd1b4f9ada93059a
Deleted: sha256:13ef1a704dbd7b591ade445a0759d9b849a8b4fb6a434c13bee9f90059ba9f38
Deleted: sha256:83f47246dfb225a8cab918e8e7ce1e9afc1723103d72adbbaf190651516e7c7d
Deleted: sha256:a4cb5d9c460143ec1f4f41c89cdb89a6eee494caf11b75653969101c759a20a4
Deleted: sha256:5d115bd963fdebab1aace7f23b9389eb7605728162b2707504a13377517ee5a1
Deleted: sha256:aff4658ca09ca9316f5bb96925260b85efbe32e25f39ddc17d6579f933d1242a
Deleted: sha256:7f10f4f11df4f3cc222acca19782ee0d6a68eb586837de47b09bc6b09310b1d1
Deleted: sha256:84dc233d2ee95acd394ba593ae3440732ceb2b7d09735dcb43ba7c20330229b6
Deleted: sha256:c8d8fe13130eb50a88c480eba6b0d957defc31fec1a4583c3a6a464fbdbde15f
Deleted: sha256:a51acad1713b98965b9d4757739f37265000f11dcf50ffd021e17ed84389f6f5
Deleted: sha256:d4c69ef7b0e7fac09abb6eedcbed6a0269a52a4b9fa1891b48a82a724b5ecafc
Deleted: sha256:6642d3c221e7ce8761f1d9548bb11b06818a46217e97e9a2278810db13743586
Deleted: sha256:063ec91ee31ce24d85f1493b6bc5ec606d9dc1a79fce25ef1d044567e9facbbd
Deleted: sha256:3940ff123011465a4839ac71bf0688a18b523833642dbf770453aa3c4d6ab6ff
Deleted: sha256:21796a43dd403d9b4dff14d002d3309a003474dca56ea2f4289cdbbc96d94f67
Deleted: sha256:5c446babb68e1c626cb7aa2e0e371460f88a0b760fa0868858ee53d3377adfbd
Build step 'Execute shell' marked build as failure

Mime
View raw message