mesos-builds mailing list archives

Site index · List index
Message view « Date » · « Thread »
Top « Date » · « Thread »
From Apache Jenkins Server <jenk...@builds.apache.org>
Subject Build failed in Jenkins: Mesos-Buildbot » autotools,clang,--verbose --enable-libevent --enable-ssl,GLOG_v=1 MESOS_VERBOSE=1,ubuntu:14.04,(docker||Hadoop)&&(!ubuntu-us1)&&(!ubuntu-eu2) #3422
Date Mon, 27 Mar 2017 18:46:22 GMT
See <https://builds.apache.org/job/Mesos-Buildbot/BUILDTOOL=autotools,COMPILER=clang,CONFIGURATION=--verbose%20--enable-libevent%20--enable-ssl,ENVIRONMENT=GLOG_v=1%20MESOS_VERBOSE=1,OS=ubuntu%3A14.04,label_exp=(docker%7C%7CHadoop)&&(!ubuntu-us1)&&(!ubuntu-eu2)/3422/display/redirect?page=changes>

Changes:

[mpark] Fixed a typo in a log message.

------------------------------------------
[...truncated 27.14 MB...]
I0327 18:46:13.504479 15206 slave.cpp:499] Agent hostname: 5c2ceb52e790
I0327 18:46:13.504643 15201 status_update_manager.cpp:177] Pausing sending status updates
I0327 18:46:13.506142 15203 state.cpp:62] Recovering state from '/tmp/Endpoint_SlaveEndpointTest_AuthorizedRequest_2_zLTmg9/meta'
I0327 18:46:13.506788 15201 status_update_manager.cpp:203] Recovering status update manager
I0327 18:46:13.507055 15211 containerizer.cpp:608] Recovering containerizer
I0327 18:46:13.508399 15214 provisioner.cpp:410] Provisioner recovery complete
I0327 18:46:13.508774 15206 slave.cpp:5921] Finished recovery
I0327 18:46:13.509335 15206 slave.cpp:6103] Querying resource estimator for oversubscribable
resources
I0327 18:46:13.509683 15214 slave.cpp:6117] Received oversubscribable resources {} from the
resource estimator
I0327 18:46:13.512089 15215 process.cpp:3705] Handling HTTP event for process 'slave(724)'
with path: '/slave(724)/containers'
I0327 18:46:13.513927 15200 http.cpp:922] Authorizing principal 'test-principal' to GET the
'/containers' endpoint
I0327 18:46:13.517524 15212 slave.cpp:748] Agent terminating
[       OK ] Endpoint/SlaveEndpointTest.AuthorizedRequest/2 (32 ms)
[ RUN      ] Endpoint/SlaveEndpointTest.UnauthorizedRequest/0
I0327 18:46:13.529264 31183 containerizer.cpp:221] Using isolation: posix/cpu,posix/mem,filesystem/posix,network/cni
W0327 18:46:13.529865 31183 backend.cpp:76] Failed to create 'aufs' backend: AufsBackend requires
root privileges
W0327 18:46:13.529991 31183 backend.cpp:76] Failed to create 'bind' backend: BindBackend requires
root privileges
I0327 18:46:13.530040 31183 provisioner.cpp:249] Using default backend 'copy'
I0327 18:46:13.533138 15214 slave.cpp:226] Mesos agent started on (725)@172.17.0.3:49550
I0327 18:46:13.533184 15214 slave.cpp:227] Flags at startup: --acls="" --appc_simple_discovery_uri_prefix="http://"
--appc_store_dir="/tmp/mesos/store/appc" --authenticate_http_executors="true" --authenticate_http_readonly="true"
--authenticate_http_readwrite="true" --authenticatee="crammd5" --authentication_backoff_factor="1secs"
--authorizer="local" --cgroups_cpu_enable_pids_and_tids_count="false" --cgroups_enable_cfs="false"
--cgroups_hierarchy="/sys/fs/cgroup" --cgroups_limit_swap="false" --cgroups_root="mesos" --container_disk_watch_interval="15secs"
--containerizers="mesos" --credential="/tmp/Endpoint_SlaveEndpointTest_UnauthorizedRequest_0_6OiBYU/credential"
--default_role="*" --disk_watch_interval="1mins" --docker="docker" --docker_kill_orphans="true"
--docker_registry="https://registry-1.docker.io" --docker_remove_delay="6hrs" --docker_socket="/var/run/docker.sock"
--docker_stop_timeout="0ns" --docker_store_dir="/tmp/mesos/store/docker" --docker_volume_checkpoint_dir="/var/run/mesos/isolators/docker/volume"
--enforce_container_disk_quota="false" --executor_registration_timeout="1mins" --executor_secret_key="secret_key"
--executor_shutdown_grace_period="5secs" --fetcher_cache_dir="/tmp/Endpoint_SlaveEndpointTest_UnauthorizedRequest_0_6OiBYU/fetch"
--fetcher_cache_size="2GB" --frameworks_home="" --gc_delay="1weeks" --gc_disk_headroom="0.1"
--hadoop_home="" --help="false" --hostname_lookup="true" --http_command_executor="false" --http_credentials="/tmp/Endpoint_SlaveEndpointTest_UnauthorizedRequest_0_6OiBYU/http_credentials"
--http_heartbeat_interval="30secs" --initialize_driver_logging="true" --isolation="posix/cpu,posix/mem"
--launcher="posix" --launcher_dir="/mesos/mesos-1.3.0/_build/src" --logbufsecs="0" --logging_level="INFO"
--max_completed_executors_per_framework="150" --oversubscribed_resources_interval="15secs"
--perf_duration="10secs" --perf_interval="1mins" --qos_correction_interval_min="0ns" --quiet="false"
--recover="reconnect" --recovery_timeout="15mins" --registration_backoff_factor="10ms" --resources="cpus:2;gpus:0;mem:1024;disk:1024;ports:[31000-32000]"
--revocable_cpu_low_priority="true" --runtime_dir="/tmp/Endpoint_SlaveEndpointTest_UnauthorizedRequest_0_6OiBYU"
--sandbox_directory="/mnt/mesos/sandbox" --strict="true" --switch_user="true" --systemd_enable_support="true"
--systemd_runtime_directory="/run/systemd/system" --version="false" --work_dir="/tmp/Endpoint_SlaveEndpointTest_UnauthorizedRequest_0_9Oz2NX"
I0327 18:46:13.534032 15214 credentials.hpp:86] Loading credential for authentication from
'/tmp/Endpoint_SlaveEndpointTest_UnauthorizedRequest_0_6OiBYU/credential'
I0327 18:46:13.534338 15214 slave.cpp:259] Agent using credential for: test-principal
I0327 18:46:13.534375 15214 credentials.hpp:37] Loading credentials for authentication from
'/tmp/Endpoint_SlaveEndpointTest_UnauthorizedRequest_0_6OiBYU/http_credentials'
I0327 18:46:13.534710 15214 http.cpp:961] Creating default 'basic' HTTP authenticator for
realm 'mesos-agent-executor'
I0327 18:46:13.534831 15214 http.cpp:982] Creating default 'jwt' HTTP authenticator for realm
'mesos-agent-executor'
I0327 18:46:13.535109 15214 http.cpp:961] Creating default 'basic' HTTP authenticator for
realm 'mesos-agent-readonly'
I0327 18:46:13.535226 15214 http.cpp:982] Creating default 'jwt' HTTP authenticator for realm
'mesos-agent-readonly'
I0327 18:46:13.535446 15214 http.cpp:961] Creating default 'basic' HTTP authenticator for
realm 'mesos-agent-readwrite'
I0327 18:46:13.535574 15214 http.cpp:982] Creating default 'jwt' HTTP authenticator for realm
'mesos-agent-readwrite'
I0327 18:46:13.537065 15214 slave.cpp:486] Agent resources: cpus(*):2; mem(*):1024; disk(*):1024;
ports(*):[31000-32000]
I0327 18:46:13.537161 15214 slave.cpp:494] Agent attributes: [  ]
I0327 18:46:13.537184 15214 slave.cpp:499] Agent hostname: 5c2ceb52e790
I0327 18:46:13.537317 15209 status_update_manager.cpp:177] Pausing sending status updates
I0327 18:46:13.538825 15213 state.cpp:62] Recovering state from '/tmp/Endpoint_SlaveEndpointTest_UnauthorizedRequest_0_9Oz2NX/meta'
I0327 18:46:13.539072 15210 status_update_manager.cpp:203] Recovering status update manager
I0327 18:46:13.539379 15203 containerizer.cpp:608] Recovering containerizer
I0327 18:46:13.540763 15208 provisioner.cpp:410] Provisioner recovery complete
I0327 18:46:13.541234 15212 slave.cpp:5921] Finished recovery
I0327 18:46:13.541741 15212 slave.cpp:6103] Querying resource estimator for oversubscribable
resources
I0327 18:46:13.541975 15209 slave.cpp:6117] Received oversubscribable resources {} from the
resource estimator
I0327 18:46:13.544050 15206 process.cpp:3705] Handling HTTP event for process 'slave(725)'
with path: '/slave(725)/monitor/statistics'
I0327 18:46:13.545665 15215 http.cpp:922] Authorizing principal 'test-principal' to GET the
'/monitor/statistics' endpoint
I0327 18:46:13.548163 15206 slave.cpp:748] Agent terminating
[       OK ] Endpoint/SlaveEndpointTest.UnauthorizedRequest/0 (29 ms)
[ RUN      ] Endpoint/SlaveEndpointTest.UnauthorizedRequest/1
I0327 18:46:13.559520 31183 containerizer.cpp:221] Using isolation: posix/cpu,posix/mem,filesystem/posix,network/cni
W0327 18:46:13.560125 31183 backend.cpp:76] Failed to create 'aufs' backend: AufsBackend requires
root privileges
W0327 18:46:13.560243 31183 backend.cpp:76] Failed to create 'bind' backend: BindBackend requires
root privileges
I0327 18:46:13.560297 31183 provisioner.cpp:249] Using default backend 'copy'
I0327 18:46:13.563786 15213 slave.cpp:226] Mesos agent started on (726)@172.17.0.3:49550
I0327 18:46:13.563868 15213 slave.cpp:227] Flags at startup: --acls="" --appc_simple_discovery_uri_prefix="http://"
--appc_store_dir="/tmp/mesos/store/appc" --authenticate_http_executors="true" --authenticate_http_readonly="true"
--authenticate_http_readwrite="true" --authenticatee="crammd5" --authentication_backoff_factor="1secs"
--authorizer="local" --cgroups_cpu_enable_pids_and_tids_count="false" --cgroups_enable_cfs="false"
--cgroups_hierarchy="/sys/fs/cgroup" --cgroups_limit_swap="false" --cgroups_root="mesos" --container_disk_watch_interval="15secs"
--containerizers="mesos" --credential="/tmp/Endpoint_SlaveEndpointTest_UnauthorizedRequest_1_aWBCVJ/credential"
--default_role="*" --disk_watch_interval="1mins" --docker="docker" --docker_kill_orphans="true"
--docker_registry="https://registry-1.docker.io" --docker_remove_delay="6hrs" --docker_socket="/var/run/docker.sock"
--docker_stop_timeout="0ns" --docker_store_dir="/tmp/mesos/store/docker" --docker_volume_checkpoint_dir="/var/run/mesos/isolators/docker/volume"
--enforce_container_disk_quota="false" --executor_registration_timeout="1mins" --executor_secret_key="secret_key"
--executor_shutdown_grace_period="5secs" --fetcher_cache_dir="/tmp/Endpoint_SlaveEndpointTest_UnauthorizedRequest_1_aWBCVJ/fetch"
--fetcher_cache_size="2GB" --frameworks_home="" --gc_delay="1weeks" --gc_disk_headroom="0.1"
--hadoop_home="" --help="false" --hostname_lookup="true" --http_command_executor="false" --http_credentials="/tmp/Endpoint_SlaveEndpointTest_UnauthorizedRequest_1_aWBCVJ/http_credentials"
--http_heartbeat_interval="30secs" --initialize_driver_logging="true" --isolation="posix/cpu,posix/mem"
--launcher="posix" --launcher_dir="/mesos/mesos-1.3.0/_build/src" --logbufsecs="0" --logging_level="INFO"
--max_completed_executors_per_framework="150" --oversubscribed_resources_interval="15secs"
--perf_duration="10secs" --perf_interval="1mins" --qos_correction_interval_min="0ns" --quiet="false"
--recover="reconnect" --recovery_timeout="15mins" --registration_backoff_factor="10ms" --resources="cpus:2;gpus:0;mem:1024;disk:1024;ports:[31000-32000]"
--revocable_cpu_low_priority="true" --runtime_dir="/tmp/Endpoint_SlaveEndpointTest_UnauthorizedRequest_1_aWBCVJ"
--sandbox_directory="/mnt/mesos/sandbox" --strict="true" --switch_user="true" --systemd_enable_support="true"
--systemd_runtime_directory="/run/systemd/system" --version="false" --work_dir="/tmp/Endpoint_SlaveEndpointTest_UnauthorizedRequest_1_9zy9FM"
I0327 18:46:13.564545 15213 credentials.hpp:86] Loading credential for authentication from
'/tmp/Endpoint_SlaveEndpointTest_UnauthorizedRequest_1_aWBCVJ/credential'
I0327 18:46:13.564786 15213 slave.cpp:259] Agent using credential for: test-principal
I0327 18:46:13.564808 15213 credentials.hpp:37] Loading credentials for authentication from
'/tmp/Endpoint_SlaveEndpointTest_UnauthorizedRequest_1_aWBCVJ/http_credentials'
I0327 18:46:13.565062 15213 http.cpp:961] Creating default 'basic' HTTP authenticator for
realm 'mesos-agent-executor'
I0327 18:46:13.565237 15213 http.cpp:982] Creating default 'jwt' HTTP authenticator for realm
'mesos-agent-executor'
I0327 18:46:13.565464 15213 http.cpp:961] Creating default 'basic' HTTP authenticator for
realm 'mesos-agent-readonly'
I0327 18:46:13.565563 15213 http.cpp:982] Creating default 'jwt' HTTP authenticator for realm
'mesos-agent-readonly'
I0327 18:46:13.565862 15213 http.cpp:961] Creating default 'basic' HTTP authenticator for
realm 'mesos-agent-readwrite'
I0327 18:46:13.566009 15213 http.cpp:982] Creating default 'jwt' HTTP authenticator for realm
'mesos-agent-readwrite'
I0327 18:46:13.567394 15213 slave.cpp:486] Agent resources: cpus(*):2; mem(*):1024; disk(*):1024;
ports(*):[31000-32000]
I0327 18:46:13.567476 15213 slave.cpp:494] Agent attributes: [  ]
I0327 18:46:13.567489 15213 slave.cpp:499] Agent hostname: 5c2ceb52e790
I0327 18:46:13.567605 15203 status_update_manager.cpp:177] Pausing sending status updates
I0327 18:46:13.568964 15212 state.cpp:62] Recovering state from '/tmp/Endpoint_SlaveEndpointTest_UnauthorizedRequest_1_9zy9FM/meta'
I0327 18:46:13.569233 15213 status_update_manager.cpp:203] Recovering status update manager
I0327 18:46:13.569445 15208 containerizer.cpp:608] Recovering containerizer
I0327 18:46:13.570741 15200 provisioner.cpp:410] Provisioner recovery complete
I0327 18:46:13.571178 15214 slave.cpp:5921] Finished recovery
I0327 18:46:13.571652 15214 slave.cpp:6103] Querying resource estimator for oversubscribable
resources
I0327 18:46:13.571908 15204 slave.cpp:6117] Received oversubscribable resources {} from the
resource estimator
I0327 18:46:13.573729 15204 process.cpp:3705] Handling HTTP event for process 'slave(726)'
with path: '/slave(726)/monitor/statistics.json'
I0327 18:46:13.575480 15209 http.cpp:922] Authorizing principal 'test-principal' to GET the
'/monitor/statistics.json' endpoint
I0327 18:46:13.577399 15211 slave.cpp:748] Agent terminating
[       OK ] Endpoint/SlaveEndpointTest.UnauthorizedRequest/1 (27 ms)
[ RUN      ] Endpoint/SlaveEndpointTest.UnauthorizedRequest/2
I0327 18:46:13.587677 31183 containerizer.cpp:221] Using isolation: posix/cpu,posix/mem,filesystem/posix,network/cni
W0327 18:46:13.588277 31183 backend.cpp:76] Failed to create 'aufs' backend: AufsBackend requires
root privileges
W0327 18:46:13.588395 31183 backend.cpp:76] Failed to create 'bind' backend: BindBackend requires
root privileges
I0327 18:46:13.588445 31183 provisioner.cpp:249] Using default backend 'copy'
I0327 18:46:13.591552 15213 slave.cpp:226] Mesos agent started on (727)@172.17.0.3:49550
I0327 18:46:13.591586 15213 slave.cpp:227] Flags at startup: --acls="" --appc_simple_discovery_uri_prefix="http://"
--appc_store_dir="/tmp/mesos/store/appc" --authenticate_http_executors="true" --authenticate_http_readonly="true"
--authenticate_http_readwrite="true" --authenticatee="crammd5" --authentication_backoff_factor="1secs"
--authorizer="local" --cgroups_cpu_enable_pids_and_tids_count="false" --cgroups_enable_cfs="false"
--cgroups_hierarchy="/sys/fs/cgroup" --cgroups_limit_swap="false" --cgroups_root="mesos" --container_disk_watch_interval="15secs"
--containerizers="mesos" --credential="/tmp/Endpoint_SlaveEndpointTest_UnauthorizedRequest_2_KBzcbz/credential"
--default_role="*" --disk_watch_interval="1mins" --docker="docker" --docker_kill_orphans="true"
--docker_registry="https://registry-1.docker.io" --docker_remove_delay="6hrs" --docker_socket="/var/run/docker.sock"
--docker_stop_timeout="0ns" --docker_store_dir="/tmp/mesos/store/docker" --docker_volume_checkpoint_dir="/var/run/mesos/isolators/docker/volume"
--enforce_container_disk_quota="false" --executor_registration_timeout="1mins" --executor_secret_key="secret_key"
--executor_shutdown_grace_period="5secs" --fetcher_cache_dir="/tmp/Endpoint_SlaveEndpointTest_UnauthorizedRequest_2_KBzcbz/fetch"
--fetcher_cache_size="2GB" --frameworks_home="" --gc_delay="1weeks" --gc_disk_headroom="0.1"
--hadoop_home="" --help="false" --hostname_lookup="true" --http_command_executor="false" --http_credentials="/tmp/Endpoint_SlaveEndpointTest_UnauthorizedRequest_2_KBzcbz/http_credentials"
--http_heartbeat_interval="30secs" --initialize_driver_logging="true" --isolation="posix/cpu,posix/mem"
--launcher="posix" --launcher_dir="/mesos/mesos-1.3.0/_build/src" --logbufsecs="0" --logging_level="INFO"
--max_completed_executors_per_framework="150" --oversubscribed_resources_interval="15secs"
--perf_duration="10secs" --perf_interval="1mins" --qos_correction_interval_min="0ns" --quiet="false"
--recover="reconnect" --recovery_timeout="15mins" --registration_backoff_factor="10ms" --resources="cpus:2;gpus:0;mem:1024;disk:1024;ports:[31000-32000]"
--revocable_cpu_low_priority="true" --runtime_dir="/tmp/Endpoint_SlaveEndpointTest_UnauthorizedRequest_2_KBzcbz"
--sandbox_directory="/mnt/mesos/sandbox" --strict="true" --switch_user="true" --systemd_enable_support="true"
--systemd_runtime_directory="/run/systemd/system" --version="false" --work_dir="/tmp/Endpoint_SlaveEndpointTest_UnauthorizedRequest_2_dVoaRB"
I0327 18:46:13.592069 15213 credentials.hpp:86] Loading credential for authentication from
'/tmp/Endpoint_SlaveEndpointTest_UnauthorizedRequest_2_KBzcbz/credential'
I0327 18:46:13.592195 15213 slave.cpp:259] Agent using credential for: test-principal
I0327 18:46:13.592216 15213 credentials.hpp:37] Loading credentials for authentication from
'/tmp/Endpoint_SlaveEndpointTest_UnauthorizedRequest_2_KBzcbz/http_credentials'
I0327 18:46:13.592438 15213 http.cpp:961] Creating default 'basic' HTTP authenticator for
realm 'mesos-agent-executor'
I0327 18:46:13.592530 15213 http.cpp:982] Creating default 'jwt' HTTP authenticator for realm
'mesos-agent-executor'
I0327 18:46:13.592779 15213 http.cpp:961] Creating default 'basic' HTTP authenticator for
realm 'mesos-agent-readonly'
I0327 18:46:13.592900 15213 http.cpp:982] Creating default 'jwt' HTTP authenticator for realm
'mesos-agent-readonly'
I0327 18:46:13.593132 15213 http.cpp:961] Creating default 'basic' HTTP authenticator for
realm 'mesos-agent-readwrite'
I0327 18:46:13.593247 15213 http.cpp:982] Creating default 'jwt' HTTP authenticator for realm
'mesos-agent-readwrite'
I0327 18:46:13.594466 15213 slave.cpp:486] Agent resources: cpus(*):2; mem(*):1024; disk(*):1024;
ports(*):[31000-32000]
I0327 18:46:13.594544 15213 slave.cpp:494] Agent attributes: [  ]
I0327 18:46:13.594564 15213 slave.cpp:499] Agent hostname: 5c2ceb52e790
I0327 18:46:13.594692 15204 status_update_manager.cpp:177] Pausing sending status updates
I0327 18:46:13.596004 15201 state.cpp:62] Recovering state from '/tmp/Endpoint_SlaveEndpointTest_UnauthorizedRequest_2_dVoaRB/meta'
I0327 18:46:13.596321 15215 status_update_manager.cpp:203] Recovering status update manager
I0327 18:46:13.596546 15213 containerizer.cpp:608] Recovering containerizer
I0327 18:46:13.597838 15201 provisioner.cpp:410] Provisioner recovery complete
I0327 18:46:13.598209 15208 slave.cpp:5921] Finished recovery
I0327 18:46:13.598682 15208 slave.cpp:6103] Querying resource estimator for oversubscribable
resources
I0327 18:46:13.598861 15212 slave.cpp:6117] Received oversubscribable resources {} from the
resource estimator
I0327 18:46:13.600409 15209 process.cpp:3705] Handling HTTP event for process 'slave(727)'
with path: '/slave(727)/containers'
I0327 18:46:13.602383 15201 http.cpp:922] Authorizing principal 'test-principal' to GET the
'/containers' endpoint
I0327 18:46:13.604203 15215 slave.cpp:748] Agent terminating
[       OK ] Endpoint/SlaveEndpointTest.UnauthorizedRequest/2 (27 ms)
[ RUN      ] Endpoint/SlaveEndpointTest.NoAuthorizer/0
I0327 18:46:13.614984 31183 containerizer.cpp:221] Using isolation: posix/cpu,posix/mem,filesystem/posix,network/cni
W0327 18:46:13.615453 31183 backend.cpp:76] Failed to create 'aufs' backend: AufsBackend requires
root privileges
W0327 18:46:13.615557 31183 backend.cpp:76] Failed to create 'bind' backend: BindBackend requires
root privileges
I0327 18:46:13.615602 31183 provisioner.cpp:249] Using default backend 'copy'
I0327 18:46:13.617151 31183 cluster.cpp:446] Creating default 'local' authorizer
I0327 18:46:13.618738 15207 slave.cpp:226] Mesos agent started on (728)@172.17.0.3:49550
I0327 18:46:13.618779 15207 slave.cpp:227] Flags at startup: --acls="" --appc_simple_discovery_uri_prefix="http://"
--appc_store_dir="/tmp/mesos/store/appc" --authenticate_http_executors="true" --authenticate_http_readonly="true"
--authenticate_http_readwrite="true" --authenticatee="crammd5" --authentication_backoff_factor="1secs"
--authorizer="local" --cgroups_cpu_enable_pids_and_tids_count="false" --cgroups_enable_cfs="false"
--cgroups_hierarchy="/sys/fs/cgroup" --cgroups_limit_swap="false" --cgroups_root="mesos" --container_disk_watch_interval="15secs"
--containerizers="mesos" --credential="/tmp/Endpoint_SlaveEndpointTest_NoAuthorizer_0_6ospIo/credential"
--default_role="*" --disk_watch_interval="1mins" --docker="docker" --docker_kill_orphans="true"
--docker_registry="https://registry-1.docker.io" --docker_remove_delay="6hrs" --docker_socket="/var/run/docker.sock"
--docker_stop_timeout="0ns" --docker_store_dir="/tmp/mesos/store/docker" --docker_volume_checkpoint_dir="/var/run/mesos/isolators/docker/volume"
--enforce_container_disk_quota="false" --executor_registration_timeout="1mins" --executor_secret_key="secret_key"
--executor_shutdown_grace_period="5secs" --fetcher_cache_dir="/tmp/Endpoint_SlaveEndpointTest_NoAuthorizer_0_6ospIo/fetch"
--fetcher_cache_size="2GB" --frameworks_home="" --gc_delay="1weeks" --gc_disk_headroom="0.1"
--hadoop_home="" --help="false" --hostname_lookup="true" --http_command_executor="false" --http_credentials="/tmp/Endpoint_SlaveEndpointTest_NoAuthorizer_0_6ospIo/http_credentials"
--http_heartbeat_interval="30secs" --initialize_driver_logging="true" --isolation="posix/cpu,posix/mem"
--launcher="posix" --launcher_dir="/mesos/mesos-1.3.0/_build/src" --logbufsecs="0" --logging_level="INFO"
--max_completed_executors_per_framework="150" --oversubscribed_resources_interval="15secs"
--perf_duration="10secs" --perf_interval="1mins" --qos_correction_interval_min="0ns" --quiet="false"
--recover="reconnect" --recovery_timeout="15mins" --registration_backoff_factor="10ms" --resources="cpus:2;gpus:0;mem:1024;disk:1024;ports:[31000-32000]"
--revocable_cpu_low_priority="true" --runtime_dir="/tmp/Endpoint_SlaveEndpointTest_NoAuthorizer_0_6ospIo"
--sandbox_directory="/mnt/mesos/sandbox" --strict="true" --switch_user="true" --systemd_enable_support="true"
--systemd_runtime_directory="/run/systemd/system" --version="false" --work_dir="/tmp/Endpoint_SlaveEndpointTest_NoAuthorizer_0_Fo8Xjr"
I0327 18:46:13.619576 15207 credentials.hpp:86] Loading credential for authentication from
'/tmp/Endpoint_SlaveEndpointTest_NoAuthorizer_0_6ospIo/credential'
I0327 18:46:13.619750 15207 slave.cpp:259] Agent using credential for: test-principal
I0327 18:46:13.619781 15207 credentials.hpp:37] Loading credentials for authentication from
'/tmp/Endpoint_SlaveEndpointTest_NoAuthorizer_0_6ospIo/http_credentials'
I0327 18:46:13.620106 15207 http.cpp:961] Creating default 'basic' HTTP authenticator for
realm 'mesos-agent-executor'
I0327 18:46:13.620223 15207 http.cpp:982] Creating default 'jwt' HTTP authenticator for realm
'mesos-agent-executor'
I0327 18:46:13.620476 15207 http.cpp:961] Creating default 'basic' HTTP authenticator for
realm 'mesos-agent-readonly'
I0327 18:46:13.620582 15207 http.cpp:982] Creating default 'jwt' HTTP authenticator for realm
'mesos-agent-readonly'
I0327 18:46:13.620821 15207 http.cpp:961] Creating default 'basic' HTTP authenticator for
realm 'mesos-agent-readwrite'
I0327 18:46:13.620937 15207 http.cpp:982] Creating default 'jwt' HTTP authenticator for realm
'mesos-agent-readwrite'
I0327 18:46:13.622382 15207 slave.cpp:486] Agent resources: cpus(*):2; mem(*):1024; disk(*):1024;
ports(*):[31000-32000]
I0327 18:46:13.622469 15207 slave.cpp:494] Agent attributes: [  ]
I0327 18:46:13.622483 15207 slave.cpp:499] Agent hostname: 5c2ceb52e790
I0327 18:46:13.622606 15208 status_update_manager.cpp:177] Pausing sending status updates
I0327 18:46:13.624039 15203 state.cpp:62] Recovering state from '/tmp/Endpoint_SlaveEndpointTest_NoAuthorizer_0_Fo8Xjr/meta'
I0327 18:46:13.624430 15209 status_update_manager.cpp:203] Recovering status update manager
I0327 18:46:13.624644 15202 containerizer.cpp:608] Recovering containerizer
I0327 18:46:13.626075 15215 provisioner.cpp:410] Provisioner recovery complete
I0327 18:46:13.626624 15213 slave.cpp:5921] Finished recovery
I0327 18:46:13.627202 15213 slave.cpp:6103] Querying resource estimator for oversubscribable
resources
I0327 18:46:13.627579 15209 slave.cpp:6117] Received oversubscribable resources {} from the
resource estimator
I0327 18:46:13.629657 15209 process.cpp:3705] Handling HTTP event for process 'slave(728)'
with path: '/slave(728)/monitor/statistics'
I0327 18:46:13.631613 15200 http.cpp:922] Authorizing principal 'test-principal' to GET the
'/monitor/statistics' endpoint
I0327 18:46:13.635007 15211 slave.cpp:748] Agent terminating
[       OK ] Endpoint/SlaveEndpointTest.NoAuthorizer/0 (31 ms)
[ RUN      ] Endpoint/SlaveEndpointTest.NoAuthorizer/1
I0327 18:46:13.646438 31183 containerizer.cpp:221] Using isolation: posix/cpu,posix/mem,filesystem/posix,network/cni
W0327 18:46:13.647042 31183 backend.cpp:76] Failed to create 'aufs' backend: AufsBackend requires
root privileges
W0327 18:46:13.647169 31183 backend.cpp:76] Failed to create 'bind' backend: BindBackend requires
root privileges
I0327 18:46:13.647219 31183 provisioner.cpp:249] Using default backend 'copy'
I0327 18:46:13.649039 31183 cluster.cpp:446] Creating default 'local' authorizer
I0327 18:46:13.650779 15209 slave.cpp:226] Mesos agent started on (729)@172.17.0.3:49550
I0327 18:46:13.650833 15209 slave.cpp:227] Flags at startup: --acls="" --appc_simple_discovery_uri_prefix="http://"
--appc_store_dir="/tmp/mesos/store/appc" --authenticate_http_executors="true" --authenticate_http_readonly="true"
--authenticate_http_readwrite="true" --authenticatee="crammd5" --authentication_backoff_factor="1secs"
--authorizer="local" --cgroups_cpu_enable_pids_and_tids_count="false" --cgroups_enable_cfs="false"
--cgroups_hierarchy="/sys/fs/cgroup" --cgroups_limit_swap="false" --cgroups_root="mesos" --container_disk_watch_interval="15secs"
--containerizers="mesos" --credential="/tmp/Endpoint_SlaveEndpointTest_NoAuthorizer_1_gOBvze/credential"
--default_role="*" --disk_watch_interval="1mins" --docker="docker" --docker_kill_orphans="true"
--docker_registry="https://registry-1.docker.io" --docker_remove_delay="6hrs" --docker_socket="/var/run/docker.sock"
--docker_stop_timeout="0ns" --docker_store_dir="/tmp/mesos/store/docker" --docker_volume_checkpoint_dir="/var/run/mesos/isolators/docker/volume"
--enforce_container_disk_quota="false" --executor_registration_timeout="1mins" --executor_secret_key="secret_key"
--executor_shutdown_grace_period="5secs" --fetcher_cache_dir="/tmp/Endpoint_SlaveEndpointTest_NoAuthorizer_1_gOBvze/fetch"
--fetcher_cache_size="2GB" --frameworks_home="" --gc_delay="1weeks" --gc_disk_headroom="0.1"
--hadoop_home="" --help="false" --hostname_lookup="true" --http_command_executor="false" --http_credentials="/tmp/Endpoint_SlaveEndpointTest_NoAuthorizer_1_gOBvze/http_credentials"
--http_heartbeat_interval="30secs" --initialize_driver_logging="true" --isolation="posix/cpu,posix/mem"
--launcher="posix" --launcher_dir="/mesos/mesos-1.3.0/_build/src" --logbufsecs="0" --logging_level="INFO"
--max_completed_executors_per_framework="150" --oversubscribed_resources_interval="15secs"
--perf_duration="10secs" --perf_interval="1mins" --qos_correction_interval_min="0ns" --quiet="false"
--recover="reconnect" --recovery_timeout="15mins" --registration_backoff_factor="10ms" --resources="cpus:2;gpus:0;mem:1024;disk:1024;ports:[31000-32000]"
--revocable_cpu_low_priority="true" --runtime_dir="/tmp/Endpoint_SlaveEndpointTest_NoAuthorizer_1_gOBvze"
--sandbox_directory="/mnt/mesos/sandbox" --strict="true" --switch_user="true" --systemd_enable_support="true"
--systemd_runtime_directory="/run/systemd/system" --version="false" --work_dir="/tmp/Endpoint_SlaveEndpointTest_NoAuthorizer_1_PtvY5g"
I0327 18:46:13.651504 15209 credentials.hpp:86] Loading credential for authentication from
'/tmp/Endpoint_SlaveEndpointTest_NoAuthorizer_1_gOBvze/credential'
I0327 18:46:13.651655 15209 slave.cpp:259] Agent using credential for: test-principal
I0327 18:46:13.651700 15209 credentials.hpp:37] Loading credentials for authentication from
'/tmp/Endpoint_SlaveEndpointTest_NoAuthorizer_1_gOBvze/http_credentials'
I0327 18:46:13.651938 15209 http.cpp:961] Creating default 'basic' HTTP authenticator for
realm 'mesos-agent-executor'
I0327 18:46:13.652030 15209 http.cpp:982] Creating default 'jwt' HTTP authenticator for realm
'mesos-agent-executor'
I0327 18:46:13.652269 15209 http.cpp:961] Creating default 'basic' HTTP authenticator for
realm 'mesos-agent-readonly'
I0327 18:46:13.652392 15209 http.cpp:982] Creating default 'jwt' HTTP authenticator for realm
'mesos-agent-readonly'
I0327 18:46:13.652629 15209 http.cpp:961] Creating default 'basic' HTTP authenticator for
realm 'mesos-agent-readwrite'
I0327 18:46:13.652724 15209 http.cpp:982] Creating default 'jwt' HTTP authenticator for realm
'mesos-agent-readwrite'
I0327 18:46:13.653831 15209 slave.cpp:486] Agent resources: cpus(*):2; mem(*):1024; disk(*):1024;
ports(*):[31000-32000]
I0327 18:46:13.653905 15209 slave.cpp:494] Agent attributes: [  ]
I0327 18:46:13.653918 15209 slave.cpp:499] Agent hostname: 5c2ceb52e790
I0327 18:46:13.654034 15208 status_update_manager.cpp:177] Pausing sending status updates
I0327 18:46:13.655437 15211 state.cpp:62] Recovering state from '/tmp/Endpoint_SlaveEndpointTest_NoAuthorizer_1_PtvY5g/meta'
I0327 18:46:13.655666 15205 status_update_manager.cpp:203] Recovering status update manager
I0327 18:46:13.655917 15212 containerizer.cpp:608] Recovering containerizer
I0327 18:46:13.656988 15204 provisioner.cpp:410] Provisioner recovery complete
I0327 18:46:13.657421 15200 slave.cpp:5921] Finished recovery
I0327 18:46:13.657860 15200 slave.cpp:6103] Querying resource estimator for oversubscribable
resources
I0327 18:46:13.658073 15204 slave.cpp:6117] Received oversubscribable resources {} from the
resource estimator
I0327 18:46:13.660130 15200 process.cpp:3705] Handling HTTP event for process 'slave(729)'
with path: '/slave(729)/monitor/statistics.json'
I0327 18:46:13.662385 15209 http.cpp:922] Authorizing principal 'test-principal' to GET the
'/monitor/statistics.json' endpoint
I0327 18:46:13.666136 15203 slave.cpp:748] Agent terminating
[       OK ] Endpoint/SlaveEndpointTest.NoAuthorizer/1 (29 ms)
[ RUN      ] Endpoint/SlaveEndpointTest.NoAuthorizer/2
I0327 18:46:13.676089 31183 containerizer.cpp:221] Using isolation: posix/cpu,posix/mem,filesystem/posix,network/cni
W0327 18:46:13.676509 31183 backend.cpp:76] Failed to create 'aufs' backend: AufsBackend requires
root privileges
W0327 18:46:13.676599 31183 backend.cpp:76] Failed to create 'bind' backend: BindBackend requires
root privileges
I0327 18:46:13.676630 31183 provisioner.cpp:249] Using default backend 'copy'
I0327 18:46:13.678001 31183 cluster.cpp:446] Creating default 'local' authorizer
I0327 18:46:13.679460 15212 slave.cpp:226] Mesos agent started on (730)@172.17.0.3:49550
I0327 18:46:13.679494 15212 slave.cpp:227] Flags at startup: --acls="" --appc_simple_discovery_uri_prefix="http://"
--appc_store_dir="/tmp/mesos/store/appc" --authenticate_http_executors="true" --authenticate_http_readonly="true"
--authenticate_http_readwrite="true" --authenticatee="crammd5" --authentication_backoff_factor="1secs"
--authorizer="local" --cgroups_cpu_enable_pids_and_tids_count="false" --cgroups_enable_cfs="false"
--cgroups_hierarchy="/sys/fs/cgroup" --cgroups_limit_swap="false" --cgroups_root="mesos" --container_disk_watch_interval="15secs"
--containerizers="mesos" --credential="/tmp/Endpoint_SlaveEndpointTest_NoAuthorizer_2_K28kK4/credential"
--default_role="*" --disk_watch_interval="1mins" --docker="docker" --docker_kill_orphans="true"
--docker_registry="https://registry-1.docker.io" --docker_remove_delay="6hrs" --docker_socket="/var/run/docker.sock"
--docker_stop_timeout="0ns" --docker_store_dir="/tmp/mesos/store/docker" --docker_volume_checkpoint_dir="/var/run/mesos/isolators/docker/volume"
--enforce_container_disk_quota="false" --executor_registration_timeout="1mins" --executor_secret_key="secret_key"
--executor_shutdown_grace_period="5secs" --fetcher_cache_dir="/tmp/Endpoint_SlaveEndpointTest_NoAuthorizer_2_K28kK4/fetch"
--fetcher_cache_size="2GB" --frameworks_home="" --gc_delay="1weeks" --gc_disk_headroom="0.1"
--hadoop_home="" --help="false" --hostname_lookup="true" --http_command_executor="false" --http_credentials="/tmp/Endpoint_SlaveEndpointTest_NoAuthorizer_2_K28kK4/http_credentials"
--http_heartbeat_interval="30secs" --initialize_driver_logging="true" --isolation="posix/cpu,posix/mem"
--launcher="posix" --launcher_dir="/mesos/mesos-1.3.0/_build/src" --logbufsecs="0" --logging_level="INFO"
--max_completed_executors_per_framework="150" --oversubscribed_resources_interval="15secs"
--perf_duration="10secs" --perf_interval="1mins" --qos_correction_interval_min="0ns" --quiet="false"
--recover="reconnect" --recovery_timeout="15mins" --registration_backoff_factor="10ms" --resources="cpus:2;gpus:0;mem:1024;disk:1024;ports:[31000-32000]"
--revocable_cpu_low_priority="true" --runtime_dir="/tmp/Endpoint_SlaveEndpointTest_NoAuthorizer_2_K28kK4"
--sandbox_directory="/mnt/mesos/sandbox" --strict="true" --switch_user="true" --systemd_enable_support="true"
--systemd_runtime_directory="/run/systemd/system" --version="false" --work_dir="/tmp/Endpoint_SlaveEndpointTest_NoAuthorizer_2_3MTTb7"
I0327 18:46:13.679915 15212 credentials.hpp:86] Loading credential for authentication from
'/tmp/Endpoint_SlaveEndpointTest_NoAuthorizer_2_K28kK4/credential'
I0327 18:46:13.680043 15212 slave.cpp:259] Agent using credential for: test-principal
I0327 18:46:13.680063 15212 credentials.hpp:37] Loading credentials for authentication from
'/tmp/Endpoint_SlaveEndpointTest_NoAuthorizer_2_K28kK4/http_credentials'
I0327 18:46:13.680261 15212 http.cpp:961] Creating default 'basic' HTTP authenticator for
realm 'mesos-agent-executor'
I0327 18:46:13.680366 15212 http.cpp:982] Creating default 'jwt' HTTP authenticator for realm
'mesos-agent-executor'
I0327 18:46:13.680527 15212 http.cpp:961] Creating default 'basic' HTTP authenticator for
realm 'mesos-agent-readonly'
I0327 18:46:13.680652 15212 http.cpp:982] Creating default 'jwt' HTTP authenticator for realm
'mesos-agent-readonly'
I0327 18:46:13.680889 15212 http.cpp:961] Creating default 'basic' HTTP authenticator for
realm 'mesos-agent-readwrite'
I0327 18:46:13.681030 15212 http.cpp:982] Creating default 'jwt' HTTP authenticator for realm
'mesos-agent-readwrite'
I0327 18:46:13.682126 15212 slave.cpp:486] Agent resources: cpus(*):2; mem(*):1024; disk(*):1024;
ports(*):[31000-32000]
I0327 18:46:13.682229 15212 slave.cpp:494] Agent attributes: [  ]
I0327 18:46:13.682248 15212 slave.cpp:499] Agent hostname: 5c2ceb52e790
I0327 18:46:13.682435 15203 status_update_manager.cpp:177] Pausing sending status updates
I0327 18:46:13.683600 15211 state.cpp:62] Recovering state from '/tmp/Endpoint_SlaveEndpointTest_NoAuthorizer_2_3MTTb7/meta'
I0327 18:46:13.684109 15212 status_update_manager.cpp:203] Recovering status update manager
I0327 18:46:13.684372 15213 containerizer.cpp:608] Recovering containerizer
I0327 18:46:13.685993 15209 provisioner.cpp:410] Provisioner recovery complete
I0327 18:46:13.686601 15202 slave.cpp:5921] Finished recovery
I0327 18:46:13.687317 15202 slave.cpp:6103] Querying resource estimator for oversubscribable
resources
I0327 18:46:13.687558 15214 slave.cpp:6117] Received oversubscribable resources {} from the
resource estimator
I0327 18:46:13.689679 15213 process.cpp:3705] Handling HTTP event for process 'slave(730)'
with path: '/slave(730)/containers'
I0327 18:46:13.692193 15207 http.cpp:922] Authorizing principal 'test-principal' to GET the
'/containers' endpoint
I0327 18:46:13.696240 15203 slave.cpp:748] Agent terminating
[       OK ] Endpoint/SlaveEndpointTest.NoAuthorizer/2 (29 ms)
[----------] 9 tests from Endpoint/SlaveEndpointTest (276 ms total)

[----------] Global test environment tear-down
[==========] 1537 tests from 174 test cases ran. (430133 ms total)
[  PASSED  ] 1536 tests.
[  FAILED  ] 1 test, listed below:
[  FAILED  ] DefaultExecutorCheckTest.HTTPCheckDelivered

 1 FAILED TEST
  YOU HAVE 12 DISABLED TESTS

make[4]: *** [check-local] Error 1
make[4]: Leaving directory `/mesos/mesos-1.3.0/_build/src'
make[3]: *** [check-am] Error 2
make[3]: Leaving directory `/mesos/mesos-1.3.0/_build/src'
make[2]: *** [check] Error 2
make[2]: Leaving directory `/mesos/mesos-1.3.0/_build/src'
make[1]: *** [check-recursive] Error 1
make[1]: Leaving directory `/mesos/mesos-1.3.0/_build'
make: *** [distcheck] Error 1
+ docker rmi mesos-1490637708-21929
Untagged: mesos-1490637708-21929:latest
Deleted: sha256:0608274fbcf3045ec48ebead1488a4495937b78579a682d45cfdc018aa2b0c14
Deleted: sha256:1f650972de0a5e27b86465e4968ba77bf2d3279c566811b8ca2dac556b0faa4a
Deleted: sha256:3ceba32a50ec9df82644dde3fa97fcc8538d933ebb71dcb342d3d25841dfea2d
Deleted: sha256:2c099daad83f11044bef4537cda7fa41ca11d18d0d5c6c4df88790b5a1a3d12e
Deleted: sha256:ea8a2c2e682e584daf0902f53e04a3e2e8485ae1c902feccee21f226b8ac83e3
Deleted: sha256:86c73ab9a8603448d9327f1a6a557220097a6ab80b50c2daff1c5c4cab7be3b0
Deleted: sha256:c428686ab84fd208c9fb82939903d587a87f37ba42195330946c5cde49ec2a65
Deleted: sha256:0ccf3b4f311898c807646ebc558046d12d60372b444dfc3e6e66e9081f4334fd
Deleted: sha256:472c68e79d34d533ce4dac5d2cac1097b952ee19e08714934004e9eb6d2ef01f
Deleted: sha256:d18cfcabf28de9ce978086f02a9026ad5966425955711f6bcb32a48b94a02dcc
Deleted: sha256:abf5480766c9744f4f5755c5f33af83abd8c20d868aa4732f22be6d90ebce833
Deleted: sha256:06299b58f662581ac2f9e7b4826a672bf84b1d33d78c00786682ad81dbf28f01
Deleted: sha256:d315ddeb63bfa69c5269f226f134c0add2b79aabff9777537f45f520463724d2
Deleted: sha256:665cbd284a26195c09ddc797ab21aabc416afbd6b240040efd357c263dc9afe9
Deleted: sha256:3687155e8a03bcd6a3f8c46dd24397a37514b141f421ba012b2ac241719fd4f4
Deleted: sha256:3ea4cadfc8f2efcfa1ab13ba8b923364eb6e9faa4cd7265c65288cfeabb7f797
Deleted: sha256:a26ad3b1f0ad8d3d6cf085e86acfacebdba80b7e0de4211bea8c5b4499b25da2
Deleted: sha256:4bf6a71d6c180024e8a37306487a9f9f626ffb133efaf7746ce032063484d4bc
Deleted: sha256:083b79fbfdbb6d0b495c4267b4591849190cb062826b0cdd23f118ad71f6e72f
Deleted: sha256:fb5f3fea7ec40e72e69d7d648634cbccced6836ef40f03cda3d9d3fbd6bc5811
Deleted: sha256:f531e43f15b1e168b0a69464e9a4666a408155775ef6169e9e0b5d8c1c7107c9
Deleted: sha256:bdbb5f8f459ac787ee62b211143cdcb54e170165246a5e657bad4b6a19ce76df
Deleted: sha256:046218840ff62b2894c6bd29e83071848b6f8b99eb9e26bea62ffe92c73d7d86
Deleted: sha256:5bf1a23da5157a14373a97ef7809c75a423ef9d8404d6ce83ce44da7b1cdddac
Build step 'Execute shell' marked build as failure

Mime
View raw message