mesos-builds mailing list archives

Site index · List index
Message view « Date » · « Thread »
Top « Date » · « Thread »
From Apache Jenkins Server <jenk...@builds.apache.org>
Subject Build failed in Jenkins: Mesos-Buildbot » autotools,clang,--verbose --enable-libevent --enable-ssl,GLOG_v=1 MESOS_VERBOSE=1,ubuntu:14.04,(docker||Hadoop)&&(!ubuntu-us1)&&(!ubuntu-eu2) #3406
Date Thu, 23 Mar 2017 23:12:29 GMT
See <https://builds.apache.org/job/Mesos-Buildbot/BUILDTOOL=autotools,COMPILER=clang,CONFIGURATION=--verbose%20--enable-libevent%20--enable-ssl,ENVIRONMENT=GLOG_v=1%20MESOS_VERBOSE=1,OS=ubuntu%3A14.04,label_exp=(docker%7C%7CHadoop)&&(!ubuntu-us1)&&(!ubuntu-eu2)/3406/display/redirect?page=changes>

Changes:

[toenshoff] Fixed flags logging in Docker executor.

[josephwu] Windows: Fixed usage of WindowsError in stat.hpp.

[josephwu] Fixed 'all be it' typo.

------------------------------------------
[...truncated 2.59 MB...]
I0323 23:12:18.732254 26259 openssl.cpp:435] Will only verify peer certificate if presented!
NOTE: Set LIBPROCESS_SSL_REQUIRE_CERT=1 to require peer certificate verification
[       OK ] SSLTest.HTTPSGet (365 ms)
[ RUN      ] SSLTest.HTTPSPost
I0323 23:12:19.300851 26259 openssl.cpp:419] CA file path is unspecified! NOTE: Set CA file
path with LIBPROCESS_SSL_CA_FILE=<filepath>
I0323 23:12:19.300876 26259 openssl.cpp:424] CA directory path unspecified! NOTE: Set CA directory
path with LIBPROCESS_SSL_CA_DIR=<dirpath>
I0323 23:12:19.300882 26259 openssl.cpp:429] Will not verify peer certificate!
NOTE: Set LIBPROCESS_SSL_VERIFY_CERT=1 to enable peer certificate verification
I0323 23:12:19.300887 26259 openssl.cpp:435] Will only verify peer certificate if presented!
NOTE: Set LIBPROCESS_SSL_REQUIRE_CERT=1 to require peer certificate verification
[       OK ] SSLTest.HTTPSPost (569 ms)
[ RUN      ] SSLTest.SilentSocket
I0323 23:12:19.653645 26259 openssl.cpp:419] CA file path is unspecified! NOTE: Set CA file
path with LIBPROCESS_SSL_CA_FILE=<filepath>
I0323 23:12:19.653672 26259 openssl.cpp:424] CA directory path unspecified! NOTE: Set CA directory
path with LIBPROCESS_SSL_CA_DIR=<dirpath>
I0323 23:12:19.653678 26259 openssl.cpp:429] Will not verify peer certificate!
NOTE: Set LIBPROCESS_SSL_VERIFY_CERT=1 to enable peer certificate verification
I0323 23:12:19.653682 26259 openssl.cpp:435] Will only verify peer certificate if presented!
NOTE: Set LIBPROCESS_SSL_REQUIRE_CERT=1 to require peer certificate verification
I0323 23:12:19.664214 26276 libevent_ssl_socket.cpp:1170] Socket error: error:00000000:lib(0):func(0):reason(0)
[       OK ] SSLTest.SilentSocket (356 ms)
[----------] 15 tests from SSLTest (8462 ms total)

[----------] 42 tests from Scheme/HTTPTest
[ RUN      ] Scheme/HTTPTest.Endpoints/0
I0323 23:12:20.022742 26259 openssl.cpp:419] CA file path is unspecified! NOTE: Set CA file
path with LIBPROCESS_SSL_CA_FILE=<filepath>
I0323 23:12:20.022769 26259 openssl.cpp:424] CA directory path unspecified! NOTE: Set CA directory
path with LIBPROCESS_SSL_CA_DIR=<dirpath>
I0323 23:12:20.022774 26259 openssl.cpp:429] Will not verify peer certificate!
NOTE: Set LIBPROCESS_SSL_VERIFY_CERT=1 to enable peer certificate verification
I0323 23:12:20.022778 26259 openssl.cpp:435] Will only verify peer certificate if presented!
NOTE: Set LIBPROCESS_SSL_REQUIRE_CERT=1 to require peer certificate verification
I0323 23:12:20.025821 26259 process.cpp:1247] libprocess is initialized on 172.17.0.3:59751
with 16 worker threads
I0323 23:12:20.032168 27022 process.cpp:3705] Handling HTTP event for process '(77)' with
path: '/(77)/body'
I0323 23:12:20.037976 27027 process.cpp:3705] Handling HTTP event for process '(77)' with
path: '/(77)/pipe'
I0323 23:12:20.044236 27029 process.cpp:3705] Handling HTTP event for process '(77)' with
path: '/(77)/body'
I0323 23:12:20.044780 27028 process.cpp:3762] Failed to process request for '/(77)/body':
failure
I0323 23:12:20.044821 27020 process.cpp:1457] Returning '500 Internal Server Error' for '/(77)/body'
(failure)
[       OK ] Scheme/HTTPTest.Endpoints/0 (389 ms)
[ RUN      ] Scheme/HTTPTest.Endpoints/1
I0323 23:12:20.066614 26259 process.cpp:1247] libprocess is initialized on 172.17.0.3:34278
with 16 worker threads
I0323 23:12:20.068569 27045 process.cpp:3705] Handling HTTP event for process '(78)' with
path: '/(78)/body'
I0323 23:12:20.073165 27037 process.cpp:3705] Handling HTTP event for process '(78)' with
path: '/(78)/pipe'
I0323 23:12:20.075693 27046 process.cpp:3705] Handling HTTP event for process '(78)' with
path: '/(78)/body'
I0323 23:12:20.076176 27039 process.cpp:3762] Failed to process request for '/(78)/body':
failure
I0323 23:12:20.076356 27033 process.cpp:1457] Returning '500 Internal Server Error' for '/(78)/body'
(failure)
I0323 23:12:20.077460 27049 process.cpp:828] Decode failure: Connection reset by peer
E0323 23:12:20.077504 27049 process.cpp:2427] Failed to shutdown socket with fd 9: Transport
endpoint is not connected
[       OK ] Scheme/HTTPTest.Endpoints/1 (27 ms)
[ RUN      ] Scheme/HTTPTest.EndpointsHelp/0
I0323 23:12:20.612226 26259 openssl.cpp:419] CA file path is unspecified! NOTE: Set CA file
path with LIBPROCESS_SSL_CA_FILE=<filepath>
I0323 23:12:20.612258 26259 openssl.cpp:424] CA directory path unspecified! NOTE: Set CA directory
path with LIBPROCESS_SSL_CA_DIR=<dirpath>
I0323 23:12:20.612263 26259 openssl.cpp:429] Will not verify peer certificate!
NOTE: Set LIBPROCESS_SSL_VERIFY_CERT=1 to enable peer certificate verification
I0323 23:12:20.612267 26259 openssl.cpp:435] Will only verify peer certificate if presented!
NOTE: Set LIBPROCESS_SSL_REQUIRE_CERT=1 to require peer certificate verification
I0323 23:12:20.625689 26259 process.cpp:1247] libprocess is initialized on 172.17.0.3:48036
with 16 worker threads
I0323 23:12:20.631778 27054 process.cpp:3705] Handling HTTP event for process 'help' with
path: '/help'
I0323 23:12:20.638134 27062 process.cpp:3705] Handling HTTP event for process 'help' with
path: '/help'
I0323 23:12:20.644903 27056 process.cpp:3705] Handling HTTP event for process 'help' with
path: '/help/(79)/body'
I0323 23:12:20.650787 27051 process.cpp:3705] Handling HTTP event for process 'help' with
path: '/help/(79)/a/b/c'
[       OK ] Scheme/HTTPTest.EndpointsHelp/0 (572 ms)
[ RUN      ] Scheme/HTTPTest.EndpointsHelp/1
I0323 23:12:20.655136 26259 process.cpp:1247] libprocess is initialized on 172.17.0.3:59546
with 16 worker threads
I0323 23:12:20.656435 27078 process.cpp:3705] Handling HTTP event for process 'help' with
path: '/help'
I0323 23:12:20.658257 27072 process.cpp:3705] Handling HTTP event for process 'help' with
path: '/help'
I0323 23:12:20.660866 27076 process.cpp:3705] Handling HTTP event for process 'help' with
path: '/help/(80)/body'
I0323 23:12:20.662727 27075 process.cpp:3705] Handling HTTP event for process 'help' with
path: '/help/(80)/a/b/c'
[       OK ] Scheme/HTTPTest.EndpointsHelp/1 (12 ms)
[ RUN      ] Scheme/HTTPTest.EndpointsHelpRemoval/0
I0323 23:12:21.086334 26259 openssl.cpp:419] CA file path is unspecified! NOTE: Set CA file
path with LIBPROCESS_SSL_CA_FILE=<filepath>
I0323 23:12:21.086361 26259 openssl.cpp:424] CA directory path unspecified! NOTE: Set CA directory
path with LIBPROCESS_SSL_CA_DIR=<dirpath>
I0323 23:12:21.086366 26259 openssl.cpp:429] Will not verify peer certificate!
NOTE: Set LIBPROCESS_SSL_VERIFY_CERT=1 to enable peer certificate verification
I0323 23:12:21.086370 26259 openssl.cpp:435] Will only verify peer certificate if presented!
NOTE: Set LIBPROCESS_SSL_REQUIRE_CERT=1 to require peer certificate verification
I0323 23:12:21.089787 26259 process.cpp:1247] libprocess is initialized on 172.17.0.3:38350
with 16 worker threads
I0323 23:12:21.097563 27093 process.cpp:3705] Handling HTTP event for process 'help' with
path: '/help/(81)/body'
I0323 23:12:21.103719 27086 process.cpp:3705] Handling HTTP event for process 'help' with
path: '/help/(81)/bogus'
[       OK ] Scheme/HTTPTest.EndpointsHelpRemoval/0 (441 ms)
[ RUN      ] Scheme/HTTPTest.EndpointsHelpRemoval/1
I0323 23:12:21.122617 26259 process.cpp:1247] libprocess is initialized on 172.17.0.3:47363
with 16 worker threads
I0323 23:12:21.125017 27106 process.cpp:3705] Handling HTTP event for process 'help' with
path: '/help/(82)/body'
I0323 23:12:21.129109 27107 process.cpp:3705] Handling HTTP event for process 'help' with
path: '/help/(82)/bogus'
[       OK ] Scheme/HTTPTest.EndpointsHelpRemoval/1 (30 ms)
[ RUN      ] Scheme/HTTPTest.PipeEOF/0
I0323 23:12:21.257532 26259 openssl.cpp:419] CA file path is unspecified! NOTE: Set CA file
path with LIBPROCESS_SSL_CA_FILE=<filepath>
I0323 23:12:21.257555 26259 openssl.cpp:424] CA directory path unspecified! NOTE: Set CA directory
path with LIBPROCESS_SSL_CA_DIR=<dirpath>
I0323 23:12:21.257560 26259 openssl.cpp:429] Will not verify peer certificate!
NOTE: Set LIBPROCESS_SSL_VERIFY_CERT=1 to enable peer certificate verification
I0323 23:12:21.257565 26259 openssl.cpp:435] Will only verify peer certificate if presented!
NOTE: Set LIBPROCESS_SSL_REQUIRE_CERT=1 to require peer certificate verification
I0323 23:12:21.260515 26259 process.cpp:1247] libprocess is initialized on 172.17.0.3:42707
with 16 worker threads
[       OK ] Scheme/HTTPTest.PipeEOF/0 (126 ms)
[ RUN      ] Scheme/HTTPTest.PipeEOF/1
I0323 23:12:21.270567 26259 process.cpp:1247] libprocess is initialized on 172.17.0.3:47889
with 16 worker threads
[       OK ] Scheme/HTTPTest.PipeEOF/1 (10 ms)
[ RUN      ] Scheme/HTTPTest.PipeFailure/0
I0323 23:12:22.031432 26259 openssl.cpp:419] CA file path is unspecified! NOTE: Set CA file
path with LIBPROCESS_SSL_CA_FILE=<filepath>
I0323 23:12:22.031456 26259 openssl.cpp:424] CA directory path unspecified! NOTE: Set CA directory
path with LIBPROCESS_SSL_CA_DIR=<dirpath>
I0323 23:12:22.031464 26259 openssl.cpp:429] Will not verify peer certificate!
NOTE: Set LIBPROCESS_SSL_VERIFY_CERT=1 to enable peer certificate verification
I0323 23:12:22.031469 26259 openssl.cpp:435] Will only verify peer certificate if presented!
NOTE: Set LIBPROCESS_SSL_REQUIRE_CERT=1 to require peer certificate verification
I0323 23:12:22.037350 26259 process.cpp:1247] libprocess is initialized on 172.17.0.3:45016
with 16 worker threads
[       OK ] Scheme/HTTPTest.PipeFailure/0 (766 ms)
[ RUN      ] Scheme/HTTPTest.PipeFailure/1
I0323 23:12:22.040957 26259 process.cpp:1247] libprocess is initialized on 172.17.0.3:33942
with 16 worker threads
[       OK ] Scheme/HTTPTest.PipeFailure/1 (4 ms)
[ RUN      ] Scheme/HTTPTest.PipeReaderCloses/0
I0323 23:12:22.635653 26259 openssl.cpp:419] CA file path is unspecified! NOTE: Set CA file
path with LIBPROCESS_SSL_CA_FILE=<filepath>
I0323 23:12:22.635676 26259 openssl.cpp:424] CA directory path unspecified! NOTE: Set CA directory
path with LIBPROCESS_SSL_CA_DIR=<dirpath>
I0323 23:12:22.635681 26259 openssl.cpp:429] Will not verify peer certificate!
NOTE: Set LIBPROCESS_SSL_VERIFY_CERT=1 to enable peer certificate verification
I0323 23:12:22.635685 26259 openssl.cpp:435] Will only verify peer certificate if presented!
NOTE: Set LIBPROCESS_SSL_REQUIRE_CERT=1 to require peer certificate verification
I0323 23:12:22.637275 26259 process.cpp:1247] libprocess is initialized on 172.17.0.3:45207
with 16 worker threads
[       OK ] Scheme/HTTPTest.PipeReaderCloses/0 (596 ms)
[ RUN      ] Scheme/HTTPTest.PipeReaderCloses/1
I0323 23:12:22.639652 26259 process.cpp:1247] libprocess is initialized on 172.17.0.3:55588
with 16 worker threads
[       OK ] Scheme/HTTPTest.PipeReaderCloses/1 (7 ms)
[ RUN      ] Scheme/HTTPTest.Encode/0
I0323 23:12:22.871737 26259 openssl.cpp:419] CA file path is unspecified! NOTE: Set CA file
path with LIBPROCESS_SSL_CA_FILE=<filepath>
I0323 23:12:22.871759 26259 openssl.cpp:424] CA directory path unspecified! NOTE: Set CA directory
path with LIBPROCESS_SSL_CA_DIR=<dirpath>
I0323 23:12:22.871763 26259 openssl.cpp:429] Will not verify peer certificate!
NOTE: Set LIBPROCESS_SSL_VERIFY_CERT=1 to enable peer certificate verification
I0323 23:12:22.871767 26259 openssl.cpp:435] Will only verify peer certificate if presented!
NOTE: Set LIBPROCESS_SSL_REQUIRE_CERT=1 to require peer certificate verification
I0323 23:12:22.874987 26259 process.cpp:1247] libprocess is initialized on 172.17.0.3:57056
with 16 worker threads
[       OK ] Scheme/HTTPTest.Encode/0 (230 ms)
[ RUN      ] Scheme/HTTPTest.Encode/1
I0323 23:12:22.893435 26259 process.cpp:1247] libprocess is initialized on 172.17.0.3:60574
with 16 worker threads
[       OK ] Scheme/HTTPTest.Encode/1 (18 ms)
[ RUN      ] Scheme/HTTPTest.PathParse/0
I0323 23:12:23.242163 26259 openssl.cpp:419] CA file path is unspecified! NOTE: Set CA file
path with LIBPROCESS_SSL_CA_FILE=<filepath>
I0323 23:12:23.242185 26259 openssl.cpp:424] CA directory path unspecified! NOTE: Set CA directory
path with LIBPROCESS_SSL_CA_DIR=<dirpath>
I0323 23:12:23.242189 26259 openssl.cpp:429] Will not verify peer certificate!
NOTE: Set LIBPROCESS_SSL_VERIFY_CERT=1 to enable peer certificate verification
I0323 23:12:23.242193 26259 openssl.cpp:435] Will only verify peer certificate if presented!
NOTE: Set LIBPROCESS_SSL_REQUIRE_CERT=1 to require peer certificate verification
I0323 23:12:23.244396 26259 process.cpp:1247] libprocess is initialized on 172.17.0.3:33293
with 16 worker threads
[       OK ] Scheme/HTTPTest.PathParse/0 (351 ms)
[ RUN      ] Scheme/HTTPTest.PathParse/1
I0323 23:12:23.246690 26259 process.cpp:1247] libprocess is initialized on 172.17.0.3:54088
with 16 worker threads
[       OK ] Scheme/HTTPTest.PathParse/1 (2 ms)
[ RUN      ] Scheme/HTTPTest.Get/0
I0323 23:12:23.404428 26259 openssl.cpp:419] CA file path is unspecified! NOTE: Set CA file
path with LIBPROCESS_SSL_CA_FILE=<filepath>
I0323 23:12:23.404453 26259 openssl.cpp:424] CA directory path unspecified! NOTE: Set CA directory
path with LIBPROCESS_SSL_CA_DIR=<dirpath>
I0323 23:12:23.404458 26259 openssl.cpp:429] Will not verify peer certificate!
NOTE: Set LIBPROCESS_SSL_VERIFY_CERT=1 to enable peer certificate verification
I0323 23:12:23.404460 26259 openssl.cpp:435] Will only verify peer certificate if presented!
NOTE: Set LIBPROCESS_SSL_REQUIRE_CERT=1 to require peer certificate verification
I0323 23:12:23.406772 26259 process.cpp:1247] libprocess is initialized on 172.17.0.3:45050
with 16 worker threads
I0323 23:12:23.412082 27289 process.cpp:3705] Handling HTTP event for process '(83)' with
path: '/(83)/get'
I0323 23:12:23.417531 27292 process.cpp:3705] Handling HTTP event for process '(83)' with
path: '/(83)/get'
[       OK ] Scheme/HTTPTest.Get/0 (173 ms)
[ RUN      ] Scheme/HTTPTest.Get/1
I0323 23:12:23.433126 26259 process.cpp:1247] libprocess is initialized on 172.17.0.3:38462
with 16 worker threads
I0323 23:12:23.434197 27305 process.cpp:3705] Handling HTTP event for process '(84)' with
path: '/(84)/get'
I0323 23:12:23.436039 27310 process.cpp:3705] Handling HTTP event for process '(84)' with
path: '/(84)/get'
[       OK ] Scheme/HTTPTest.Get/1 (18 ms)
[ RUN      ] Scheme/HTTPTest.NestedGet/0
I0323 23:12:24.160073 26259 openssl.cpp:419] CA file path is unspecified! NOTE: Set CA file
path with LIBPROCESS_SSL_CA_FILE=<filepath>
I0323 23:12:24.160094 26259 openssl.cpp:424] CA directory path unspecified! NOTE: Set CA directory
path with LIBPROCESS_SSL_CA_DIR=<dirpath>
I0323 23:12:24.160099 26259 openssl.cpp:429] Will not verify peer certificate!
NOTE: Set LIBPROCESS_SSL_VERIFY_CERT=1 to enable peer certificate verification
I0323 23:12:24.160101 26259 openssl.cpp:435] Will only verify peer certificate if presented!
NOTE: Set LIBPROCESS_SSL_REQUIRE_CERT=1 to require peer certificate verification
I0323 23:12:24.165478 26259 process.cpp:1247] libprocess is initialized on 172.17.0.3:43830
with 16 worker threads
I0323 23:12:24.170613 27329 process.cpp:3705] Handling HTTP event for process '(85)' with
path: '/(85)//a/b/c'
I0323 23:12:24.175669 27337 process.cpp:3705] Handling HTTP event for process '(85)' with
path: '/(85)//a/b'
[       OK ] Scheme/HTTPTest.NestedGet/0 (740 ms)
[ RUN      ] Scheme/HTTPTest.NestedGet/1
I0323 23:12:24.178963 26259 process.cpp:1247] libprocess is initialized on 172.17.0.3:37393
with 16 worker threads
I0323 23:12:24.179718 27350 process.cpp:3705] Handling HTTP event for process '(86)' with
path: '/(86)//a/b/c'
I0323 23:12:24.181308 27350 process.cpp:3705] Handling HTTP event for process '(86)' with
path: '/(86)//a/b'
[       OK ] Scheme/HTTPTest.NestedGet/1 (5 ms)
[ RUN      ] Scheme/HTTPTest.StreamingGetComplete/0
I0323 23:12:24.433328 26259 openssl.cpp:419] CA file path is unspecified! NOTE: Set CA file
path with LIBPROCESS_SSL_CA_FILE=<filepath>
I0323 23:12:24.433353 26259 openssl.cpp:424] CA directory path unspecified! NOTE: Set CA directory
path with LIBPROCESS_SSL_CA_DIR=<dirpath>
I0323 23:12:24.433357 26259 openssl.cpp:429] Will not verify peer certificate!
NOTE: Set LIBPROCESS_SSL_VERIFY_CERT=1 to enable peer certificate verification
I0323 23:12:24.433364 26259 openssl.cpp:435] Will only verify peer certificate if presented!
NOTE: Set LIBPROCESS_SSL_REQUIRE_CERT=1 to require peer certificate verification
*** Aborted at 1490310744 (unix time) try "date -d @1490310744" if you are using GNU date
***
PC: @     0x2b282116c64e (unknown)
I0323 23:12:24.435519 26259 process.cpp:1247] libprocess is initialized on 172.17.0.3:49557
with 16 worker threads
*** SIGSEGV (@0x2535c78) received by PID 26259 (TID 0x2b2828819700) from PID 39017592; stack
trace: ***
    @     0x2b281eabe330 (unknown)
    @     0x2b282116c64e (unknown)
    @     0x2b282096ce30 (unknown)
    @     0x2b282096d48c (unknown)
    @           0x4438cf process::UPID::UPID()
I0323 23:12:24.440922 27365 process.cpp:3705] Handling HTTP event for process '(87)' with
path: '/(87)/pipe'
    @           0xa034ae process::DispatchEvent::DispatchEvent()
    @           0x9ece33 process::internal::dispatch()
    @           0xa02f6d process::dispatch<>()
    @           0x9ebe57 process::ProcessBase::route()
    @           0xb122cd process::ProcessBase::route<>()
    @           0xb0fba0 process::Help::initialize()
    @           0xb0fc52 process::Help::initialize()
    @           0x9e6940 process::ProcessManager::resume()
    @           0x9f529c process::ProcessManager::init_threads()::$_2::operator()()
    @           0x9f51a5 _ZNSt12_Bind_simpleIFZN7process14ProcessManager12init_threadsEvE3$_2vEE9_M_invokeIJEEEvSt12_Index_tupleIJXspT_EEE
    @           0x9f5175 std::_Bind_simple<>::operator()()
    @           0x9f514c std::thread::_Impl<>::_M_run()
    @     0x2b2820963a60 (unknown)
    @     0x2b281eab6184 start_thread
    @     0x2b28211cfbed (unknown)
make[7]: *** [check-local] Segmentation fault
make[7]: Leaving directory `/mesos/mesos-1.3.0/_build/3rdparty/libprocess'
make[6]: *** [check-am] Error 2
make[6]: Leaving directory `/mesos/mesos-1.3.0/_build/3rdparty/libprocess'
make[5]: *** [check-recursive] Error 1
make[5]: Leaving directory `/mesos/mesos-1.3.0/_build/3rdparty/libprocess'
make[4]: *** [check] Error 2
make[4]: Leaving directory `/mesos/mesos-1.3.0/_build/3rdparty/libprocess'
make[3]: *** [check-recursive] Error 1
make[3]: Leaving directory `/mesos/mesos-1.3.0/_build/3rdparty'
make[2]: *** [check] Error 2
make[2]: Leaving directory `/mesos/mesos-1.3.0/_build/3rdparty'
make[1]: *** [check-recursive] Error 1
make[1]: Leaving directory `/mesos/mesos-1.3.0/_build'
make: *** [distcheck] Error 1
+ docker rmi mesos-1490309272-17596
Untagged: mesos-1490309272-17596:latest
Deleted: sha256:2b9d41fc3ad4e7bfc47427164ae808b4e8855cfd44f5e872a668038cc7d4b062
Deleted: sha256:53a0dec34a4908204433154e48bf467e6503921230faabf7f13dbbdaf4559fed
Deleted: sha256:d6f92d3159880428eb20427226eac296e61efd54e18e8b3e1735c0cd16c1325a
Deleted: sha256:5dc0a40f8063f50e92eba9be0f2dd4b1ea83a7545c579ac232a18e632e6363dd
Deleted: sha256:e7a9b0ae8f7f557c5f67149ad27b8f0c6184643f5499e8f2f727beafcd3c832b
Deleted: sha256:370557c96bc1a33c945808b433efd561d98bf0bb557fb23e27a4cbec8a9ddee7
Deleted: sha256:6ca42a46298639d8aaac33a3c29402958e41cf410b60e491e799cf6b9c0231a1
Deleted: sha256:23eb90629e8958ac88952760624f2added431c04bd574187f82fcf8fb7e35e97
Deleted: sha256:dc11b0bcce92d0e2352bfcbe388de4d4a500ad8c87d6a9e4fe6e61aa4ee84681
Deleted: sha256:f3489852d08670fb32e06992ea00cb62119831cbe6de8683ab29f70c4d752c09
Deleted: sha256:168c2920cb6dcc2260c98d4a09066c397b39df93715e340682e77a1045118d88
Deleted: sha256:3f668d36233b141c9c09f5dde48bc823d8b134f65c8429789097851e60f10972
Deleted: sha256:96460198c9524b7aa588cec06436830842a45a7a1d8848d0986fef7d126a4051
Deleted: sha256:d58c5fb571405330221ee2374550873d8fa9c4c3a0e09684874e4e3c26602d72
Deleted: sha256:506fc455d7daf6f4b9082ca9a2864f27e76bc86a44e4efd5391068b81f498abb
Deleted: sha256:3487bcb14dfd3e4e46480d9cc023dd43d6ca7b72bf145c739ec49853f9fd383e
Deleted: sha256:e51b471cc9657d62babd7c6b969e477f65beb118511130912583f5b6e0cbaaa4
Deleted: sha256:700346db7486662b2c4d55751ff48e861a72801a6375e8b4514c780f07e91ac6
Deleted: sha256:b47791023e60b0b377a6ea7663e9a03d6dcceba5cfb2bc5df8ee5fe6a4f1166d
Deleted: sha256:908311877baea90db2bab540b70aa9337bc8f8f63d36ed3fbd351d1b71cb6635
Deleted: sha256:cdf994a3fe0af4283ce7cc7cde7cea5d05565e0341253d02b9c0000b5db1e7d0
Deleted: sha256:6f5af499cd4336e9337b43155e0aede24fd16c9acfc8e5483ed7691252a159f3
Deleted: sha256:c308664d1742165c4c57cdf61c3ac2b2dd6bfea83875cfa3314c5d71a97c8a83
Deleted: sha256:e2c9dd4790904d25fc979b5dd88d19fc55e1c1b4d1cff5a028cff9438e714a1a
Build step 'Execute shell' marked build as failure

Mime
View raw message