mesos-builds mailing list archives

Site index · List index
Message view « Date » · « Thread »
Top « Date » · « Thread »
From Apache Jenkins Server <jenk...@builds.apache.org>
Subject Build failed in Jenkins: Mesos-Reviewbot #17449
Date Thu, 16 Mar 2017 02:45:01 GMT
See <https://builds.apache.org/job/Mesos-Reviewbot/17449/display/redirect>

------------------------------------------
[...truncated 1010.75 KB...]
Downloading: http://repo.maven.apache.org/maven2/backport-util-concurrent/backport-util-concurrent/3.1/backport-util-concurrent-3.1.jar
Downloading: http://repo.maven.apache.org/maven2/org/eclipse/aether/aether-util/0.9.0.M2/aether-util-0.9.0.M2.jar
Downloaded: http://repo.maven.apache.org/maven2/org/codehaus/plexus/plexus-utils/3.0.15/plexus-utils-3.0.15.jar (234 KB at 10145.7 KB/sec)
Downloading: http://repo.maven.apache.org/maven2/org/vafer/jdependency/0.7/jdependency-0.7.jar
Downloaded: http://repo.maven.apache.org/maven2/org/jdom/jdom/1.1/jdom-1.1.jar (150 KB at 6796.7 KB/sec)
Downloading: http://repo.maven.apache.org/maven2/commons-io/commons-io/1.3.2/commons-io-1.3.2.jar
Downloaded: http://repo.maven.apache.org/maven2/org/apache/maven/shared/maven-dependency-tree/2.1/maven-dependency-tree-2.1.jar (59 KB at 3659.2 KB/sec)
Downloading: http://repo.maven.apache.org/maven2/asm/asm-analysis/3.2/asm-analysis-3.2.jar
Downloaded: http://repo.maven.apache.org/maven2/org/eclipse/aether/aether-util/0.9.0.M2/aether-util-0.9.0.M2.jar (131 KB at 6866.2 KB/sec)
Downloading: http://repo.maven.apache.org/maven2/asm/asm-util/3.2/asm-util-3.2.jar
Downloaded: http://repo.maven.apache.org/maven2/org/vafer/jdependency/0.7/jdependency-0.7.jar (12 KB at 768.6 KB/sec)
Downloading: http://repo.maven.apache.org/maven2/com/google/guava/guava/11.0.2/guava-11.0.2.jar
Downloaded: http://repo.maven.apache.org/maven2/backport-util-concurrent/backport-util-concurrent/3.1/backport-util-concurrent-3.1.jar (324 KB at 12957.7 KB/sec)
Downloading: http://repo.maven.apache.org/maven2/com/google/code/findbugs/jsr305/1.3.9/jsr305-1.3.9.jar
Downloaded: http://repo.maven.apache.org/maven2/commons-io/commons-io/1.3.2/commons-io-1.3.2.jar (86 KB at 4762.2 KB/sec)
Downloaded: http://repo.maven.apache.org/maven2/asm/asm-analysis/3.2/asm-analysis-3.2.jar (18 KB at 1254.5 KB/sec)
Downloaded: http://repo.maven.apache.org/maven2/asm/asm-util/3.2/asm-util-3.2.jar (36 KB at 2379.6 KB/sec)
Downloaded: http://repo.maven.apache.org/maven2/com/google/code/findbugs/jsr305/1.3.9/jsr305-1.3.9.jar (33 KB at 2149.4 KB/sec)
Downloaded: http://repo.maven.apache.org/maven2/com/google/guava/guava/11.0.2/guava-11.0.2.jar (1610 KB at 31560.2 KB/sec)
[INFO] Including com.google.protobuf:protobuf-java:jar:2.6.1 in the shaded jar.
[INFO] Attaching shaded artifact.
[INFO] 
[INFO] --- maven-dependency-plugin:2.8:copy-dependencies (copy-dependencies) @ mesos ---
Downloading: http://repo.maven.apache.org/maven2/org/apache/maven/reporting/maven-reporting-impl/2.0.5/maven-reporting-impl-2.0.5.pom
Downloaded: http://repo.maven.apache.org/maven2/org/apache/maven/reporting/maven-reporting-impl/2.0.5/maven-reporting-impl-2.0.5.pom (5 KB at 257.8 KB/sec)
Downloading: http://repo.maven.apache.org/maven2/org/apache/maven/shared/maven-doxia-tools/1.0.2/maven-doxia-tools-1.0.2.pom
Downloaded: http://repo.maven.apache.org/maven2/org/apache/maven/shared/maven-doxia-tools/1.0.2/maven-doxia-tools-1.0.2.pom (6 KB at 381.8 KB/sec)
Downloading: http://repo.maven.apache.org/maven2/org/apache/maven/shared/maven-shared-components/11/maven-shared-components-11.pom
Downloaded: http://repo.maven.apache.org/maven2/org/apache/maven/shared/maven-shared-components/11/maven-shared-components-11.pom (9 KB at 509.1 KB/sec)
Downloading: http://repo.maven.apache.org/maven2/commons-validator/commons-validator/1.2.0/commons-validator-1.2.0.pom
Downloaded: http://repo.maven.apache.org/maven2/commons-validator/commons-validator/1.2.0/commons-validator-1.2.0.pom (9 KB at 591.4 KB/sec)
Downloading: http://repo.maven.apache.org/maven2/xml-apis/xml-apis/2.0.2/xml-apis-2.0.2.pom
Downloaded: http://repo.maven.apache.org/maven2/xml-apis/xml-apis/2.0.2/xml-apis-2.0.2.pom (346 B at 22.5 KB/sec)
Downloading: http://repo.maven.apache.org/maven2/org/codehaus/plexus/plexus-archiver/2.3/plexus-archiver-2.3.pom
Downloaded: http://repo.maven.apache.org/maven2/org/codehaus/plexus/plexus-archiver/2.3/plexus-archiver-2.3.pom (4 KB at 219.3 KB/sec)
Downloading: http://repo.maven.apache.org/maven2/org/codehaus/plexus/plexus-components/1.3/plexus-components-1.3.pom
Downloaded: http://repo.maven.apache.org/maven2/org/codehaus/plexus/plexus-components/1.3/plexus-components-1.3.pom (3 KB at 213.3 KB/sec)
Downloading: http://repo.maven.apache.org/maven2/org/codehaus/plexus/plexus/3.3/plexus-3.3.pom
Downloaded: http://repo.maven.apache.org/maven2/org/codehaus/plexus/plexus/3.3/plexus-3.3.pom (20 KB at 1295.6 KB/sec)
Downloading: http://repo.maven.apache.org/maven2/org/codehaus/plexus/plexus-utils/3.0.10/plexus-utils-3.0.10.pom
Downloaded: http://repo.maven.apache.org/maven2/org/codehaus/plexus/plexus-utils/3.0.10/plexus-utils-3.0.10.pom (4 KB at 204.7 KB/sec)
Downloading: http://repo.maven.apache.org/maven2/org/codehaus/plexus/plexus-io/2.0.6/plexus-io-2.0.6.pom
Downloaded: http://repo.maven.apache.org/maven2/org/codehaus/plexus/plexus-io/2.0.6/plexus-io-2.0.6.pom (3 KB at 143.9 KB/sec)
Downloading: http://repo.maven.apache.org/maven2/org/codehaus/plexus/plexus-components/1.2/plexus-components-1.2.pom
Downloaded: http://repo.maven.apache.org/maven2/org/codehaus/plexus/plexus-components/1.2/plexus-components-1.2.pom (3 KB at 199.1 KB/sec)
Downloading: http://repo.maven.apache.org/maven2/org/codehaus/plexus/plexus/3.2/plexus-3.2.pom
Downloaded: http://repo.maven.apache.org/maven2/org/codehaus/plexus/plexus/3.2/plexus-3.2.pom (19 KB at 1220.4 KB/sec)
Downloading: http://repo.maven.apache.org/maven2/org/codehaus/plexus/plexus-utils/3.0.8/plexus-utils-3.0.8.pom
Downloaded: http://repo.maven.apache.org/maven2/org/codehaus/plexus/plexus-utils/3.0.8/plexus-utils-3.0.8.pom (4 KB at 204.6 KB/sec)
Downloading: http://repo.maven.apache.org/maven2/org/codehaus/plexus/plexus-utils/3.0.9/plexus-utils-3.0.9.pom
Downloaded: http://repo.maven.apache.org/maven2/org/codehaus/plexus/plexus-utils/3.0.9/plexus-utils-3.0.9.pom (4 KB at 204.6 KB/sec)
Downloading: http://repo.maven.apache.org/maven2/org/apache/maven/shared/file-management/1.2.1/file-management-1.2.1.pom
Downloaded: http://repo.maven.apache.org/maven2/org/apache/maven/shared/file-management/1.2.1/file-management-1.2.1.pom (4 KB at 252.7 KB/sec)
Downloading: http://repo.maven.apache.org/maven2/org/apache/maven/shared/maven-shared-components/10/maven-shared-components-10.pom
Downloaded: http://repo.maven.apache.org/maven2/org/apache/maven/shared/maven-shared-components/10/maven-shared-components-10.pom (9 KB at 549.0 KB/sec)
Downloading: http://repo.maven.apache.org/maven2/org/apache/maven/maven-parent/9/maven-parent-9.pom
Downloaded: http://repo.maven.apache.org/maven2/org/apache/maven/maven-parent/9/maven-parent-9.pom (33 KB at 2137.8 KB/sec)
Downloading: http://repo.maven.apache.org/maven2/org/apache/maven/shared/maven-shared-io/1.1/maven-shared-io-1.1.pom
Downloaded: http://repo.maven.apache.org/maven2/org/apache/maven/shared/maven-shared-io/1.1/maven-shared-io-1.1.pom (4 KB at 247.8 KB/sec)
Downloading: http://repo.maven.apache.org/maven2/org/apache/maven/maven-artifact/2.0.2/maven-artifact-2.0.2.pom
Downloaded: http://repo.maven.apache.org/maven2/org/apache/maven/maven-artifact/2.0.2/maven-artifact-2.0.2.pom (765 B at 53.4 KB/sec)
Downloading: http://repo.maven.apache.org/maven2/org/apache/maven/maven/2.0.2/maven-2.0.2.pom
Downloaded: http://repo.maven.apache.org/maven2/org/apache/maven/maven/2.0.2/maven-2.0.2.pom (13 KB at 857.6 KB/sec)
Downloading: http://repo.maven.apache.org/maven2/org/codehaus/plexus/plexus-utils/1.1/plexus-utils-1.1.pom
Downloaded: http://repo.maven.apache.org/maven2/org/codehaus/plexus/plexus-utils/1.1/plexus-utils-1.1.pom (767 B at 49.9 KB/sec)
Downloading: http://repo.maven.apache.org/maven2/org/apache/maven/maven-artifact-manager/2.0.2/maven-artifact-manager-2.0.2.pom
Downloaded: http://repo.maven.apache.org/maven2/org/apache/maven/maven-artifact-manager/2.0.2/maven-artifact-manager-2.0.2.pom (2 KB at 90.8 KB/sec)
Downloading: http://repo.maven.apache.org/maven2/org/apache/maven/maven-repository-metadata/2.0.2/maven-repository-metadata-2.0.2.pom
Downloaded: http://repo.maven.apache.org/maven2/org/apache/maven/maven-repository-metadata/2.0.2/maven-repository-metadata-2.0.2.pom (2 KB at 79.8 KB/sec)
Downloading: http://repo.maven.apache.org/maven2/org/apache/maven/wagon/wagon-provider-api/1.0-alpha-6/wagon-provider-api-1.0-alpha-6.pom
Downloaded: http://repo.maven.apache.org/maven2/org/apache/maven/wagon/wagon-provider-api/1.0-alpha-6/wagon-provider-api-1.0-alpha-6.pom (588 B at 38.3 KB/sec)
Downloading: http://repo.maven.apache.org/maven2/org/apache/maven/wagon/wagon/1.0-alpha-6/wagon-1.0-alpha-6.pom
Downloaded: http://repo.maven.apache.org/maven2/org/apache/maven/wagon/wagon/1.0-alpha-6/wagon-1.0-alpha-6.pom (7 KB at 390.9 KB/sec)
Downloading: http://repo.maven.apache.org/maven2/org/apache/maven/shared/maven-dependency-analyzer/1.4/maven-dependency-analyzer-1.4.pom
Downloaded: http://repo.maven.apache.org/maven2/org/apache/maven/shared/maven-dependency-analyzer/1.4/maven-dependency-analyzer-1.4.pom (6 KB at 335.5 KB/sec)
Downloading: http://repo.maven.apache.org/maven2/org/apache/maven/maven-project/2.0.5/maven-project-2.0.5.pom
Downloaded: http://repo.maven.apache.org/maven2/org/apache/maven/maven-project/2.0.5/maven-project-2.0.5.pom (2 KB at 119.9 KB/sec)
Downloading: http://repo.maven.apache.org/maven2/org/apache/maven/maven/2.0.5/maven-2.0.5.pom
Downloaded: http://repo.maven.apache.org/maven2/org/apache/maven/maven/2.0.5/maven-2.0.5.pom (6 KB at 348.1 KB/sec)
Downloading: http://repo.maven.apache.org/maven2/org/apache/maven/maven-settings/2.0.5/maven-settings-2.0.5.pom
Downloaded: http://repo.maven.apache.org/maven2/org/apache/maven/maven-settings/2.0.5/maven-settings-2.0.5.pom (2 KB at 109.1 KB/sec)
Downloading: http://repo.maven.apache.org/maven2/org/apache/maven/maven-model/2.0.5/maven-model-2.0.5.pom
Downloaded: http://repo.maven.apache.org/maven2/org/apache/maven/maven-model/2.0.5/maven-model-2.0.5.pom (3 KB at 189.9 KB/sec)
Downloading: http://repo.maven.apache.org/maven2/org/apache/maven/maven-profile/2.0.5/maven-profile-2.0.5.pom
Downloaded: http://repo.maven.apache.org/maven2/org/apache/maven/maven-profile/2.0.5/maven-profile-2.0.5.pom (2 KB at 107.7 KB/sec)
Downloading: http://repo.maven.apache.org/maven2/org/apache/maven/maven-artifact-manager/2.0.5/maven-artifact-manager-2.0.5.pom
Downloaded: http://repo.maven.apache.org/maven2/org/apache/maven/maven-artifact-manager/2.0.5/maven-artifact-manager-2.0.5.pom (2 KB at 119.4 KB/sec)
Downloading: http://repo.maven.apache.org/maven2/org/apache/maven/maven-repository-metadata/2.0.5/maven-repository-metadata-2.0.5.pom
Downloaded: http://repo.maven.apache.org/maven2/org/apache/maven/maven-repository-metadata/2.0.5/maven-repository-metadata-2.0.5.pom (2 KB at 90.7 KB/sec)
Downloading: http://repo.maven.apache.org/maven2/org/apache/maven/maven-artifact/2.0.5/maven-artifact-2.0.5.pom
Downloaded: http://repo.maven.apache.org/maven2/org/apache/maven/maven-artifact/2.0.5/maven-artifact-2.0.5.pom (727 B at 47.3 KB/sec)
Downloading: http://repo.maven.apache.org/maven2/org/apache/maven/shared/maven-common-artifact-filters/1.4/maven-common-artifact-filters-1.4.pom
Downloaded: http://repo.maven.apache.org/maven2/org/apache/maven/shared/maven-common-artifact-filters/1.4/maven-common-artifact-filters-1.4.pom (4 KB at 244.8 KB/sec)
Downloading: http://repo.maven.apache.org/maven2/org/codehaus/plexus/plexus-container-default/1.5.5/plexus-container-default-1.5.5.pom
Downloaded: http://repo.maven.apache.org/maven2/org/codehaus/plexus/plexus-container-default/1.5.5/plexus-container-default-1.5.5.pom (3 KB at 179.4 KB/sec)
Downloading: http://repo.maven.apache.org/maven2/org/codehaus/plexus/plexus-classworlds/2.2.2/plexus-classworlds-2.2.2.pom
Downloaded: http://repo.maven.apache.org/maven2/org/codehaus/plexus/plexus-classworlds/2.2.2/plexus-classworlds-2.2.2.pom (4 KB at 262.6 KB/sec)
Downloading: http://repo.maven.apache.org/maven2/org/apache/xbean/xbean-reflect/3.4/xbean-reflect-3.4.pom
Downloaded: http://repo.maven.apache.org/maven2/org/apache/xbean/xbean-reflect/3.4/xbean-reflect-3.4.pom (3 KB at 171.4 KB/sec)
Downloading: http://repo.maven.apache.org/maven2/org/apache/xbean/xbean/3.4/xbean-3.4.pom
Downloaded: http://repo.maven.apache.org/maven2/org/apache/xbean/xbean/3.4/xbean-3.4.pom (19 KB at 1131.1 KB/sec)
Downloading: http://repo.maven.apache.org/maven2/commons-logging/commons-logging-api/1.1/commons-logging-api-1.1.pom
Downloaded: http://repo.maven.apache.org/maven2/commons-logging/commons-logging-api/1.1/commons-logging-api-1.1.pom (6 KB at 348.1 KB/sec)
Downloading: http://repo.maven.apache.org/maven2/com/google/collections/google-collections/1.0/google-collections-1.0.pom
Downloaded: http://repo.maven.apache.org/maven2/com/google/collections/google-collections/1.0/google-collections-1.0.pom (3 KB at 161.3 KB/sec)
Downloading: http://repo.maven.apache.org/maven2/junit/junit/3.8.2/junit-3.8.2.pom
Downloaded: http://repo.maven.apache.org/maven2/junit/junit/3.8.2/junit-3.8.2.pom (747 B at 48.6 KB/sec)
Downloading: http://repo.maven.apache.org/maven2/org/codehaus/plexus/plexus-utils/2.1/plexus-utils-2.1.pom
Downloaded: http://repo.maven.apache.org/maven2/org/codehaus/plexus/plexus-utils/2.1/plexus-utils-2.1.pom (4 KB at 246.2 KB/sec)
Downloading: http://repo.maven.apache.org/maven2/org/apache/maven/shared/maven-invoker/2.0.11/maven-invoker-2.0.11.pom
Downloaded: http://repo.maven.apache.org/maven2/org/apache/maven/shared/maven-invoker/2.0.11/maven-invoker-2.0.11.pom (5 KB at 330.3 KB/sec)
Downloading: http://repo.maven.apache.org/maven2/commons-lang/commons-lang/2.6/commons-lang-2.6.pom
Downloaded: http://repo.maven.apache.org/maven2/commons-lang/commons-lang/2.6/commons-lang-2.6.pom (18 KB at 1138.9 KB/sec)
Downloading: http://repo.maven.apache.org/maven2/org/apache/commons/commons-parent/17/commons-parent-17.pom
Downloaded: http://repo.maven.apache.org/maven2/org/apache/commons/commons-parent/17/commons-parent-17.pom (31 KB at 1903.4 KB/sec)
Downloading: http://repo.maven.apache.org/maven2/org/apache/maven/reporting/maven-reporting-impl/2.0.5/maven-reporting-impl-2.0.5.jar
Downloading: http://repo.maven.apache.org/maven2/org/apache/maven/shared/maven-doxia-tools/1.0.2/maven-doxia-tools-1.0.2.jar
Downloading: http://repo.maven.apache.org/maven2/commons-validator/commons-validator/1.2.0/commons-validator-1.2.0.jar
Downloading: http://repo.maven.apache.org/maven2/commons-digester/commons-digester/1.6/commons-digester-1.6.jar
Downloading: http://repo.maven.apache.org/maven2/commons-logging/commons-logging/1.0.4/commons-logging-1.0.4.jar
Downloaded: http://repo.maven.apache.org/maven2/org/apache/maven/reporting/maven-reporting-impl/2.0.5/maven-reporting-impl-2.0.5.jar (21 KB at 1184.1 KB/sec)
Downloading: http://repo.maven.apache.org/maven2/xml-apis/xml-apis/1.0.b2/xml-apis-1.0.b2.jar
Downloaded: http://repo.maven.apache.org/maven2/org/apache/maven/shared/maven-doxia-tools/1.0.2/maven-doxia-tools-1.0.2.jar (41 KB at 2111.6 KB/sec)
Downloading: http://repo.maven.apache.org/maven2/org/codehaus/plexus/plexus-archiver/2.3/plexus-archiver-2.3.jar
Downloaded: http://repo.maven.apache.org/maven2/commons-validator/commons-validator/1.2.0/commons-validator-1.2.0.jar (89 KB at 4683.0 KB/sec)
Downloading: http://repo.maven.apache.org/maven2/org/codehaus/plexus/plexus-utils/3.0.9/plexus-utils-3.0.9.jar
Downloaded: http://repo.maven.apache.org/maven2/commons-logging/commons-logging/1.0.4/commons-logging-1.0.4.jar (38 KB at 2183.8 KB/sec)
Downloading: http://repo.maven.apache.org/maven2/org/apache/maven/shared/file-management/1.2.1/file-management-1.2.1.jar
Downloaded: http://repo.maven.apache.org/maven2/commons-digester/commons-digester/1.6/commons-digester-1.6.jar (165 KB at 7477.2 KB/sec)
Downloading: http://repo.maven.apache.org/maven2/org/apache/maven/shared/maven-shared-io/1.1/maven-shared-io-1.1.jar
Downloaded: http://repo.maven.apache.org/maven2/xml-apis/xml-apis/1.0.b2/xml-apis-1.0.b2.jar (107 KB at 5930.9 KB/sec)
Downloading: http://repo.maven.apache.org/maven2/org/codehaus/plexus/plexus-io/2.0.6/plexus-io-2.0.6.jar
Downloaded: http://repo.maven.apache.org/maven2/org/apache/maven/shared/file-management/1.2.1/file-management-1.2.1.jar (37 KB at 2446.4 KB/sec)
Downloading: http://repo.maven.apache.org/maven2/org/apache/maven/shared/maven-dependency-analyzer/1.4/maven-dependency-analyzer-1.4.jar
Downloaded: http://repo.maven.apache.org/maven2/org/codehaus/plexus/plexus-archiver/2.3/plexus-archiver-2.3.jar (183 KB at 8277.2 KB/sec)
Downloading: http://repo.maven.apache.org/maven2/org/apache/maven/shared/maven-common-artifact-filters/1.4/maven-common-artifact-filters-1.4.jar
Downloaded: http://repo.maven.apache.org/maven2/org/codehaus/plexus/plexus-utils/3.0.9/plexus-utils-3.0.9.jar (227 KB at 10785.8 KB/sec)
Downloading: http://repo.maven.apache.org/maven2/org/apache/maven/shared/maven-invoker/2.0.11/maven-invoker-2.0.11.jar
Downloaded: http://repo.maven.apache.org/maven2/org/apache/maven/shared/maven-shared-io/1.1/maven-shared-io-1.1.jar (39 KB at 2409.7 KB/sec)
Downloading: http://repo.maven.apache.org/maven2/commons-lang/commons-lang/2.6/commons-lang-2.6.jar
Downloaded: http://repo.maven.apache.org/maven2/org/codehaus/plexus/plexus-io/2.0.6/plexus-io-2.0.6.jar (57 KB at 3754.5 KB/sec)
Downloaded: http://repo.maven.apache.org/maven2/org/apache/maven/shared/maven-dependency-analyzer/1.4/maven-dependency-analyzer-1.4.jar (27 KB at 1674.3 KB/sec)
Downloaded: http://repo.maven.apache.org/maven2/org/apache/maven/shared/maven-common-artifact-filters/1.4/maven-common-artifact-filters-1.4.jar (31 KB at 2057.2 KB/sec)
Downloaded: http://repo.maven.apache.org/maven2/org/apache/maven/shared/maven-invoker/2.0.11/maven-invoker-2.0.11.jar (29 KB at 2016.5 KB/sec)
Downloaded: http://repo.maven.apache.org/maven2/commons-lang/commons-lang/2.6/commons-lang-2.6.jar (278 KB at 12616.3 KB/sec)
[INFO] Copying protobuf-java-2.6.1.jar to /mesos/mesos-1.3.0/_build/src/java/target/protobuf-java-2.6.1.jar
[INFO] ------------------------------------------------------------------------
[INFO] BUILD SUCCESS
[INFO] ------------------------------------------------------------------------
[INFO] Total time: 6:42.175s
[INFO] Finished at: Thu Mar 16 02:44:29 UTC 2017
[INFO] Final Memory: 53M/2435M
[INFO] ------------------------------------------------------------------------
/usr/lib/jvm/java-7-openjdk-amd64/bin/javah -d java/jni				\
	-classpath java/target/mesos-1.3.0.jar:/mesos/mesos-1.3.0/_build/src/java/target/protobuf-java-2.6.1.jar				\
	  org.apache.mesos.Log
/usr/lib/jvm/java-7-openjdk-amd64/bin/javah -d java/jni				\
	-classpath java/target/mesos-1.3.0.jar:/mesos/mesos-1.3.0/_build/src/java/target/protobuf-java-2.6.1.jar				\
          org.apache.mesos.MesosExecutorDriver
/usr/lib/jvm/java-7-openjdk-amd64/bin/javah -d java/jni				\
	-classpath java/target/mesos-1.3.0.jar:/mesos/mesos-1.3.0/_build/src/java/target/protobuf-java-2.6.1.jar				\
	  org.apache.mesos.MesosSchedulerDriver
/usr/lib/jvm/java-7-openjdk-amd64/bin/javah -d java/jni				\
	-classpath java/target/mesos-1.3.0.jar:/mesos/mesos-1.3.0/_build/src/java/target/protobuf-java-2.6.1.jar				\
	  org.apache.mesos.state.AbstractState
/usr/lib/jvm/java-7-openjdk-amd64/bin/javah -d java/jni				\
	-classpath java/target/mesos-1.3.0.jar:/mesos/mesos-1.3.0/_build/src/java/target/protobuf-java-2.6.1.jar				\
	  org.apache.mesos.state.LevelDBState
/usr/lib/jvm/java-7-openjdk-amd64/bin/javah -d java/jni				\
	-classpath java/target/mesos-1.3.0.jar:/mesos/mesos-1.3.0/_build/src/java/target/protobuf-java-2.6.1.jar				\
	  org.apache.mesos.state.LogState
/usr/lib/jvm/java-7-openjdk-amd64/bin/javah -d java/jni				\
	-classpath java/target/mesos-1.3.0.jar:/mesos/mesos-1.3.0/_build/src/java/target/protobuf-java-2.6.1.jar				\
	  org.apache.mesos.state.Variable
/usr/lib/jvm/java-7-openjdk-amd64/bin/javah -d java/jni				\
	-classpath java/target/mesos-1.3.0.jar:/mesos/mesos-1.3.0/_build/src/java/target/protobuf-java-2.6.1.jar				\
	  org.apache.mesos.state.ZooKeeperState
/usr/lib/jvm/java-7-openjdk-amd64/bin/javah -d java/jni				\
	-classpath java/target/mesos-1.3.0.jar:/mesos/mesos-1.3.0/_build/src/java/target/protobuf-java-2.6.1.jar				\
	  org.apache.mesos.v1.scheduler.V1Mesos
/usr/lib/jvm/java-7-openjdk-amd64/bin/javah -d java/jni				\
	-classpath java/target/mesos-1.3.0.jar:/mesos/mesos-1.3.0/_build/src/java/target/protobuf-java-2.6.1.jar				\
	  org.apache.mesos.v1.scheduler.V0Mesos
make  all-am
make[3]: Entering directory `/mesos/mesos-1.3.0/_build/src'
/bin/bash ../libtool  --tag=CXX   --mode=compile g++ -DPACKAGE_NAME=\"mesos\" -DPACKAGE_TARNAME=\"mesos\" -DPACKAGE_VERSION=\"1.3.0\" -DPACKAGE_STRING=\"mesos\ 1.3.0\" -DPACKAGE_BUGREPORT=\"\" -DPACKAGE_URL=\"\" -DPACKAGE=\"mesos\" -DVERSION=\"1.3.0\" -DSTDC_HEADERS=1 -DHAVE_SYS_TYPES_H=1 -DHAVE_SYS_STAT_H=1 -DHAVE_STDLIB_H=1 -DHAVE_STRING_H=1 -DHAVE_MEMORY_H=1 -DHAVE_STRINGS_H=1 -DHAVE_INTTYPES_H=1 -DHAVE_STDINT_H=1 -DHAVE_UNISTD_H=1 -DHAVE_DLFCN_H=1 -DLT_OBJDIR=\".libs/\" -DHAVE_CXX11=1 -DHAVE_PTHREAD_PRIO_INHERIT=1 -DHAVE_PTHREAD=1 -DHAVE_LIBZ=1 -DHAVE_FTS_H=1 -DHAVE_APR_POOLS_H=1 -DHAVE_LIBAPR_1=1 -DHAVE_LIBCURL=1 -DMESOS_HAS_JAVA=1 -DHAVE_LIBSASL2=1 -DHAVE_SVN_VERSION_H=1 -DHAVE_LIBSVN_SUBR_1=1 -DHAVE_SVN_DELTA_H=1 -DHAVE_LIBSVN_DELTA_1=1 -DHAVE_LIBZ=1 -DHAVE_PYTHON=\"2.7\" -DMESOS_HAS_PYTHON=1 -I. -I../../src   -Werror -DLIBDIR=\"/mesos/mesos-1.3.0/_inst/lib\" -DPKGLIBEXECDIR=\"/mesos/mesos-1.3.0/_inst/libexec/mesos\" -DPKGDATADIR=\"/mesos/mesos-1.3.0/_inst/share/mesos\" -DPKGMODULEDIR=\"/mesos/mesos-1.3.0/_inst/lib/mesos/modules\" -I../../include -I../include -I../include/mesos -DPICOJSON_USE_INT64 -D__STDC_FORMAT_MACROS -isystem ../3rdparty/boost-1.53.0 -I../3rdparty/elfio-3.2 -I../3rdparty/glog-0.3.3/src -I../3rdparty/leveldb-1.19/include -I../../3rdparty/libprocess/include -I../3rdparty/nvml-352.79 -I../3rdparty/picojson-1.3.0 -I../3rdparty/protobuf-2.6.1/src -I../../3rdparty/stout/include -I../3rdparty/zookeeper-3.4.8/src/c/include -I../3rdparty/zookeeper-3.4.8/src/c/generated -DHAS_AUTHENTICATION=1 -I/usr/include/subversion-1 -I/usr/include/apr-1 -I/usr/include/apr-1.0  -pthread -Wall -Wsign-compare -Wformat-security -fstack-protector -fPIC -fPIE -g1 -O0 -Wno-unused-local-typedefs -std=c++11 -MT slave/containerizer/mesos/libmesos_no_3rdparty_la-linux_launcher.lo -MD -MP -MF slave/containerizer/mesos/.deps/libmesos_no_3rdparty_la-linux_launcher.Tpo -c -o slave/containerizer/mesos/libmesos_no_3rdparty_la-linux_launcher.lo `test -f 'slave/containerizer/mesos/linux_launcher.cpp' || echo '../../src/'`slave/containerizer/mesos/linux_launcher.cpp
/bin/bash ../libtool  --tag=CXX   --mode=compile g++ -DPACKAGE_NAME=\"mesos\" -DPACKAGE_TARNAME=\"mesos\" -DPACKAGE_VERSION=\"1.3.0\" -DPACKAGE_STRING=\"mesos\ 1.3.0\" -DPACKAGE_BUGREPORT=\"\" -DPACKAGE_URL=\"\" -DPACKAGE=\"mesos\" -DVERSION=\"1.3.0\" -DSTDC_HEADERS=1 -DHAVE_SYS_TYPES_H=1 -DHAVE_SYS_STAT_H=1 -DHAVE_STDLIB_H=1 -DHAVE_STRING_H=1 -DHAVE_MEMORY_H=1 -DHAVE_STRINGS_H=1 -DHAVE_INTTYPES_H=1 -DHAVE_STDINT_H=1 -DHAVE_UNISTD_H=1 -DHAVE_DLFCN_H=1 -DLT_OBJDIR=\".libs/\" -DHAVE_CXX11=1 -DHAVE_PTHREAD_PRIO_INHERIT=1 -DHAVE_PTHREAD=1 -DHAVE_LIBZ=1 -DHAVE_FTS_H=1 -DHAVE_APR_POOLS_H=1 -DHAVE_LIBAPR_1=1 -DHAVE_LIBCURL=1 -DMESOS_HAS_JAVA=1 -DHAVE_LIBSASL2=1 -DHAVE_SVN_VERSION_H=1 -DHAVE_LIBSVN_SUBR_1=1 -DHAVE_SVN_DELTA_H=1 -DHAVE_LIBSVN_DELTA_1=1 -DHAVE_LIBZ=1 -DHAVE_PYTHON=\"2.7\" -DMESOS_HAS_PYTHON=1 -I. -I../../src   -Werror -DLIBDIR=\"/mesos/mesos-1.3.0/_inst/lib\" -DPKGLIBEXECDIR=\"/mesos/mesos-1.3.0/_inst/libexec/mesos\" -DPKGDATADIR=\"/mesos/mesos-1.3.0/_inst/share/mesos\" -DPKGMODULEDIR=\"/mesos/mesos-1.3.0/_inst/lib/mesos/modules\" -I../../include -I../include -I../include/mesos -DPICOJSON_USE_INT64 -D__STDC_FORMAT_MACROS -isystem ../3rdparty/boost-1.53.0 -I../3rdparty/elfio-3.2 -I../3rdparty/glog-0.3.3/src -I../3rdparty/leveldb-1.19/include -I../../3rdparty/libprocess/include -I../3rdparty/nvml-352.79 -I../3rdparty/picojson-1.3.0 -I../3rdparty/protobuf-2.6.1/src -I../../3rdparty/stout/include -I../3rdparty/zookeeper-3.4.8/src/c/include -I../3rdparty/zookeeper-3.4.8/src/c/generated -DHAS_AUTHENTICATION=1 -I/usr/include/subversion-1 -I/usr/include/apr-1 -I/usr/include/apr-1.0  -pthread -Wall -Wsign-compare -Wformat-security -fstack-protector -fPIC -fPIE -g1 -O0 -Wno-unused-local-typedefs -std=c++11 -MT slave/containerizer/mesos/isolators/docker/volume/libmesos_no_3rdparty_la-isolator.lo -MD -MP -MF slave/containerizer/mesos/isolators/docker/volume/.deps/libmesos_no_3rdparty_la-isolator.Tpo -c -o slave/containerizer/mesos/isolators/docker/volume/libmesos_no_3rdparty_la-isolator.lo `test -f 'slave/containerizer/mesos/isolators/docker/volume/isolator.cpp' || echo '../../src/'`slave/containerizer/mesos/isolators/docker/volume/isolator.cpp
/bin/bash ../libtool  --tag=CXX   --mode=compile g++ -DPACKAGE_NAME=\"mesos\" -DPACKAGE_TARNAME=\"mesos\" -DPACKAGE_VERSION=\"1.3.0\" -DPACKAGE_STRING=\"mesos\ 1.3.0\" -DPACKAGE_BUGREPORT=\"\" -DPACKAGE_URL=\"\" -DPACKAGE=\"mesos\" -DVERSION=\"1.3.0\" -DSTDC_HEADERS=1 -DHAVE_SYS_TYPES_H=1 -DHAVE_SYS_STAT_H=1 -DHAVE_STDLIB_H=1 -DHAVE_STRING_H=1 -DHAVE_MEMORY_H=1 -DHAVE_STRINGS_H=1 -DHAVE_INTTYPES_H=1 -DHAVE_STDINT_H=1 -DHAVE_UNISTD_H=1 -DHAVE_DLFCN_H=1 -DLT_OBJDIR=\".libs/\" -DHAVE_CXX11=1 -DHAVE_PTHREAD_PRIO_INHERIT=1 -DHAVE_PTHREAD=1 -DHAVE_LIBZ=1 -DHAVE_FTS_H=1 -DHAVE_APR_POOLS_H=1 -DHAVE_LIBAPR_1=1 -DHAVE_LIBCURL=1 -DMESOS_HAS_JAVA=1 -DHAVE_LIBSASL2=1 -DHAVE_SVN_VERSION_H=1 -DHAVE_LIBSVN_SUBR_1=1 -DHAVE_SVN_DELTA_H=1 -DHAVE_LIBSVN_DELTA_1=1 -DHAVE_LIBZ=1 -DHAVE_PYTHON=\"2.7\" -DMESOS_HAS_PYTHON=1 -I. -I../../src   -Werror -DLIBDIR=\"/mesos/mesos-1.3.0/_inst/lib\" -DPKGLIBEXECDIR=\"/mesos/mesos-1.3.0/_inst/libexec/mesos\" -DPKGDATADIR=\"/mesos/mesos-1.3.0/_inst/share/mesos\" -DPKGMODULEDIR=\"/mesos/mesos-1.3.0/_inst/lib/mesos/modules\" -I../../include -I../include -I../include/mesos -DPICOJSON_USE_INT64 -D__STDC_FORMAT_MACROS -isystem ../3rdparty/boost-1.53.0 -I../3rdparty/elfio-3.2 -I../3rdparty/glog-0.3.3/src -I../3rdparty/leveldb-1.19/include -I../../3rdparty/libprocess/include -I../3rdparty/nvml-352.79 -I../3rdparty/picojson-1.3.0 -I../3rdparty/protobuf-2.6.1/src -I../../3rdparty/stout/include -I../3rdparty/zookeeper-3.4.8/src/c/include -I../3rdparty/zookeeper-3.4.8/src/c/generated -DHAS_AUTHENTICATION=1 -I/usr/include/subversion-1 -I/usr/include/apr-1 -I/usr/include/apr-1.0  -pthread -Wall -Wsign-compare -Wformat-security -fstack-protector -fPIC -fPIE -g1 -O0 -Wno-unused-local-typedefs -std=c++11 -MT slave/containerizer/mesos/isolators/filesystem/libmesos_no_3rdparty_la-linux.lo -MD -MP -MF slave/containerizer/mesos/isolators/filesystem/.deps/libmesos_no_3rdparty_la-linux.Tpo -c -o slave/containerizer/mesos/isolators/filesystem/libmesos_no_3rdparty_la-linux.lo `test -f 'slave/containerizer/mesos/isolators/filesystem/linux.cpp' || echo '../../src/'`slave/containerizer/mesos/isolators/filesystem/linux.cpp
/bin/bash ../libtool  --tag=CXX   --mode=compile g++ -DPACKAGE_NAME=\"mesos\" -DPACKAGE_TARNAME=\"mesos\" -DPACKAGE_VERSION=\"1.3.0\" -DPACKAGE_STRING=\"mesos\ 1.3.0\" -DPACKAGE_BUGREPORT=\"\" -DPACKAGE_URL=\"\" -DPACKAGE=\"mesos\" -DVERSION=\"1.3.0\" -DSTDC_HEADERS=1 -DHAVE_SYS_TYPES_H=1 -DHAVE_SYS_STAT_H=1 -DHAVE_STDLIB_H=1 -DHAVE_STRING_H=1 -DHAVE_MEMORY_H=1 -DHAVE_STRINGS_H=1 -DHAVE_INTTYPES_H=1 -DHAVE_STDINT_H=1 -DHAVE_UNISTD_H=1 -DHAVE_DLFCN_H=1 -DLT_OBJDIR=\".libs/\" -DHAVE_CXX11=1 -DHAVE_PTHREAD_PRIO_INHERIT=1 -DHAVE_PTHREAD=1 -DHAVE_LIBZ=1 -DHAVE_FTS_H=1 -DHAVE_APR_POOLS_H=1 -DHAVE_LIBAPR_1=1 -DHAVE_LIBCURL=1 -DMESOS_HAS_JAVA=1 -DHAVE_LIBSASL2=1 -DHAVE_SVN_VERSION_H=1 -DHAVE_LIBSVN_SUBR_1=1 -DHAVE_SVN_DELTA_H=1 -DHAVE_LIBSVN_DELTA_1=1 -DHAVE_LIBZ=1 -DHAVE_PYTHON=\"2.7\" -DMESOS_HAS_PYTHON=1 -I. -I../../src   -Werror -DLIBDIR=\"/mesos/mesos-1.3.0/_inst/lib\" -DPKGLIBEXECDIR=\"/mesos/mesos-1.3.0/_inst/libexec/mesos\" -DPKGDATADIR=\"/mesos/mesos-1.3.0/_inst/share/mesos\" -DPKGMODULEDIR=\"/mesos/mesos-1.3.0/_inst/lib/mesos/modules\" -I../../include -I../include -I../include/mesos -DPICOJSON_USE_INT64 -D__STDC_FORMAT_MACROS -isystem ../3rdparty/boost-1.53.0 -I../3rdparty/elfio-3.2 -I../3rdparty/glog-0.3.3/src -I../3rdparty/leveldb-1.19/include -I../../3rdparty/libprocess/include -I../3rdparty/nvml-352.79 -I../3rdparty/picojson-1.3.0 -I../3rdparty/protobuf-2.6.1/src -I../../3rdparty/stout/include -I../3rdparty/zookeeper-3.4.8/src/c/include -I../3rdparty/zookeeper-3.4.8/src/c/generated -DHAS_AUTHENTICATION=1 -I/usr/include/subversion-1 -I/usr/include/apr-1 -I/usr/include/apr-1.0  -pthread -Wall -Wsign-compare -Wformat-security -fstack-protector -fPIC -fPIE -g1 -O0 -Wno-unused-local-typedefs -std=c++11 -MT slave/containerizer/mesos/isolators/filesystem/libmesos_no_3rdparty_la-shared.lo -MD -MP -MF slave/containerizer/mesos/isolators/filesystem/.deps/libmesos_no_3rdparty_la-shared.Tpo -c -o slave/containerizer/mesos/isolators/filesystem/libmesos_no_3rdparty_la-shared.lo `test -f 'slave/containerizer/mesos/isolators/filesystem/shared.cpp' || echo '../../src/'`slave/containerizer/mesos/isolators/filesystem/shared.cpp
/bin/bash ../libtool  --tag=CXX   --mode=compile g++ -DPACKAGE_NAME=\"mesos\" -DPACKAGE_TARNAME=\"mesos\" -DPACKAGE_VERSION=\"1.3.0\" -DPACKAGE_STRING=\"mesos\ 1.3.0\" -DPACKAGE_BUGREPORT=\"\" -DPACKAGE_URL=\"\" -DPACKAGE=\"mesos\" -DVERSION=\"1.3.0\" -DSTDC_HEADERS=1 -DHAVE_SYS_TYPES_H=1 -DHAVE_SYS_STAT_H=1 -DHAVE_STDLIB_H=1 -DHAVE_STRING_H=1 -DHAVE_MEMORY_H=1 -DHAVE_STRINGS_H=1 -DHAVE_INTTYPES_H=1 -DHAVE_STDINT_H=1 -DHAVE_UNISTD_H=1 -DHAVE_DLFCN_H=1 -DLT_OBJDIR=\".libs/\" -DHAVE_CXX11=1 -DHAVE_PTHREAD_PRIO_INHERIT=1 -DHAVE_PTHREAD=1 -DHAVE_LIBZ=1 -DHAVE_FTS_H=1 -DHAVE_APR_POOLS_H=1 -DHAVE_LIBAPR_1=1 -DHAVE_LIBCURL=1 -DMESOS_HAS_JAVA=1 -DHAVE_LIBSASL2=1 -DHAVE_SVN_VERSION_H=1 -DHAVE_LIBSVN_SUBR_1=1 -DHAVE_SVN_DELTA_H=1 -DHAVE_LIBSVN_DELTA_1=1 -DHAVE_LIBZ=1 -DHAVE_PYTHON=\"2.7\" -DMESOS_HAS_PYTHON=1 -I. -I../../src   -Werror -DLIBDIR=\"/mesos/mesos-1.3.0/_inst/lib\" -DPKGLIBEXECDIR=\"/mesos/mesos-1.3.0/_inst/libexec/mesos\" -DPKGDATADIR=\"/mesos/mesos-1.3.0/_inst/share/mesos\" -DPKGMODULEDIR=\"/mesos/mesos-1.3.0/_inst/lib/mesos/modules\" -I../../include -I../include -I../include/mesos -DPICOJSON_USE_INT64 -D__STDC_FORMAT_MACROS -isystem ../3rdparty/boost-1.53.0 -I../3rdparty/elfio-3.2 -I../3rdparty/glog-0.3.3/src -I../3rdparty/leveldb-1.19/include -I../../3rdparty/libprocess/include -I../3rdparty/nvml-352.79 -I../3rdparty/picojson-1.3.0 -I../3rdparty/protobuf-2.6.1/src -I../../3rdparty/stout/include -I../3rdparty/zookeeper-3.4.8/src/c/include -I../3rdparty/zookeeper-3.4.8/src/c/generated -DHAS_AUTHENTICATION=1 -I/usr/include/subversion-1 -I/usr/include/apr-1 -I/usr/include/apr-1.0  -pthread -Wall -Wsign-compare -Wformat-security -fstack-protector -fPIC -fPIE -g1 -O0 -Wno-unused-local-typedefs -std=c++11 -MT slave/containerizer/mesos/isolators/network/cni/libmesos_no_3rdparty_la-cni.lo -MD -MP -MF slave/containerizer/mesos/isolators/network/cni/.deps/libmesos_no_3rdparty_la-cni.Tpo -c -o slave/containerizer/mesos/isolators/network/cni/libmesos_no_3rdparty_la-cni.lo `test -f 'slave/containerizer/mesos/isolators/network/cni/cni.cpp' || echo '../../src/'`slave/containerizer/mesos/isolators/network/cni/cni.cpp
/bin/bash ../libtool  --tag=CXX   --mode=compile g++ -DPACKAGE_NAME=\"mesos\" -DPACKAGE_TARNAME=\"mesos\" -DPACKAGE_VERSION=\"1.3.0\" -DPACKAGE_STRING=\"mesos\ 1.3.0\" -DPACKAGE_BUGREPORT=\"\" -DPACKAGE_URL=\"\" -DPACKAGE=\"mesos\" -DVERSION=\"1.3.0\" -DSTDC_HEADERS=1 -DHAVE_SYS_TYPES_H=1 -DHAVE_SYS_STAT_H=1 -DHAVE_STDLIB_H=1 -DHAVE_STRING_H=1 -DHAVE_MEMORY_H=1 -DHAVE_STRINGS_H=1 -DHAVE_INTTYPES_H=1 -DHAVE_STDINT_H=1 -DHAVE_UNISTD_H=1 -DHAVE_DLFCN_H=1 -DLT_OBJDIR=\".libs/\" -DHAVE_CXX11=1 -DHAVE_PTHREAD_PRIO_INHERIT=1 -DHAVE_PTHREAD=1 -DHAVE_LIBZ=1 -DHAVE_FTS_H=1 -DHAVE_APR_POOLS_H=1 -DHAVE_LIBAPR_1=1 -DHAVE_LIBCURL=1 -DMESOS_HAS_JAVA=1 -DHAVE_LIBSASL2=1 -DHAVE_SVN_VERSION_H=1 -DHAVE_LIBSVN_SUBR_1=1 -DHAVE_SVN_DELTA_H=1 -DHAVE_LIBSVN_DELTA_1=1 -DHAVE_LIBZ=1 -DHAVE_PYTHON=\"2.7\" -DMESOS_HAS_PYTHON=1 -I. -I../../src   -Werror -DLIBDIR=\"/mesos/mesos-1.3.0/_inst/lib\" -DPKGLIBEXECDIR=\"/mesos/mesos-1.3.0/_inst/libexec/mesos\" -DPKGDATADIR=\"/mesos/mesos-1.3.0/_inst/share/mesos\" -DPKGMODULEDIR=\"/mesos/mesos-1.3.0/_inst/lib/mesos/modules\" -I../../include -I../include -I../include/mesos -DPICOJSON_USE_INT64 -D__STDC_FORMAT_MACROS -isystem ../3rdparty/boost-1.53.0 -I../3rdparty/elfio-3.2 -I../3rdparty/glog-0.3.3/src -I../3rdparty/leveldb-1.19/include -I../../3rdparty/libprocess/include -I../3rdparty/nvml-352.79 -I../3rdparty/picojson-1.3.0 -I../3rdparty/protobuf-2.6.1/src -I../../3rdparty/stout/include -I../3rdparty/zookeeper-3.4.8/src/c/include -I../3rdparty/zookeeper-3.4.8/src/c/generated -DHAS_AUTHENTICATION=1 -I/usr/include/subversion-1 -I/usr/include/apr-1 -I/usr/include/apr-1.0  -pthread -Wall -Wsign-compare -Wformat-security -fstack-protector -fPIC -fPIE -g1 -O0 -Wno-unused-local-typedefs -std=c++11 -MT slave/containerizer/mesos/isolators/volume/libmesos_no_3rdparty_la-image.lo -MD -MP -MF slave/containerizer/mesos/isolators/volume/.deps/libmesos_no_3rdparty_la-image.Tpo -c -o slave/containerizer/mesos/isolators/volume/libmesos_no_3rdparty_la-image.lo `test -f 'slave/containerizer/mesos/isolators/volume/image.cpp' || echo '../../src/'`slave/containerizer/mesos/isolators/volume/image.cpp
libtool: compile:  g++ -DPACKAGE_NAME=\"mesos\" -DPACKAGE_TARNAME=\"mesos\" -DPACKAGE_VERSION=\"1.3.0\" "-DPACKAGE_STRING=\"mesos 1.3.0\"" -DPACKAGE_BUGREPORT=\"\" -DPACKAGE_URL=\"\" -DPACKAGE=\"mesos\" -DVERSION=\"1.3.0\" -DSTDC_HEADERS=1 -DHAVE_SYS_TYPES_H=1 -DHAVE_SYS_STAT_H=1 -DHAVE_STDLIB_H=1 -DHAVE_STRING_H=1 -DHAVE_MEMORY_H=1 -DHAVE_STRINGS_H=1 -DHAVE_INTTYPES_H=1 -DHAVE_STDINT_H=1 -DHAVE_UNISTD_H=1 -DHAVE_DLFCN_H=1 -DLT_OBJDIR=\".libs/\" -DHAVE_CXX11=1 -DHAVE_PTHREAD_PRIO_INHERIT=1 -DHAVE_PTHREAD=1 -DHAVE_LIBZ=1 -DHAVE_FTS_H=1 -DHAVE_APR_POOLS_H=1 -DHAVE_LIBAPR_1=1 -DHAVE_LIBCURL=1 -DMESOS_HAS_JAVA=1 -DHAVE_LIBSASL2=1 -DHAVE_SVN_VERSION_H=1 -DHAVE_LIBSVN_SUBR_1=1 -DHAVE_SVN_DELTA_H=1 -DHAVE_LIBSVN_DELTA_1=1 -DHAVE_LIBZ=1 -DHAVE_PYTHON=\"2.7\" -DMESOS_HAS_PYTHON=1 -I. -I../../src -Werror -DLIBDIR=\"/mesos/mesos-1.3.0/_inst/lib\" -DPKGLIBEXECDIR=\"/mesos/mesos-1.3.0/_inst/libexec/mesos\" -DPKGDATADIR=\"/mesos/mesos-1.3.0/_inst/share/mesos\" -DPKGMODULEDIR=\"/mesos/mesos-1.3.0/_inst/lib/mesos/modules\" -I../../include -I../include -I../include/mesos -DPICOJSON_USE_INT64 -D__STDC_FORMAT_MACROS -isystem ../3rdparty/boost-1.53.0 -I../3rdparty/elfio-3.2 -I../3rdparty/glog-0.3.3/src -I../3rdparty/leveldb-1.19/include -I../../3rdparty/libprocess/include -I../3rdparty/nvml-352.79 -I../3rdparty/picojson-1.3.0 -I../3rdparty/protobuf-2.6.1/src -I../../3rdparty/stout/include -I../3rdparty/zookeeper-3.4.8/src/c/include -I../3rdparty/zookeeper-3.4.8/src/c/generated -DHAS_AUTHENTICATION=1 -I/usr/include/subversion-1 -I/usr/include/apr-1 -I/usr/include/apr-1.0 -pthread -Wall -Wsign-compare -Wformat-security -fstack-protector -fPIC -g1 -O0 -Wno-unused-local-typedefs -std=c++11 -MT slave/containerizer/mesos/libmesos_no_3rdparty_la-linux_launcher.lo -MD -MP -MF slave/containerizer/mesos/.deps/libmesos_no_3rdparty_la-linux_launcher.Tpo -c ../../src/slave/containerizer/mesos/linux_launcher.cpp  -fPIC -DPIC -o slave/containerizer/mesos/.libs/libmesos_no_3rdparty_la-linux_launcher.o
libtool: compile:  g++ -DPACKAGE_NAME=\"mesos\" -DPACKAGE_TARNAME=\"mesos\" -DPACKAGE_VERSION=\"1.3.0\" "-DPACKAGE_STRING=\"mesos 1.3.0\"" -DPACKAGE_BUGREPORT=\"\" -DPACKAGE_URL=\"\" -DPACKAGE=\"mesos\" -DVERSION=\"1.3.0\" -DSTDC_HEADERS=1 -DHAVE_SYS_TYPES_H=1 -DHAVE_SYS_STAT_H=1 -DHAVE_STDLIB_H=1 -DHAVE_STRING_H=1 -DHAVE_MEMORY_H=1 -DHAVE_STRINGS_H=1 -DHAVE_INTTYPES_H=1 -DHAVE_STDINT_H=1 -DHAVE_UNISTD_H=1 -DHAVE_DLFCN_H=1 -DLT_OBJDIR=\".libs/\" -DHAVE_CXX11=1 -DHAVE_PTHREAD_PRIO_INHERIT=1 -DHAVE_PTHREAD=1 -DHAVE_LIBZ=1 -DHAVE_FTS_H=1 -DHAVE_APR_POOLS_H=1 -DHAVE_LIBAPR_1=1 -DHAVE_LIBCURL=1 -DMESOS_HAS_JAVA=1 -DHAVE_LIBSASL2=1 -DHAVE_SVN_VERSION_H=1 -DHAVE_LIBSVN_SUBR_1=1 -DHAVE_SVN_DELTA_H=1 -DHAVE_LIBSVN_DELTA_1=1 -DHAVE_LIBZ=1 -DHAVE_PYTHON=\"2.7\" -DMESOS_HAS_PYTHON=1 -I. -I../../src -Werror -DLIBDIR=\"/mesos/mesos-1.3.0/_inst/lib\" -DPKGLIBEXECDIR=\"/mesos/mesos-1.3.0/_inst/libexec/mesos\" -DPKGDATADIR=\"/mesos/mesos-1.3.0/_inst/share/mesos\" -DPKGMODULEDIR=\"/mesos/mesos-1.3.0/_inst/lib/mesos/modules\" -I../../include -I../include -I../include/mesos -DPICOJSON_USE_INT64 -D__STDC_FORMAT_MACROS -isystem ../3rdparty/boost-1.53.0 -I../3rdparty/elfio-3.2 -I../3rdparty/glog-0.3.3/src -I../3rdparty/leveldb-1.19/include -I../../3rdparty/libprocess/include -I../3rdparty/nvml-352.79 -I../3rdparty/picojson-1.3.0 -I../3rdparty/protobuf-2.6.1/src -I../../3rdparty/stout/include -I../3rdparty/zookeeper-3.4.8/src/c/include -I../3rdparty/zookeeper-3.4.8/src/c/generated -DHAS_AUTHENTICATION=1 -I/usr/include/subversion-1 -I/usr/include/apr-1 -I/usr/include/apr-1.0 -pthread -Wall -Wsign-compare -Wformat-security -fstack-protector -fPIC -g1 -O0 -Wno-unused-local-typedefs -std=c++11 -MT slave/containerizer/mesos/isolators/filesystem/libmesos_no_3rdparty_la-shared.lo -MD -MP -MF slave/containerizer/mesos/isolators/filesystem/.deps/libmesos_no_3rdparty_la-shared.Tpo -c ../../src/slave/containerizer/mesos/isolators/filesystem/shared.cpp  -fPIC -DPIC -o slave/containerizer/mesos/isolators/filesystem/.libs/libmesos_no_3rdparty_la-shared.o
libtool: compile:  g++ -DPACKAGE_NAME=\"mesos\" -DPACKAGE_TARNAME=\"mesos\" -DPACKAGE_VERSION=\"1.3.0\" "-DPACKAGE_STRING=\"mesos 1.3.0\"" -DPACKAGE_BUGREPORT=\"\" -DPACKAGE_URL=\"\" -DPACKAGE=\"mesos\" -DVERSION=\"1.3.0\" -DSTDC_HEADERS=1 -DHAVE_SYS_TYPES_H=1 -DHAVE_SYS_STAT_H=1 -DHAVE_STDLIB_H=1 -DHAVE_STRING_H=1 -DHAVE_MEMORY_H=1 -DHAVE_STRINGS_H=1 -DHAVE_INTTYPES_H=1 -DHAVE_STDINT_H=1 -DHAVE_UNISTD_H=1 -DHAVE_DLFCN_H=1 -DLT_OBJDIR=\".libs/\" -DHAVE_CXX11=1 -DHAVE_PTHREAD_PRIO_INHERIT=1 -DHAVE_PTHREAD=1 -DHAVE_LIBZ=1 -DHAVE_FTS_H=1 -DHAVE_APR_POOLS_H=1 -DHAVE_LIBAPR_1=1 -DHAVE_LIBCURL=1 -DMESOS_HAS_JAVA=1 -DHAVE_LIBSASL2=1 -DHAVE_SVN_VERSION_H=1 -DHAVE_LIBSVN_SUBR_1=1 -DHAVE_SVN_DELTA_H=1 -DHAVE_LIBSVN_DELTA_1=1 -DHAVE_LIBZ=1 -DHAVE_PYTHON=\"2.7\" -DMESOS_HAS_PYTHON=1 -I. -I../../src -Werror -DLIBDIR=\"/mesos/mesos-1.3.0/_inst/lib\" -DPKGLIBEXECDIR=\"/mesos/mesos-1.3.0/_inst/libexec/mesos\" -DPKGDATADIR=\"/mesos/mesos-1.3.0/_inst/share/mesos\" -DPKGMODULEDIR=\"/mesos/mesos-1.3.0/_inst/lib/mesos/modules\" -I../../include -I../include -I../include/mesos -DPICOJSON_USE_INT64 -D__STDC_FORMAT_MACROS -isystem ../3rdparty/boost-1.53.0 -I../3rdparty/elfio-3.2 -I../3rdparty/glog-0.3.3/src -I../3rdparty/leveldb-1.19/include -I../../3rdparty/libprocess/include -I../3rdparty/nvml-352.79 -I../3rdparty/picojson-1.3.0 -I../3rdparty/protobuf-2.6.1/src -I../../3rdparty/stout/include -I../3rdparty/zookeeper-3.4.8/src/c/include -I../3rdparty/zookeeper-3.4.8/src/c/generated -DHAS_AUTHENTICATION=1 -I/usr/include/subversion-1 -I/usr/include/apr-1 -I/usr/include/apr-1.0 -pthread -Wall -Wsign-compare -Wformat-security -fstack-protector -fPIC -g1 -O0 -Wno-unused-local-typedefs -std=c++11 -MT slave/containerizer/mesos/isolators/filesystem/libmesos_no_3rdparty_la-linux.lo -MD -MP -MF slave/containerizer/mesos/isolators/filesystem/.deps/libmesos_no_3rdparty_la-linux.Tpo -c ../../src/slave/containerizer/mesos/isolators/filesystem/linux.cpp  -fPIC -DPIC -o slave/containerizer/mesos/isolators/filesystem/.libs/libmesos_no_3rdparty_la-linux.o
libtool: compile:  g++ -DPACKAGE_NAME=\"mesos\" -DPACKAGE_TARNAME=\"mesos\" -DPACKAGE_VERSION=\"1.3.0\" "-DPACKAGE_STRING=\"mesos 1.3.0\"" -DPACKAGE_BUGREPORT=\"\" -DPACKAGE_URL=\"\" -DPACKAGE=\"mesos\" -DVERSION=\"1.3.0\" -DSTDC_HEADERS=1 -DHAVE_SYS_TYPES_H=1 -DHAVE_SYS_STAT_H=1 -DHAVE_STDLIB_H=1 -DHAVE_STRING_H=1 -DHAVE_MEMORY_H=1 -DHAVE_STRINGS_H=1 -DHAVE_INTTYPES_H=1 -DHAVE_STDINT_H=1 -DHAVE_UNISTD_H=1 -DHAVE_DLFCN_H=1 -DLT_OBJDIR=\".libs/\" -DHAVE_CXX11=1 -DHAVE_PTHREAD_PRIO_INHERIT=1 -DHAVE_PTHREAD=1 -DHAVE_LIBZ=1 -DHAVE_FTS_H=1 -DHAVE_APR_POOLS_H=1 -DHAVE_LIBAPR_1=1 -DHAVE_LIBCURL=1 -DMESOS_HAS_JAVA=1 -DHAVE_LIBSASL2=1 -DHAVE_SVN_VERSION_H=1 -DHAVE_LIBSVN_SUBR_1=1 -DHAVE_SVN_DELTA_H=1 -DHAVE_LIBSVN_DELTA_1=1 -DHAVE_LIBZ=1 -DHAVE_PYTHON=\"2.7\" -DMESOS_HAS_PYTHON=1 -I. -I../../src -Werror -DLIBDIR=\"/mesos/mesos-1.3.0/_inst/lib\" -DPKGLIBEXECDIR=\"/mesos/mesos-1.3.0/_inst/libexec/mesos\" -DPKGDATADIR=\"/mesos/mesos-1.3.0/_inst/share/mesos\" -DPKGMODULEDIR=\"/mesos/mesos-1.3.0/_inst/lib/mesos/modules\" -I../../include -I../include -I../include/mesos -DPICOJSON_USE_INT64 -D__STDC_FORMAT_MACROS -isystem ../3rdparty/boost-1.53.0 -I../3rdparty/elfio-3.2 -I../3rdparty/glog-0.3.3/src -I../3rdparty/leveldb-1.19/include -I../../3rdparty/libprocess/include -I../3rdparty/nvml-352.79 -I../3rdparty/picojson-1.3.0 -I../3rdparty/protobuf-2.6.1/src -I../../3rdparty/stout/include -I../3rdparty/zookeeper-3.4.8/src/c/include -I../3rdparty/zookeeper-3.4.8/src/c/generated -DHAS_AUTHENTICATION=1 -I/usr/include/subversion-1 -I/usr/include/apr-1 -I/usr/include/apr-1.0 -pthread -Wall -Wsign-compare -Wformat-security -fstack-protector -fPIC -g1 -O0 -Wno-unused-local-typedefs -std=c++11 -MT slave/containerizer/mesos/isolators/docker/volume/libmesos_no_3rdparty_la-isolator.lo -MD -MP -MF slave/containerizer/mesos/isolators/docker/volume/.deps/libmesos_no_3rdparty_la-isolator.Tpo -c ../../src/slave/containerizer/mesos/isolators/docker/volume/isolator.cpp  -fPIC -DPIC -o slave/containerizer/mesos/isolators/docker/volume/.libs/libmesos_no_3rdparty_la-isolator.o
libtool: compile:  g++ -DPACKAGE_NAME=\"mesos\" -DPACKAGE_TARNAME=\"mesos\" -DPACKAGE_VERSION=\"1.3.0\" "-DPACKAGE_STRING=\"mesos 1.3.0\"" -DPACKAGE_BUGREPORT=\"\" -DPACKAGE_URL=\"\" -DPACKAGE=\"mesos\" -DVERSION=\"1.3.0\" -DSTDC_HEADERS=1 -DHAVE_SYS_TYPES_H=1 -DHAVE_SYS_STAT_H=1 -DHAVE_STDLIB_H=1 -DHAVE_STRING_H=1 -DHAVE_MEMORY_H=1 -DHAVE_STRINGS_H=1 -DHAVE_INTTYPES_H=1 -DHAVE_STDINT_H=1 -DHAVE_UNISTD_H=1 -DHAVE_DLFCN_H=1 -DLT_OBJDIR=\".libs/\" -DHAVE_CXX11=1 -DHAVE_PTHREAD_PRIO_INHERIT=1 -DHAVE_PTHREAD=1 -DHAVE_LIBZ=1 -DHAVE_FTS_H=1 -DHAVE_APR_POOLS_H=1 -DHAVE_LIBAPR_1=1 -DHAVE_LIBCURL=1 -DMESOS_HAS_JAVA=1 -DHAVE_LIBSASL2=1 -DHAVE_SVN_VERSION_H=1 -DHAVE_LIBSVN_SUBR_1=1 -DHAVE_SVN_DELTA_H=1 -DHAVE_LIBSVN_DELTA_1=1 -DHAVE_LIBZ=1 -DHAVE_PYTHON=\"2.7\" -DMESOS_HAS_PYTHON=1 -I. -I../../src -Werror -DLIBDIR=\"/mesos/mesos-1.3.0/_inst/lib\" -DPKGLIBEXECDIR=\"/mesos/mesos-1.3.0/_inst/libexec/mesos\" -DPKGDATADIR=\"/mesos/mesos-1.3.0/_inst/share/mesos\" -DPKGMODULEDIR=\"/mesos/mesos-1.3.0/_inst/lib/mesos/modules\" -I../../include -I../include -I../include/mesos -DPICOJSON_USE_INT64 -D__STDC_FORMAT_MACROS -isystem ../3rdparty/boost-1.53.0 -I../3rdparty/elfio-3.2 -I../3rdparty/glog-0.3.3/src -I../3rdparty/leveldb-1.19/include -I../../3rdparty/libprocess/include -I../3rdparty/nvml-352.79 -I../3rdparty/picojson-1.3.0 -I../3rdparty/protobuf-2.6.1/src -I../../3rdparty/stout/include -I../3rdparty/zookeeper-3.4.8/src/c/include -I../3rdparty/zookeeper-3.4.8/src/c/generated -DHAS_AUTHENTICATION=1 -I/usr/include/subversion-1 -I/usr/include/apr-1 -I/usr/include/apr-1.0 -pthread -Wall -Wsign-compare -Wformat-security -fstack-protector -fPIC -g1 -O0 -Wno-unused-local-typedefs -std=c++11 -MT slave/containerizer/mesos/isolators/network/cni/libmesos_no_3rdparty_la-cni.lo -MD -MP -MF slave/containerizer/mesos/isolators/network/cni/.deps/libmesos_no_3rdparty_la-cni.Tpo -c ../../src/slave/containerizer/mesos/isolators/network/cni/cni.cpp  -fPIC -DPIC -o slave/containerizer/mesos/isolators/network/cni/.libs/libmesos_no_3rdparty_la-cni.o
libtool: compile:  g++ -DPACKAGE_NAME=\"mesos\" -DPACKAGE_TARNAME=\"mesos\" -DPACKAGE_VERSION=\"1.3.0\" "-DPACKAGE_STRING=\"mesos 1.3.0\"" -DPACKAGE_BUGREPORT=\"\" -DPACKAGE_URL=\"\" -DPACKAGE=\"mesos\" -DVERSION=\"1.3.0\" -DSTDC_HEADERS=1 -DHAVE_SYS_TYPES_H=1 -DHAVE_SYS_STAT_H=1 -DHAVE_STDLIB_H=1 -DHAVE_STRING_H=1 -DHAVE_MEMORY_H=1 -DHAVE_STRINGS_H=1 -DHAVE_INTTYPES_H=1 -DHAVE_STDINT_H=1 -DHAVE_UNISTD_H=1 -DHAVE_DLFCN_H=1 -DLT_OBJDIR=\".libs/\" -DHAVE_CXX11=1 -DHAVE_PTHREAD_PRIO_INHERIT=1 -DHAVE_PTHREAD=1 -DHAVE_LIBZ=1 -DHAVE_FTS_H=1 -DHAVE_APR_POOLS_H=1 -DHAVE_LIBAPR_1=1 -DHAVE_LIBCURL=1 -DMESOS_HAS_JAVA=1 -DHAVE_LIBSASL2=1 -DHAVE_SVN_VERSION_H=1 -DHAVE_LIBSVN_SUBR_1=1 -DHAVE_SVN_DELTA_H=1 -DHAVE_LIBSVN_DELTA_1=1 -DHAVE_LIBZ=1 -DHAVE_PYTHON=\"2.7\" -DMESOS_HAS_PYTHON=1 -I. -I../../src -Werror -DLIBDIR=\"/mesos/mesos-1.3.0/_inst/lib\" -DPKGLIBEXECDIR=\"/mesos/mesos-1.3.0/_inst/libexec/mesos\" -DPKGDATADIR=\"/mesos/mesos-1.3.0/_inst/share/mesos\" -DPKGMODULEDIR=\"/mesos/mesos-1.3.0/_inst/lib/mesos/modules\" -I../../include -I../include -I../include/mesos -DPICOJSON_USE_INT64 -D__STDC_FORMAT_MACROS -isystem ../3rdparty/boost-1.53.0 -I../3rdparty/elfio-3.2 -I../3rdparty/glog-0.3.3/src -I../3rdparty/leveldb-1.19/include -I../../3rdparty/libprocess/include -I../3rdparty/nvml-352.79 -I../3rdparty/picojson-1.3.0 -I../3rdparty/protobuf-2.6.1/src -I../../3rdparty/stout/include -I../3rdparty/zookeeper-3.4.8/src/c/include -I../3rdparty/zookeeper-3.4.8/src/c/generated -DHAS_AUTHENTICATION=1 -I/usr/include/subversion-1 -I/usr/include/apr-1 -I/usr/include/apr-1.0 -pthread -Wall -Wsign-compare -Wformat-security -fstack-protector -fPIC -g1 -O0 -Wno-unused-local-typedefs -std=c++11 -MT slave/containerizer/mesos/isolators/volume/libmesos_no_3rdparty_la-image.lo -MD -MP -MF slave/containerizer/mesos/isolators/volume/.deps/libmesos_no_3rdparty_la-image.Tpo -c ../../src/slave/containerizer/mesos/isolators/volume/image.cpp  -fPIC -DPIC -o slave/containerizer/mesos/isolators/volume/.libs/libmesos_no_3rdparty_la-image.o
../../src/slave/containerizer/mesos/isolators/network/cni/cni.cpp: In member function 'process::Future<Nothing> mesos::internal::slave::NetworkCniIsolatorProcess::_isolate(const mesos::ContainerID&, pid_t, const std::list<process::Future<Nothing> >&)':
../../src/slave/containerizer/mesos/isolators/network/cni/cni.cpp:1000:15: error: cannot bind 'std::basic_ostream<char>' lvalue to 'std::basic_ostream<char>&&'
               << " are " << dns.nameservers();
               ^
In file included from /usr/include/c++/4.8/iostream:39:0,
                 from ../../src/slave/containerizer/mesos/isolators/network/cni/cni.cpp:17:
/usr/include/c++/4.8/ostream:602:5: error:   initializing argument 1 of 'std::basic_ostream<_CharT, _Traits>& std::operator<<(std::basic_ostream<_CharT, _Traits>&&, const _Tp&) [with _CharT = char; _Traits = std::char_traits<char>; _Tp = google::protobuf::RepeatedPtrField<std::basic_string<char> >]'
     operator<<(basic_ostream<_CharT, _Traits>&& __os, const _Tp& __x)
     ^
mv -f slave/containerizer/mesos/isolators/filesystem/.deps/libmesos_no_3rdparty_la-shared.Tpo slave/containerizer/mesos/isolators/filesystem/.deps/libmesos_no_3rdparty_la-shared.Plo
/bin/bash ../libtool  --tag=CXX   --mode=compile g++ -DPACKAGE_NAME=\"mesos\" -DPACKAGE_TARNAME=\"mesos\" -DPACKAGE_VERSION=\"1.3.0\" -DPACKAGE_STRING=\"mesos\ 1.3.0\" -DPACKAGE_BUGREPORT=\"\" -DPACKAGE_URL=\"\" -DPACKAGE=\"mesos\" -DVERSION=\"1.3.0\" -DSTDC_HEADERS=1 -DHAVE_SYS_TYPES_H=1 -DHAVE_SYS_STAT_H=1 -DHAVE_STDLIB_H=1 -DHAVE_STRING_H=1 -DHAVE_MEMORY_H=1 -DHAVE_STRINGS_H=1 -DHAVE_INTTYPES_H=1 -DHAVE_STDINT_H=1 -DHAVE_UNISTD_H=1 -DHAVE_DLFCN_H=1 -DLT_OBJDIR=\".libs/\" -DHAVE_CXX11=1 -DHAVE_PTHREAD_PRIO_INHERIT=1 -DHAVE_PTHREAD=1 -DHAVE_LIBZ=1 -DHAVE_FTS_H=1 -DHAVE_APR_POOLS_H=1 -DHAVE_LIBAPR_1=1 -DHAVE_LIBCURL=1 -DMESOS_HAS_JAVA=1 -DHAVE_LIBSASL2=1 -DHAVE_SVN_VERSION_H=1 -DHAVE_LIBSVN_SUBR_1=1 -DHAVE_SVN_DELTA_H=1 -DHAVE_LIBSVN_DELTA_1=1 -DHAVE_LIBZ=1 -DHAVE_PYTHON=\"2.7\" -DMESOS_HAS_PYTHON=1 -I. -I../../src   -Werror -DLIBDIR=\"/mesos/mesos-1.3.0/_inst/lib\" -DPKGLIBEXECDIR=\"/mesos/mesos-1.3.0/_inst/libexec/mesos\" -DPKGDATADIR=\"/mesos/mesos-1.3.0/_inst/share/mesos\" -DPKGMODULEDIR=\"/mesos/mesos-1.3.0/_inst/lib/mesos/modules\" -I../../include -I../include -I../include/mesos -DPICOJSON_USE_INT64 -D__STDC_FORMAT_MACROS -isystem ../3rdparty/boost-1.53.0 -I../3rdparty/elfio-3.2 -I../3rdparty/glog-0.3.3/src -I../3rdparty/leveldb-1.19/include -I../../3rdparty/libprocess/include -I../3rdparty/nvml-352.79 -I../3rdparty/picojson-1.3.0 -I../3rdparty/protobuf-2.6.1/src -I../../3rdparty/stout/include -I../3rdparty/zookeeper-3.4.8/src/c/include -I../3rdparty/zookeeper-3.4.8/src/c/generated -DHAS_AUTHENTICATION=1 -I/usr/include/subversion-1 -I/usr/include/apr-1 -I/usr/include/apr-1.0  -pthread -Wall -Wsign-compare -Wformat-security -fstack-protector -fPIC -fPIE -g1 -O0 -Wno-unused-local-typedefs -std=c++11 -MT slave/containerizer/mesos/provisioner/backends/libmesos_no_3rdparty_la-aufs.lo -MD -MP -MF slave/containerizer/mesos/provisioner/backends/.deps/libmesos_no_3rdparty_la-aufs.Tpo -c -o slave/containerizer/mesos/provisioner/backends/libmesos_no_3rdparty_la-aufs.lo `test -f 'slave/containerizer/mesos/provisioner/backends/aufs.cpp' || echo '../../src/'`slave/containerizer/mesos/provisioner/backends/aufs.cpp
libtool: compile:  g++ -DPACKAGE_NAME=\"mesos\" -DPACKAGE_TARNAME=\"mesos\" -DPACKAGE_VERSION=\"1.3.0\" "-DPACKAGE_STRING=\"mesos 1.3.0\"" -DPACKAGE_BUGREPORT=\"\" -DPACKAGE_URL=\"\" -DPACKAGE=\"mesos\" -DVERSION=\"1.3.0\" -DSTDC_HEADERS=1 -DHAVE_SYS_TYPES_H=1 -DHAVE_SYS_STAT_H=1 -DHAVE_STDLIB_H=1 -DHAVE_STRING_H=1 -DHAVE_MEMORY_H=1 -DHAVE_STRINGS_H=1 -DHAVE_INTTYPES_H=1 -DHAVE_STDINT_H=1 -DHAVE_UNISTD_H=1 -DHAVE_DLFCN_H=1 -DLT_OBJDIR=\".libs/\" -DHAVE_CXX11=1 -DHAVE_PTHREAD_PRIO_INHERIT=1 -DHAVE_PTHREAD=1 -DHAVE_LIBZ=1 -DHAVE_FTS_H=1 -DHAVE_APR_POOLS_H=1 -DHAVE_LIBAPR_1=1 -DHAVE_LIBCURL=1 -DMESOS_HAS_JAVA=1 -DHAVE_LIBSASL2=1 -DHAVE_SVN_VERSION_H=1 -DHAVE_LIBSVN_SUBR_1=1 -DHAVE_SVN_DELTA_H=1 -DHAVE_LIBSVN_DELTA_1=1 -DHAVE_LIBZ=1 -DHAVE_PYTHON=\"2.7\" -DMESOS_HAS_PYTHON=1 -I. -I../../src -Werror -DLIBDIR=\"/mesos/mesos-1.3.0/_inst/lib\" -DPKGLIBEXECDIR=\"/mesos/mesos-1.3.0/_inst/libexec/mesos\" -DPKGDATADIR=\"/mesos/mesos-1.3.0/_inst/share/mesos\" -DPKGMODULEDIR=\"/mesos/mesos-1.3.0/_inst/lib/mesos/modules\" -I../../include -I../include -I../include/mesos -DPICOJSON_USE_INT64 -D__STDC_FORMAT_MACROS -isystem ../3rdparty/boost-1.53.0 -I../3rdparty/elfio-3.2 -I../3rdparty/glog-0.3.3/src -I../3rdparty/leveldb-1.19/include -I../../3rdparty/libprocess/include -I../3rdparty/nvml-352.79 -I../3rdparty/picojson-1.3.0 -I../3rdparty/protobuf-2.6.1/src -I../../3rdparty/stout/include -I../3rdparty/zookeeper-3.4.8/src/c/include -I../3rdparty/zookeeper-3.4.8/src/c/generated -DHAS_AUTHENTICATION=1 -I/usr/include/subversion-1 -I/usr/include/apr-1 -I/usr/include/apr-1.0 -pthread -Wall -Wsign-compare -Wformat-security -fstack-protector -fPIC -g1 -O0 -Wno-unused-local-typedefs -std=c++11 -MT slave/containerizer/mesos/provisioner/backends/libmesos_no_3rdparty_la-aufs.lo -MD -MP -MF slave/containerizer/mesos/provisioner/backends/.deps/libmesos_no_3rdparty_la-aufs.Tpo -c ../../src/slave/containerizer/mesos/provisioner/backends/aufs.cpp  -fPIC -DPIC -o slave/containerizer/mesos/provisioner/backends/.libs/libmesos_no_3rdparty_la-aufs.o
make[3]: *** [slave/containerizer/mesos/isolators/network/cni/libmesos_no_3rdparty_la-cni.lo] Error 1
make[3]: *** Waiting for unfinished jobs....
mv -f slave/containerizer/mesos/isolators/volume/.deps/libmesos_no_3rdparty_la-image.Tpo slave/containerizer/mesos/isolators/volume/.deps/libmesos_no_3rdparty_la-image.Plo
mv -f slave/containerizer/mesos/.deps/libmesos_no_3rdparty_la-linux_launcher.Tpo slave/containerizer/mesos/.deps/libmesos_no_3rdparty_la-linux_launcher.Plo
mv -f slave/containerizer/mesos/isolators/filesystem/.deps/libmesos_no_3rdparty_la-linux.Tpo slave/containerizer/mesos/isolators/filesystem/.deps/libmesos_no_3rdparty_la-linux.Plo
mv -f slave/containerizer/mesos/isolators/docker/volume/.deps/libmesos_no_3rdparty_la-isolator.Tpo slave/containerizer/mesos/isolators/docker/volume/.deps/libmesos_no_3rdparty_la-isolator.Plo
mv -f slave/containerizer/mesos/provisioner/backends/.deps/libmesos_no_3rdparty_la-aufs.Tpo slave/containerizer/mesos/provisioner/backends/.deps/libmesos_no_3rdparty_la-aufs.Plo
make[3]: Leaving directory `/mesos/mesos-1.3.0/_build/src'
make[2]: *** [all] Error 2
make[2]: Leaving directory `/mesos/mesos-1.3.0/_build/src'
make[1]: *** [all-recursive] Error 1
make[1]: Leaving directory `/mesos/mesos-1.3.0/_build'
make: *** [distcheck] Error 1
+ docker rmi mesos-1489631472-19365
Untagged: mesos-1489631472-19365:latest
Deleted: sha256:243d29b27a69f0dd0a32a004bcc661d2caec246de3e650b47af48854ba65fee0
Deleted: sha256:077be06c14276f4056b190095360acbe870d61494cc8068c663fac569e5bff56
Deleted: sha256:2037d84034f1de41dc3570a98b1d3f609a1579c51a397cb085441a91b50f614f
Deleted: sha256:c8368e01e010f02a442e1c60e72a271a32e7bb1e83dad0d44942ad8871fdbd04
Deleted: sha256:a054541deede870e83a74bb4d9766db2c7134b816bd385eb3f1dcd9afd4ffa08
Deleted: sha256:240527308f988f139dffc17c8d21335364212ad6bf9a61409aef9f6fe1cb4167
Deleted: sha256:c5d9cb87cb8c9430929e37c97856e5e4f4fb40076c5ac9811ead75a12910d289
Deleted: sha256:7c9763a10b6a0e21794dd2ac87f14633bea160ac198b7facd9fe01a6ea4056ea
Deleted: sha256:596fe70344b748ec9939e446d6b6123c88f7cae4cfb07d378aacfb38e7e31c99
Deleted: sha256:df8511f071839f65b1b814293f141306b2ddb193abbe17e9cc0f24f3fa90b36e
Deleted: sha256:a417b64ebaabeabcb631c3e7751bf1987328eec50ea64f6256b2a81215d13485
Deleted: sha256:aa5f2519445c16b4c2d215d0f41345b759a0d64429826c691f922a873a0016b7
Deleted: sha256:e237cdbc5bcc4a64b98e2bda7bbdb801035f793a0b57eb7914d303b0585522c6
Deleted: sha256:9223c5c2e735bdeb1960a0e0debcfdfca7f0c75bb8c395d52eb8eeef926dad0e
Deleted: sha256:a874e3c74281a7af4294a1291db9163d61a59f1d6e9b719ef9139e93a8527718
Deleted: sha256:27e2fc43b6b0c1fe21d3ec40548c73984a00f0cc606f106e11647209dcbd613b
Deleted: sha256:b57e07060898d6dec45823485fa6bf99731bdaa0a78cd2bfc3988d42dc8e5944
Deleted: sha256:c0f9ea1f7ce74110f26f7ce496a7f5bd188d649830e98517c1aea5de6fd7818f
Deleted: sha256:a4d094d051d075f02a79bbdc4cbca51fa96d745ad8c9b32f6686d033c7d7f75c
Deleted: sha256:2b47f7ee7db1299c4b83c05d34812797288ef0a343a83e14dce51351433b0db1
Deleted: sha256:b34f04c64ddbf71cac33a4ba153e4c15faf7a3c8883e168a492f3471fa28f1fd
Deleted: sha256:86a2fd84e6c90f9664c667deac317c76f917e1178176e7f489562bbc59cccff7
Deleted: sha256:e73697116db3fedd107d45e0e4a9d3ae2ea57cd8e1a22246eb65754529b7d559
Deleted: sha256:8f70d1d7cf3b9d71e2ce81aa6c9b0a8deb42556a91c6e0a0bc88e9d2d03bf4f4
Build step 'Execute shell' marked build as failure

Mime
View raw message