mesos-builds mailing list archives

Site index · List index
Message view « Date » · « Thread »
Top « Date » · « Thread »
From Apache Jenkins Server <jenk...@builds.apache.org>
Subject Build failed in Jenkins: Mesos-Buildbot » cmake,gcc,--verbose --enable-libevent --enable-ssl,GLOG_v=1 MESOS_VERBOSE=1,ubuntu:14.04,(docker||Hadoop)&&(!ubuntu-us1)&&(!ubuntu-eu2) #3331
Date Thu, 02 Mar 2017 00:32:41 GMT
See <https://builds.apache.org/job/Mesos-Buildbot/BUILDTOOL=cmake,COMPILER=gcc,CONFIGURATION=--verbose%20--enable-libevent%20--enable-ssl,ENVIRONMENT=GLOG_v=1%20MESOS_VERBOSE=1,OS=ubuntu%3A14.04,label_exp=(docker%7C%7CHadoop)&&(!ubuntu-us1)&&(!ubuntu-eu2)/3331/display/redirect?page=changes>

Changes:

[josephwu] CMake: Add `build_config.hpp.in` for `BUILD_TIME` variables.

------------------------------------------
[...truncated 875.35 KB...]
cd /mesos/build/src && /usr/bin/g++   -DBUILD_FLAGS=\"\" -DBUILD_JAVA_JVM_LIBRARY=\"\" -DHAS_AUTHENTICATION=1 -DLIBDIR=\"/usr/local/libmesos\" -DPICOJSON_USE_INT64 -DPKGDATADIR=\"/usr/local/share/mesos\" -DPKGLIBEXECDIR=\"/usr/local/libexec/mesos\" -DUSE_CMAKE_BUILD_CONFIG -DUSE_STATIC_LIB -DVERSION=\"1.3.0\" -D__STDC_FORMAT_MACROS -Dmesos_1_3_0_EXPORTS -O2 -std=c++11 -g -fPIC -I/mesos/build/include -I/mesos/build/include/mesos -I/mesos/build/src -I/mesos/src -isystem /mesos/build/3rdparty/protobuf-2.6.1/src/protobuf-2.6.1-lib/lib/include -isystem /mesos/3rdparty/libprocess/include -isystem /usr/include/apr-1.0 -isystem /mesos/build/3rdparty/boost-1.53.0/src/boost-1.53.0 -isystem /mesos/build/3rdparty/elfio-3.2/src/elfio-3.2 -isystem /mesos/build/3rdparty/glog-0.3.3/src/glog-0.3.3-lib/lib/include -isystem /mesos/build/3rdparty/nvml-352.79/src/nvml-352.79 -isystem /mesos/build/3rdparty/picojson-1.3.0/src/picojson-1.3.0 -isystem /usr/include/subversion-1 -isystem /mesos/3rdparty/stout/include -isystem /mesos/build/3rdparty/http_parser-2.6.2/src/http_parser-2.6.2 -isystem /mesos/build/3rdparty/libevent-2.1.5-beta/src/libevent-2.1.5-beta-lib/lib/include -isystem /mesos/build/3rdparty/zookeeper-3.4.8/src/zookeeper-3.4.8/src/c/include -isystem /mesos/build/3rdparty/zookeeper-3.4.8/src/zookeeper-3.4.8/src/c/generated -isystem /mesos/build/3rdparty/leveldb-1.19/src/leveldb-1.19/include -I/mesos/include    -o CMakeFiles/mesos-1.3.0.dir/slave/status_update_manager.cpp.o -c /mesos/src/slave/status_update_manager.cpp
/usr/bin/cmake -E cmake_progress_report /mesos/build/CMakeFiles 
[ 40%] Building CXX object src/CMakeFiles/mesos-1.3.0.dir/slave/validation.cpp.o
cd /mesos/build/src && /usr/bin/g++   -DBUILD_FLAGS=\"\" -DBUILD_JAVA_JVM_LIBRARY=\"\" -DHAS_AUTHENTICATION=1 -DLIBDIR=\"/usr/local/libmesos\" -DPICOJSON_USE_INT64 -DPKGDATADIR=\"/usr/local/share/mesos\" -DPKGLIBEXECDIR=\"/usr/local/libexec/mesos\" -DUSE_CMAKE_BUILD_CONFIG -DUSE_STATIC_LIB -DVERSION=\"1.3.0\" -D__STDC_FORMAT_MACROS -Dmesos_1_3_0_EXPORTS -O2 -std=c++11 -g -fPIC -I/mesos/build/include -I/mesos/build/include/mesos -I/mesos/build/src -I/mesos/src -isystem /mesos/build/3rdparty/protobuf-2.6.1/src/protobuf-2.6.1-lib/lib/include -isystem /mesos/3rdparty/libprocess/include -isystem /usr/include/apr-1.0 -isystem /mesos/build/3rdparty/boost-1.53.0/src/boost-1.53.0 -isystem /mesos/build/3rdparty/elfio-3.2/src/elfio-3.2 -isystem /mesos/build/3rdparty/glog-0.3.3/src/glog-0.3.3-lib/lib/include -isystem /mesos/build/3rdparty/nvml-352.79/src/nvml-352.79 -isystem /mesos/build/3rdparty/picojson-1.3.0/src/picojson-1.3.0 -isystem /usr/include/subversion-1 -isystem /mesos/3rdparty/stout/include -isystem /mesos/build/3rdparty/http_parser-2.6.2/src/http_parser-2.6.2 -isystem /mesos/build/3rdparty/libevent-2.1.5-beta/src/libevent-2.1.5-beta-lib/lib/include -isystem /mesos/build/3rdparty/zookeeper-3.4.8/src/zookeeper-3.4.8/src/c/include -isystem /mesos/build/3rdparty/zookeeper-3.4.8/src/zookeeper-3.4.8/src/c/generated -isystem /mesos/build/3rdparty/leveldb-1.19/src/leveldb-1.19/include -I/mesos/include    -o CMakeFiles/mesos-1.3.0.dir/slave/validation.cpp.o -c /mesos/src/slave/validation.cpp
/usr/bin/cmake -E cmake_progress_report /mesos/build/CMakeFiles 
[ 40%] Building CXX object src/CMakeFiles/mesos-1.3.0.dir/slave/container_loggers/sandbox.cpp.o
cd /mesos/build/src && /usr/bin/g++   -DBUILD_FLAGS=\"\" -DBUILD_JAVA_JVM_LIBRARY=\"\" -DHAS_AUTHENTICATION=1 -DLIBDIR=\"/usr/local/libmesos\" -DPICOJSON_USE_INT64 -DPKGDATADIR=\"/usr/local/share/mesos\" -DPKGLIBEXECDIR=\"/usr/local/libexec/mesos\" -DUSE_CMAKE_BUILD_CONFIG -DUSE_STATIC_LIB -DVERSION=\"1.3.0\" -D__STDC_FORMAT_MACROS -Dmesos_1_3_0_EXPORTS -O2 -std=c++11 -g -fPIC -I/mesos/build/include -I/mesos/build/include/mesos -I/mesos/build/src -I/mesos/src -isystem /mesos/build/3rdparty/protobuf-2.6.1/src/protobuf-2.6.1-lib/lib/include -isystem /mesos/3rdparty/libprocess/include -isystem /usr/include/apr-1.0 -isystem /mesos/build/3rdparty/boost-1.53.0/src/boost-1.53.0 -isystem /mesos/build/3rdparty/elfio-3.2/src/elfio-3.2 -isystem /mesos/build/3rdparty/glog-0.3.3/src/glog-0.3.3-lib/lib/include -isystem /mesos/build/3rdparty/nvml-352.79/src/nvml-352.79 -isystem /mesos/build/3rdparty/picojson-1.3.0/src/picojson-1.3.0 -isystem /usr/include/subversion-1 -isystem /mesos/3rdparty/stout/include -isystem /mesos/build/3rdparty/http_parser-2.6.2/src/http_parser-2.6.2 -isystem /mesos/build/3rdparty/libevent-2.1.5-beta/src/libevent-2.1.5-beta-lib/lib/include -isystem /mesos/build/3rdparty/zookeeper-3.4.8/src/zookeeper-3.4.8/src/c/include -isystem /mesos/build/3rdparty/zookeeper-3.4.8/src/zookeeper-3.4.8/src/c/generated -isystem /mesos/build/3rdparty/leveldb-1.19/src/leveldb-1.19/include -I/mesos/include    -o CMakeFiles/mesos-1.3.0.dir/slave/container_loggers/sandbox.cpp.o -c /mesos/src/slave/container_loggers/sandbox.cpp
/usr/bin/cmake -E cmake_progress_report /mesos/build/CMakeFiles 17
[ 41%] Building CXX object src/CMakeFiles/mesos-1.3.0.dir/slave/containerizer/composing.cpp.o
cd /mesos/build/src && /usr/bin/g++   -DBUILD_FLAGS=\"\" -DBUILD_JAVA_JVM_LIBRARY=\"\" -DHAS_AUTHENTICATION=1 -DLIBDIR=\"/usr/local/libmesos\" -DPICOJSON_USE_INT64 -DPKGDATADIR=\"/usr/local/share/mesos\" -DPKGLIBEXECDIR=\"/usr/local/libexec/mesos\" -DUSE_CMAKE_BUILD_CONFIG -DUSE_STATIC_LIB -DVERSION=\"1.3.0\" -D__STDC_FORMAT_MACROS -Dmesos_1_3_0_EXPORTS -O2 -std=c++11 -g -fPIC -I/mesos/build/include -I/mesos/build/include/mesos -I/mesos/build/src -I/mesos/src -isystem /mesos/build/3rdparty/protobuf-2.6.1/src/protobuf-2.6.1-lib/lib/include -isystem /mesos/3rdparty/libprocess/include -isystem /usr/include/apr-1.0 -isystem /mesos/build/3rdparty/boost-1.53.0/src/boost-1.53.0 -isystem /mesos/build/3rdparty/elfio-3.2/src/elfio-3.2 -isystem /mesos/build/3rdparty/glog-0.3.3/src/glog-0.3.3-lib/lib/include -isystem /mesos/build/3rdparty/nvml-352.79/src/nvml-352.79 -isystem /mesos/build/3rdparty/picojson-1.3.0/src/picojson-1.3.0 -isystem /usr/include/subversion-1 -isystem /mesos/3rdparty/stout/include -isystem /mesos/build/3rdparty/http_parser-2.6.2/src/http_parser-2.6.2 -isystem /mesos/build/3rdparty/libevent-2.1.5-beta/src/libevent-2.1.5-beta-lib/lib/include -isystem /mesos/build/3rdparty/zookeeper-3.4.8/src/zookeeper-3.4.8/src/c/include -isystem /mesos/build/3rdparty/zookeeper-3.4.8/src/zookeeper-3.4.8/src/c/generated -isystem /mesos/build/3rdparty/leveldb-1.19/src/leveldb-1.19/include -I/mesos/include    -o CMakeFiles/mesos-1.3.0.dir/slave/containerizer/composing.cpp.o -c /mesos/src/slave/containerizer/composing.cpp
/usr/bin/cmake -E cmake_progress_report /mesos/build/CMakeFiles 11
[ 42%] Building CXX object 3rdparty/libprocess/src/tests/CMakeFiles/libprocess-tests.dir/http_tests.cpp.o
cd /mesos/build/3rdparty/libprocess/src/tests && /usr/bin/g++   -DBUILD_DIR=\"/mesos/build/3rdparty/libprocess/src/tests\" -DBUILD_FLAGS=\"\" -DBUILD_JAVA_JVM_LIBRARY=\"\" -DHAS_AUTHENTICATION=1 -DLIBDIR=\"/usr/local/libmesos\" -DPICOJSON_USE_INT64 -DPKGDATADIR=\"/usr/local/share/mesos\" -DPKGLIBEXECDIR=\"/usr/local/libexec/mesos\" -DUSE_CMAKE_BUILD_CONFIG -DUSE_STATIC_LIB -DVERSION=\"1.3.0\" -D__STDC_FORMAT_MACROS -O2 -std=c++11 -g -fPIE -I/usr/include/apr-1.0 -I/mesos/build/3rdparty/boost-1.53.0/src/boost-1.53.0 -I/mesos/build/3rdparty/elfio-3.2/src/elfio-3.2 -I/mesos/build/3rdparty/glog-0.3.3/src/glog-0.3.3-lib/lib/include -I/mesos/build/3rdparty/nvml-352.79/src/nvml-352.79 -I/mesos/build/3rdparty/picojson-1.3.0/src/picojson-1.3.0 -I/mesos/build/3rdparty/protobuf-2.6.1/src/protobuf-2.6.1-lib/lib/include -I/usr/include/subversion-1 -I/mesos/3rdparty/stout/include -I/mesos/build/3rdparty/http_parser-2.6.2/src/http_parser-2.6.2 -I/mesos/build/3rdparty/libevent-2.1.5-beta/src/libevent-2.1.5-beta-lib/lib/include -I/mesos/build/3rdparty/gmock-1.7.0/src/gmock-1.7.0/include -I/mesos/build/3rdparty/gmock-1.7.0/src/gmock-1.7.0/gtest/include -I/mesos/3rdparty/libprocess/src/tests/src -I/mesos/3rdparty/libprocess/include -I/mesos/3rdparty/libprocess/src/tests/..    -o CMakeFiles/libprocess-tests.dir/http_tests.cpp.o -c /mesos/3rdparty/libprocess/src/tests/http_tests.cpp
/usr/bin/cmake -E cmake_progress_report /mesos/build/CMakeFiles 
[ 42%] Building CXX object src/CMakeFiles/mesos-1.3.0.dir/slave/containerizer/containerizer.cpp.o
cd /mesos/build/src && /usr/bin/g++   -DBUILD_FLAGS=\"\" -DBUILD_JAVA_JVM_LIBRARY=\"\" -DHAS_AUTHENTICATION=1 -DLIBDIR=\"/usr/local/libmesos\" -DPICOJSON_USE_INT64 -DPKGDATADIR=\"/usr/local/share/mesos\" -DPKGLIBEXECDIR=\"/usr/local/libexec/mesos\" -DUSE_CMAKE_BUILD_CONFIG -DUSE_STATIC_LIB -DVERSION=\"1.3.0\" -D__STDC_FORMAT_MACROS -Dmesos_1_3_0_EXPORTS -O2 -std=c++11 -g -fPIC -I/mesos/build/include -I/mesos/build/include/mesos -I/mesos/build/src -I/mesos/src -isystem /mesos/build/3rdparty/protobuf-2.6.1/src/protobuf-2.6.1-lib/lib/include -isystem /mesos/3rdparty/libprocess/include -isystem /usr/include/apr-1.0 -isystem /mesos/build/3rdparty/boost-1.53.0/src/boost-1.53.0 -isystem /mesos/build/3rdparty/elfio-3.2/src/elfio-3.2 -isystem /mesos/build/3rdparty/glog-0.3.3/src/glog-0.3.3-lib/lib/include -isystem /mesos/build/3rdparty/nvml-352.79/src/nvml-352.79 -isystem /mesos/build/3rdparty/picojson-1.3.0/src/picojson-1.3.0 -isystem /usr/include/subversion-1 -isystem /mesos/3rdparty/stout/include -isystem /mesos/build/3rdparty/http_parser-2.6.2/src/http_parser-2.6.2 -isystem /mesos/build/3rdparty/libevent-2.1.5-beta/src/libevent-2.1.5-beta-lib/lib/include -isystem /mesos/build/3rdparty/zookeeper-3.4.8/src/zookeeper-3.4.8/src/c/include -isystem /mesos/build/3rdparty/zookeeper-3.4.8/src/zookeeper-3.4.8/src/c/generated -isystem /mesos/build/3rdparty/leveldb-1.19/src/leveldb-1.19/include -I/mesos/include    -o CMakeFiles/mesos-1.3.0.dir/slave/containerizer/containerizer.cpp.o -c /mesos/src/slave/containerizer/containerizer.cpp
/usr/bin/cmake -E cmake_progress_report /mesos/build/CMakeFiles 
[ 42%] Building CXX object src/CMakeFiles/mesos-1.3.0.dir/slave/containerizer/docker.cpp.o
cd /mesos/build/src && /usr/bin/g++   -DBUILD_FLAGS=\"\" -DBUILD_JAVA_JVM_LIBRARY=\"\" -DHAS_AUTHENTICATION=1 -DLIBDIR=\"/usr/local/libmesos\" -DPICOJSON_USE_INT64 -DPKGDATADIR=\"/usr/local/share/mesos\" -DPKGLIBEXECDIR=\"/usr/local/libexec/mesos\" -DUSE_CMAKE_BUILD_CONFIG -DUSE_STATIC_LIB -DVERSION=\"1.3.0\" -D__STDC_FORMAT_MACROS -Dmesos_1_3_0_EXPORTS -O2 -std=c++11 -g -fPIC -I/mesos/build/include -I/mesos/build/include/mesos -I/mesos/build/src -I/mesos/src -isystem /mesos/build/3rdparty/protobuf-2.6.1/src/protobuf-2.6.1-lib/lib/include -isystem /mesos/3rdparty/libprocess/include -isystem /usr/include/apr-1.0 -isystem /mesos/build/3rdparty/boost-1.53.0/src/boost-1.53.0 -isystem /mesos/build/3rdparty/elfio-3.2/src/elfio-3.2 -isystem /mesos/build/3rdparty/glog-0.3.3/src/glog-0.3.3-lib/lib/include -isystem /mesos/build/3rdparty/nvml-352.79/src/nvml-352.79 -isystem /mesos/build/3rdparty/picojson-1.3.0/src/picojson-1.3.0 -isystem /usr/include/subversion-1 -isystem /mesos/3rdparty/stout/include -isystem /mesos/build/3rdparty/http_parser-2.6.2/src/http_parser-2.6.2 -isystem /mesos/build/3rdparty/libevent-2.1.5-beta/src/libevent-2.1.5-beta-lib/lib/include -isystem /mesos/build/3rdparty/zookeeper-3.4.8/src/zookeeper-3.4.8/src/c/include -isystem /mesos/build/3rdparty/zookeeper-3.4.8/src/zookeeper-3.4.8/src/c/generated -isystem /mesos/build/3rdparty/leveldb-1.19/src/leveldb-1.19/include -I/mesos/include    -o CMakeFiles/mesos-1.3.0.dir/slave/containerizer/docker.cpp.o -c /mesos/src/slave/containerizer/docker.cpp
/usr/bin/cmake -E cmake_progress_report /mesos/build/CMakeFiles 
[ 42%] Building CXX object src/CMakeFiles/mesos-1.3.0.dir/slave/containerizer/fetcher.cpp.o
cd /mesos/build/src && /usr/bin/g++   -DBUILD_FLAGS=\"\" -DBUILD_JAVA_JVM_LIBRARY=\"\" -DHAS_AUTHENTICATION=1 -DLIBDIR=\"/usr/local/libmesos\" -DPICOJSON_USE_INT64 -DPKGDATADIR=\"/usr/local/share/mesos\" -DPKGLIBEXECDIR=\"/usr/local/libexec/mesos\" -DUSE_CMAKE_BUILD_CONFIG -DUSE_STATIC_LIB -DVERSION=\"1.3.0\" -D__STDC_FORMAT_MACROS -Dmesos_1_3_0_EXPORTS -O2 -std=c++11 -g -fPIC -I/mesos/build/include -I/mesos/build/include/mesos -I/mesos/build/src -I/mesos/src -isystem /mesos/build/3rdparty/protobuf-2.6.1/src/protobuf-2.6.1-lib/lib/include -isystem /mesos/3rdparty/libprocess/include -isystem /usr/include/apr-1.0 -isystem /mesos/build/3rdparty/boost-1.53.0/src/boost-1.53.0 -isystem /mesos/build/3rdparty/elfio-3.2/src/elfio-3.2 -isystem /mesos/build/3rdparty/glog-0.3.3/src/glog-0.3.3-lib/lib/include -isystem /mesos/build/3rdparty/nvml-352.79/src/nvml-352.79 -isystem /mesos/build/3rdparty/picojson-1.3.0/src/picojson-1.3.0 -isystem /usr/include/subversion-1 -isystem /mesos/3rdparty/stout/include -isystem /mesos/build/3rdparty/http_parser-2.6.2/src/http_parser-2.6.2 -isystem /mesos/build/3rdparty/libevent-2.1.5-beta/src/libevent-2.1.5-beta-lib/lib/include -isystem /mesos/build/3rdparty/zookeeper-3.4.8/src/zookeeper-3.4.8/src/c/include -isystem /mesos/build/3rdparty/zookeeper-3.4.8/src/zookeeper-3.4.8/src/c/generated -isystem /mesos/build/3rdparty/leveldb-1.19/src/leveldb-1.19/include -I/mesos/include    -o CMakeFiles/mesos-1.3.0.dir/slave/containerizer/fetcher.cpp.o -c /mesos/src/slave/containerizer/fetcher.cpp
/usr/bin/cmake -E cmake_progress_report /mesos/build/CMakeFiles 
[ 42%] Building CXX object src/CMakeFiles/mesos-1.3.0.dir/slave/containerizer/mesos/containerizer.cpp.o
cd /mesos/build/src && /usr/bin/g++   -DBUILD_FLAGS=\"\" -DBUILD_JAVA_JVM_LIBRARY=\"\" -DHAS_AUTHENTICATION=1 -DLIBDIR=\"/usr/local/libmesos\" -DPICOJSON_USE_INT64 -DPKGDATADIR=\"/usr/local/share/mesos\" -DPKGLIBEXECDIR=\"/usr/local/libexec/mesos\" -DUSE_CMAKE_BUILD_CONFIG -DUSE_STATIC_LIB -DVERSION=\"1.3.0\" -D__STDC_FORMAT_MACROS -Dmesos_1_3_0_EXPORTS -O2 -std=c++11 -g -fPIC -I/mesos/build/include -I/mesos/build/include/mesos -I/mesos/build/src -I/mesos/src -isystem /mesos/build/3rdparty/protobuf-2.6.1/src/protobuf-2.6.1-lib/lib/include -isystem /mesos/3rdparty/libprocess/include -isystem /usr/include/apr-1.0 -isystem /mesos/build/3rdparty/boost-1.53.0/src/boost-1.53.0 -isystem /mesos/build/3rdparty/elfio-3.2/src/elfio-3.2 -isystem /mesos/build/3rdparty/glog-0.3.3/src/glog-0.3.3-lib/lib/include -isystem /mesos/build/3rdparty/nvml-352.79/src/nvml-352.79 -isystem /mesos/build/3rdparty/picojson-1.3.0/src/picojson-1.3.0 -isystem /usr/include/subversion-1 -isystem /mesos/3rdparty/stout/include -isystem /mesos/build/3rdparty/http_parser-2.6.2/src/http_parser-2.6.2 -isystem /mesos/build/3rdparty/libevent-2.1.5-beta/src/libevent-2.1.5-beta-lib/lib/include -isystem /mesos/build/3rdparty/zookeeper-3.4.8/src/zookeeper-3.4.8/src/c/include -isystem /mesos/build/3rdparty/zookeeper-3.4.8/src/zookeeper-3.4.8/src/c/generated -isystem /mesos/build/3rdparty/leveldb-1.19/src/leveldb-1.19/include -I/mesos/include    -o CMakeFiles/mesos-1.3.0.dir/slave/containerizer/mesos/containerizer.cpp.o -c /mesos/src/slave/containerizer/mesos/containerizer.cpp
/usr/bin/cmake -E cmake_progress_report /mesos/build/CMakeFiles 
[ 42%] Building CXX object 3rdparty/libprocess/src/tests/CMakeFiles/libprocess-tests.dir/limiter_tests.cpp.o
cd /mesos/build/3rdparty/libprocess/src/tests && /usr/bin/g++   -DBUILD_DIR=\"/mesos/build/3rdparty/libprocess/src/tests\" -DBUILD_FLAGS=\"\" -DBUILD_JAVA_JVM_LIBRARY=\"\" -DHAS_AUTHENTICATION=1 -DLIBDIR=\"/usr/local/libmesos\" -DPICOJSON_USE_INT64 -DPKGDATADIR=\"/usr/local/share/mesos\" -DPKGLIBEXECDIR=\"/usr/local/libexec/mesos\" -DUSE_CMAKE_BUILD_CONFIG -DUSE_STATIC_LIB -DVERSION=\"1.3.0\" -D__STDC_FORMAT_MACROS -O2 -std=c++11 -g -fPIE -I/usr/include/apr-1.0 -I/mesos/build/3rdparty/boost-1.53.0/src/boost-1.53.0 -I/mesos/build/3rdparty/elfio-3.2/src/elfio-3.2 -I/mesos/build/3rdparty/glog-0.3.3/src/glog-0.3.3-lib/lib/include -I/mesos/build/3rdparty/nvml-352.79/src/nvml-352.79 -I/mesos/build/3rdparty/picojson-1.3.0/src/picojson-1.3.0 -I/mesos/build/3rdparty/protobuf-2.6.1/src/protobuf-2.6.1-lib/lib/include -I/usr/include/subversion-1 -I/mesos/3rdparty/stout/include -I/mesos/build/3rdparty/http_parser-2.6.2/src/http_parser-2.6.2 -I/mesos/build/3rdparty/libevent-2.1.5-beta/src/libevent-2.1.5-beta-lib/lib/include -I/mesos/build/3rdparty/gmock-1.7.0/src/gmock-1.7.0/include -I/mesos/build/3rdparty/gmock-1.7.0/src/gmock-1.7.0/gtest/include -I/mesos/3rdparty/libprocess/src/tests/src -I/mesos/3rdparty/libprocess/include -I/mesos/3rdparty/libprocess/src/tests/..    -o CMakeFiles/libprocess-tests.dir/limiter_tests.cpp.o -c /mesos/3rdparty/libprocess/src/tests/limiter_tests.cpp
/usr/bin/cmake -E cmake_progress_report /mesos/build/CMakeFiles 
[ 42%] Building CXX object src/CMakeFiles/mesos-1.3.0.dir/slave/containerizer/mesos/isolator.cpp.o
cd /mesos/build/src && /usr/bin/g++   -DBUILD_FLAGS=\"\" -DBUILD_JAVA_JVM_LIBRARY=\"\" -DHAS_AUTHENTICATION=1 -DLIBDIR=\"/usr/local/libmesos\" -DPICOJSON_USE_INT64 -DPKGDATADIR=\"/usr/local/share/mesos\" -DPKGLIBEXECDIR=\"/usr/local/libexec/mesos\" -DUSE_CMAKE_BUILD_CONFIG -DUSE_STATIC_LIB -DVERSION=\"1.3.0\" -D__STDC_FORMAT_MACROS -Dmesos_1_3_0_EXPORTS -O2 -std=c++11 -g -fPIC -I/mesos/build/include -I/mesos/build/include/mesos -I/mesos/build/src -I/mesos/src -isystem /mesos/build/3rdparty/protobuf-2.6.1/src/protobuf-2.6.1-lib/lib/include -isystem /mesos/3rdparty/libprocess/include -isystem /usr/include/apr-1.0 -isystem /mesos/build/3rdparty/boost-1.53.0/src/boost-1.53.0 -isystem /mesos/build/3rdparty/elfio-3.2/src/elfio-3.2 -isystem /mesos/build/3rdparty/glog-0.3.3/src/glog-0.3.3-lib/lib/include -isystem /mesos/build/3rdparty/nvml-352.79/src/nvml-352.79 -isystem /mesos/build/3rdparty/picojson-1.3.0/src/picojson-1.3.0 -isystem /usr/include/subversion-1 -isystem /mesos/3rdparty/stout/include -isystem /mesos/build/3rdparty/http_parser-2.6.2/src/http_parser-2.6.2 -isystem /mesos/build/3rdparty/libevent-2.1.5-beta/src/libevent-2.1.5-beta-lib/lib/include -isystem /mesos/build/3rdparty/zookeeper-3.4.8/src/zookeeper-3.4.8/src/c/include -isystem /mesos/build/3rdparty/zookeeper-3.4.8/src/zookeeper-3.4.8/src/c/generated -isystem /mesos/build/3rdparty/leveldb-1.19/src/leveldb-1.19/include -I/mesos/include    -o CMakeFiles/mesos-1.3.0.dir/slave/containerizer/mesos/isolator.cpp.o -c /mesos/src/slave/containerizer/mesos/isolator.cpp
/usr/bin/cmake -E cmake_progress_report /mesos/build/CMakeFiles 
[ 42%] Building CXX object 3rdparty/libprocess/src/tests/CMakeFiles/libprocess-tests.dir/loop_tests.cpp.o
cd /mesos/build/3rdparty/libprocess/src/tests && /usr/bin/g++   -DBUILD_DIR=\"/mesos/build/3rdparty/libprocess/src/tests\" -DBUILD_FLAGS=\"\" -DBUILD_JAVA_JVM_LIBRARY=\"\" -DHAS_AUTHENTICATION=1 -DLIBDIR=\"/usr/local/libmesos\" -DPICOJSON_USE_INT64 -DPKGDATADIR=\"/usr/local/share/mesos\" -DPKGLIBEXECDIR=\"/usr/local/libexec/mesos\" -DUSE_CMAKE_BUILD_CONFIG -DUSE_STATIC_LIB -DVERSION=\"1.3.0\" -D__STDC_FORMAT_MACROS -O2 -std=c++11 -g -fPIE -I/usr/include/apr-1.0 -I/mesos/build/3rdparty/boost-1.53.0/src/boost-1.53.0 -I/mesos/build/3rdparty/elfio-3.2/src/elfio-3.2 -I/mesos/build/3rdparty/glog-0.3.3/src/glog-0.3.3-lib/lib/include -I/mesos/build/3rdparty/nvml-352.79/src/nvml-352.79 -I/mesos/build/3rdparty/picojson-1.3.0/src/picojson-1.3.0 -I/mesos/build/3rdparty/protobuf-2.6.1/src/protobuf-2.6.1-lib/lib/include -I/usr/include/subversion-1 -I/mesos/3rdparty/stout/include -I/mesos/build/3rdparty/http_parser-2.6.2/src/http_parser-2.6.2 -I/mesos/build/3rdparty/libevent-2.1.5-beta/src/libevent-2.1.5-beta-lib/lib/include -I/mesos/build/3rdparty/gmock-1.7.0/src/gmock-1.7.0/include -I/mesos/build/3rdparty/gmock-1.7.0/src/gmock-1.7.0/gtest/include -I/mesos/3rdparty/libprocess/src/tests/src -I/mesos/3rdparty/libprocess/include -I/mesos/3rdparty/libprocess/src/tests/..    -o CMakeFiles/libprocess-tests.dir/loop_tests.cpp.o -c /mesos/3rdparty/libprocess/src/tests/loop_tests.cpp
/usr/bin/cmake -E cmake_progress_report /mesos/build/CMakeFiles 18
[ 43%] Building CXX object src/CMakeFiles/mesos-1.3.0.dir/slave/containerizer/mesos/launch.cpp.o
cd /mesos/build/src && /usr/bin/g++   -DBUILD_FLAGS=\"\" -DBUILD_JAVA_JVM_LIBRARY=\"\" -DHAS_AUTHENTICATION=1 -DLIBDIR=\"/usr/local/libmesos\" -DPICOJSON_USE_INT64 -DPKGDATADIR=\"/usr/local/share/mesos\" -DPKGLIBEXECDIR=\"/usr/local/libexec/mesos\" -DUSE_CMAKE_BUILD_CONFIG -DUSE_STATIC_LIB -DVERSION=\"1.3.0\" -D__STDC_FORMAT_MACROS -Dmesos_1_3_0_EXPORTS -O2 -std=c++11 -g -fPIC -I/mesos/build/include -I/mesos/build/include/mesos -I/mesos/build/src -I/mesos/src -isystem /mesos/build/3rdparty/protobuf-2.6.1/src/protobuf-2.6.1-lib/lib/include -isystem /mesos/3rdparty/libprocess/include -isystem /usr/include/apr-1.0 -isystem /mesos/build/3rdparty/boost-1.53.0/src/boost-1.53.0 -isystem /mesos/build/3rdparty/elfio-3.2/src/elfio-3.2 -isystem /mesos/build/3rdparty/glog-0.3.3/src/glog-0.3.3-lib/lib/include -isystem /mesos/build/3rdparty/nvml-352.79/src/nvml-352.79 -isystem /mesos/build/3rdparty/picojson-1.3.0/src/picojson-1.3.0 -isystem /usr/include/subversion-1 -isystem /mesos/3rdparty/stout/include -isystem /mesos/build/3rdparty/http_parser-2.6.2/src/http_parser-2.6.2 -isystem /mesos/build/3rdparty/libevent-2.1.5-beta/src/libevent-2.1.5-beta-lib/lib/include -isystem /mesos/build/3rdparty/zookeeper-3.4.8/src/zookeeper-3.4.8/src/c/include -isystem /mesos/build/3rdparty/zookeeper-3.4.8/src/zookeeper-3.4.8/src/c/generated -isystem /mesos/build/3rdparty/leveldb-1.19/src/leveldb-1.19/include -I/mesos/include    -o CMakeFiles/mesos-1.3.0.dir/slave/containerizer/mesos/launch.cpp.o -c /mesos/src/slave/containerizer/mesos/launch.cpp
/usr/bin/cmake -E cmake_progress_report /mesos/build/CMakeFiles 
[ 43%] Building CXX object src/CMakeFiles/mesos-1.3.0.dir/slave/containerizer/mesos/launcher.cpp.o
cd /mesos/build/src && /usr/bin/g++   -DBUILD_FLAGS=\"\" -DBUILD_JAVA_JVM_LIBRARY=\"\" -DHAS_AUTHENTICATION=1 -DLIBDIR=\"/usr/local/libmesos\" -DPICOJSON_USE_INT64 -DPKGDATADIR=\"/usr/local/share/mesos\" -DPKGLIBEXECDIR=\"/usr/local/libexec/mesos\" -DUSE_CMAKE_BUILD_CONFIG -DUSE_STATIC_LIB -DVERSION=\"1.3.0\" -D__STDC_FORMAT_MACROS -Dmesos_1_3_0_EXPORTS -O2 -std=c++11 -g -fPIC -I/mesos/build/include -I/mesos/build/include/mesos -I/mesos/build/src -I/mesos/src -isystem /mesos/build/3rdparty/protobuf-2.6.1/src/protobuf-2.6.1-lib/lib/include -isystem /mesos/3rdparty/libprocess/include -isystem /usr/include/apr-1.0 -isystem /mesos/build/3rdparty/boost-1.53.0/src/boost-1.53.0 -isystem /mesos/build/3rdparty/elfio-3.2/src/elfio-3.2 -isystem /mesos/build/3rdparty/glog-0.3.3/src/glog-0.3.3-lib/lib/include -isystem /mesos/build/3rdparty/nvml-352.79/src/nvml-352.79 -isystem /mesos/build/3rdparty/picojson-1.3.0/src/picojson-1.3.0 -isystem /usr/include/subversion-1 -isystem /mesos/3rdparty/stout/include -isystem /mesos/build/3rdparty/http_parser-2.6.2/src/http_parser-2.6.2 -isystem /mesos/build/3rdparty/libevent-2.1.5-beta/src/libevent-2.1.5-beta-lib/lib/include -isystem /mesos/build/3rdparty/zookeeper-3.4.8/src/zookeeper-3.4.8/src/c/include -isystem /mesos/build/3rdparty/zookeeper-3.4.8/src/zookeeper-3.4.8/src/c/generated -isystem /mesos/build/3rdparty/leveldb-1.19/src/leveldb-1.19/include -I/mesos/include    -o CMakeFiles/mesos-1.3.0.dir/slave/containerizer/mesos/launcher.cpp.o -c /mesos/src/slave/containerizer/mesos/launcher.cpp
/usr/bin/cmake -E cmake_progress_report /mesos/build/CMakeFiles 
[ 43%] Building CXX object src/CMakeFiles/mesos-1.3.0.dir/slave/containerizer/mesos/mount.cpp.o
cd /mesos/build/src && /usr/bin/g++   -DBUILD_FLAGS=\"\" -DBUILD_JAVA_JVM_LIBRARY=\"\" -DHAS_AUTHENTICATION=1 -DLIBDIR=\"/usr/local/libmesos\" -DPICOJSON_USE_INT64 -DPKGDATADIR=\"/usr/local/share/mesos\" -DPKGLIBEXECDIR=\"/usr/local/libexec/mesos\" -DUSE_CMAKE_BUILD_CONFIG -DUSE_STATIC_LIB -DVERSION=\"1.3.0\" -D__STDC_FORMAT_MACROS -Dmesos_1_3_0_EXPORTS -O2 -std=c++11 -g -fPIC -I/mesos/build/include -I/mesos/build/include/mesos -I/mesos/build/src -I/mesos/src -isystem /mesos/build/3rdparty/protobuf-2.6.1/src/protobuf-2.6.1-lib/lib/include -isystem /mesos/3rdparty/libprocess/include -isystem /usr/include/apr-1.0 -isystem /mesos/build/3rdparty/boost-1.53.0/src/boost-1.53.0 -isystem /mesos/build/3rdparty/elfio-3.2/src/elfio-3.2 -isystem /mesos/build/3rdparty/glog-0.3.3/src/glog-0.3.3-lib/lib/include -isystem /mesos/build/3rdparty/nvml-352.79/src/nvml-352.79 -isystem /mesos/build/3rdparty/picojson-1.3.0/src/picojson-1.3.0 -isystem /usr/include/subversion-1 -isystem /mesos/3rdparty/stout/include -isystem /mesos/build/3rdparty/http_parser-2.6.2/src/http_parser-2.6.2 -isystem /mesos/build/3rdparty/libevent-2.1.5-beta/src/libevent-2.1.5-beta-lib/lib/include -isystem /mesos/build/3rdparty/zookeeper-3.4.8/src/zookeeper-3.4.8/src/c/include -isystem /mesos/build/3rdparty/zookeeper-3.4.8/src/zookeeper-3.4.8/src/c/generated -isystem /mesos/build/3rdparty/leveldb-1.19/src/leveldb-1.19/include -I/mesos/include    -o CMakeFiles/mesos-1.3.0.dir/slave/containerizer/mesos/mount.cpp.o -c /mesos/src/slave/containerizer/mesos/mount.cpp
/usr/bin/cmake -E cmake_progress_report /mesos/build/CMakeFiles 
[ 43%] Building CXX object src/CMakeFiles/mesos-1.3.0.dir/slave/containerizer/mesos/paths.cpp.o
cd /mesos/build/src && /usr/bin/g++   -DBUILD_FLAGS=\"\" -DBUILD_JAVA_JVM_LIBRARY=\"\" -DHAS_AUTHENTICATION=1 -DLIBDIR=\"/usr/local/libmesos\" -DPICOJSON_USE_INT64 -DPKGDATADIR=\"/usr/local/share/mesos\" -DPKGLIBEXECDIR=\"/usr/local/libexec/mesos\" -DUSE_CMAKE_BUILD_CONFIG -DUSE_STATIC_LIB -DVERSION=\"1.3.0\" -D__STDC_FORMAT_MACROS -Dmesos_1_3_0_EXPORTS -O2 -std=c++11 -g -fPIC -I/mesos/build/include -I/mesos/build/include/mesos -I/mesos/build/src -I/mesos/src -isystem /mesos/build/3rdparty/protobuf-2.6.1/src/protobuf-2.6.1-lib/lib/include -isystem /mesos/3rdparty/libprocess/include -isystem /usr/include/apr-1.0 -isystem /mesos/build/3rdparty/boost-1.53.0/src/boost-1.53.0 -isystem /mesos/build/3rdparty/elfio-3.2/src/elfio-3.2 -isystem /mesos/build/3rdparty/glog-0.3.3/src/glog-0.3.3-lib/lib/include -isystem /mesos/build/3rdparty/nvml-352.79/src/nvml-352.79 -isystem /mesos/build/3rdparty/picojson-1.3.0/src/picojson-1.3.0 -isystem /usr/include/subversion-1 -isystem /mesos/3rdparty/stout/include -isystem /mesos/build/3rdparty/http_parser-2.6.2/src/http_parser-2.6.2 -isystem /mesos/build/3rdparty/libevent-2.1.5-beta/src/libevent-2.1.5-beta-lib/lib/include -isystem /mesos/build/3rdparty/zookeeper-3.4.8/src/zookeeper-3.4.8/src/c/include -isystem /mesos/build/3rdparty/zookeeper-3.4.8/src/zookeeper-3.4.8/src/c/generated -isystem /mesos/build/3rdparty/leveldb-1.19/src/leveldb-1.19/include -I/mesos/include    -o CMakeFiles/mesos-1.3.0.dir/slave/containerizer/mesos/paths.cpp.o -c /mesos/src/slave/containerizer/mesos/paths.cpp
/usr/bin/cmake -E cmake_progress_report /mesos/build/CMakeFiles 
[ 43%] Building CXX object 3rdparty/libprocess/src/tests/CMakeFiles/libprocess-tests.dir/metrics_tests.cpp.o
cd /mesos/build/3rdparty/libprocess/src/tests && /usr/bin/g++   -DBUILD_DIR=\"/mesos/build/3rdparty/libprocess/src/tests\" -DBUILD_FLAGS=\"\" -DBUILD_JAVA_JVM_LIBRARY=\"\" -DHAS_AUTHENTICATION=1 -DLIBDIR=\"/usr/local/libmesos\" -DPICOJSON_USE_INT64 -DPKGDATADIR=\"/usr/local/share/mesos\" -DPKGLIBEXECDIR=\"/usr/local/libexec/mesos\" -DUSE_CMAKE_BUILD_CONFIG -DUSE_STATIC_LIB -DVERSION=\"1.3.0\" -D__STDC_FORMAT_MACROS -O2 -std=c++11 -g -fPIE -I/usr/include/apr-1.0 -I/mesos/build/3rdparty/boost-1.53.0/src/boost-1.53.0 -I/mesos/build/3rdparty/elfio-3.2/src/elfio-3.2 -I/mesos/build/3rdparty/glog-0.3.3/src/glog-0.3.3-lib/lib/include -I/mesos/build/3rdparty/nvml-352.79/src/nvml-352.79 -I/mesos/build/3rdparty/picojson-1.3.0/src/picojson-1.3.0 -I/mesos/build/3rdparty/protobuf-2.6.1/src/protobuf-2.6.1-lib/lib/include -I/usr/include/subversion-1 -I/mesos/3rdparty/stout/include -I/mesos/build/3rdparty/http_parser-2.6.2/src/http_parser-2.6.2 -I/mesos/build/3rdparty/libevent-2.1.5-beta/src/libevent-2.1.5-beta-lib/lib/include -I/mesos/build/3rdparty/gmock-1.7.0/src/gmock-1.7.0/include -I/mesos/build/3rdparty/gmock-1.7.0/src/gmock-1.7.0/gtest/include -I/mesos/3rdparty/libprocess/src/tests/src -I/mesos/3rdparty/libprocess/include -I/mesos/3rdparty/libprocess/src/tests/..    -o CMakeFiles/libprocess-tests.dir/metrics_tests.cpp.o -c /mesos/3rdparty/libprocess/src/tests/metrics_tests.cpp
/usr/bin/cmake -E cmake_progress_report /mesos/build/CMakeFiles 
[ 43%] Building CXX object src/CMakeFiles/mesos-1.3.0.dir/slave/containerizer/mesos/utils.cpp.o
cd /mesos/build/src && /usr/bin/g++   -DBUILD_FLAGS=\"\" -DBUILD_JAVA_JVM_LIBRARY=\"\" -DHAS_AUTHENTICATION=1 -DLIBDIR=\"/usr/local/libmesos\" -DPICOJSON_USE_INT64 -DPKGDATADIR=\"/usr/local/share/mesos\" -DPKGLIBEXECDIR=\"/usr/local/libexec/mesos\" -DUSE_CMAKE_BUILD_CONFIG -DUSE_STATIC_LIB -DVERSION=\"1.3.0\" -D__STDC_FORMAT_MACROS -Dmesos_1_3_0_EXPORTS -O2 -std=c++11 -g -fPIC -I/mesos/build/include -I/mesos/build/include/mesos -I/mesos/build/src -I/mesos/src -isystem /mesos/build/3rdparty/protobuf-2.6.1/src/protobuf-2.6.1-lib/lib/include -isystem /mesos/3rdparty/libprocess/include -isystem /usr/include/apr-1.0 -isystem /mesos/build/3rdparty/boost-1.53.0/src/boost-1.53.0 -isystem /mesos/build/3rdparty/elfio-3.2/src/elfio-3.2 -isystem /mesos/build/3rdparty/glog-0.3.3/src/glog-0.3.3-lib/lib/include -isystem /mesos/build/3rdparty/nvml-352.79/src/nvml-352.79 -isystem /mesos/build/3rdparty/picojson-1.3.0/src/picojson-1.3.0 -isystem /usr/include/subversion-1 -isystem /mesos/3rdparty/stout/include -isystem /mesos/build/3rdparty/http_parser-2.6.2/src/http_parser-2.6.2 -isystem /mesos/build/3rdparty/libevent-2.1.5-beta/src/libevent-2.1.5-beta-lib/lib/include -isystem /mesos/build/3rdparty/zookeeper-3.4.8/src/zookeeper-3.4.8/src/c/include -isystem /mesos/build/3rdparty/zookeeper-3.4.8/src/zookeeper-3.4.8/src/c/generated -isystem /mesos/build/3rdparty/leveldb-1.19/src/leveldb-1.19/include -I/mesos/include    -o CMakeFiles/mesos-1.3.0.dir/slave/containerizer/mesos/utils.cpp.o -c /mesos/src/slave/containerizer/mesos/utils.cpp
/usr/bin/cmake -E cmake_progress_report /mesos/build/CMakeFiles 
[ 43%] Building CXX object src/CMakeFiles/mesos-1.3.0.dir/slave/containerizer/mesos/io/switchboard.cpp.o
cd /mesos/build/src && /usr/bin/g++   -DBUILD_FLAGS=\"\" -DBUILD_JAVA_JVM_LIBRARY=\"\" -DHAS_AUTHENTICATION=1 -DLIBDIR=\"/usr/local/libmesos\" -DPICOJSON_USE_INT64 -DPKGDATADIR=\"/usr/local/share/mesos\" -DPKGLIBEXECDIR=\"/usr/local/libexec/mesos\" -DUSE_CMAKE_BUILD_CONFIG -DUSE_STATIC_LIB -DVERSION=\"1.3.0\" -D__STDC_FORMAT_MACROS -Dmesos_1_3_0_EXPORTS -O2 -std=c++11 -g -fPIC -I/mesos/build/include -I/mesos/build/include/mesos -I/mesos/build/src -I/mesos/src -isystem /mesos/build/3rdparty/protobuf-2.6.1/src/protobuf-2.6.1-lib/lib/include -isystem /mesos/3rdparty/libprocess/include -isystem /usr/include/apr-1.0 -isystem /mesos/build/3rdparty/boost-1.53.0/src/boost-1.53.0 -isystem /mesos/build/3rdparty/elfio-3.2/src/elfio-3.2 -isystem /mesos/build/3rdparty/glog-0.3.3/src/glog-0.3.3-lib/lib/include -isystem /mesos/build/3rdparty/nvml-352.79/src/nvml-352.79 -isystem /mesos/build/3rdparty/picojson-1.3.0/src/picojson-1.3.0 -isystem /usr/include/subversion-1 -isystem /mesos/3rdparty/stout/include -isystem /mesos/build/3rdparty/http_parser-2.6.2/src/http_parser-2.6.2 -isystem /mesos/build/3rdparty/libevent-2.1.5-beta/src/libevent-2.1.5-beta-lib/lib/include -isystem /mesos/build/3rdparty/zookeeper-3.4.8/src/zookeeper-3.4.8/src/c/include -isystem /mesos/build/3rdparty/zookeeper-3.4.8/src/zookeeper-3.4.8/src/c/generated -isystem /mesos/build/3rdparty/leveldb-1.19/src/leveldb-1.19/include -I/mesos/include    -o CMakeFiles/mesos-1.3.0.dir/slave/containerizer/mesos/io/switchboard.cpp.o -c /mesos/src/slave/containerizer/mesos/io/switchboard.cpp
/usr/bin/cmake -E cmake_progress_report /mesos/build/CMakeFiles 
[ 43%] Building CXX object 3rdparty/libprocess/src/tests/CMakeFiles/libprocess-tests.dir/mutex_tests.cpp.o
cd /mesos/build/3rdparty/libprocess/src/tests && /usr/bin/g++   -DBUILD_DIR=\"/mesos/build/3rdparty/libprocess/src/tests\" -DBUILD_FLAGS=\"\" -DBUILD_JAVA_JVM_LIBRARY=\"\" -DHAS_AUTHENTICATION=1 -DLIBDIR=\"/usr/local/libmesos\" -DPICOJSON_USE_INT64 -DPKGDATADIR=\"/usr/local/share/mesos\" -DPKGLIBEXECDIR=\"/usr/local/libexec/mesos\" -DUSE_CMAKE_BUILD_CONFIG -DUSE_STATIC_LIB -DVERSION=\"1.3.0\" -D__STDC_FORMAT_MACROS -O2 -std=c++11 -g -fPIE -I/usr/include/apr-1.0 -I/mesos/build/3rdparty/boost-1.53.0/src/boost-1.53.0 -I/mesos/build/3rdparty/elfio-3.2/src/elfio-3.2 -I/mesos/build/3rdparty/glog-0.3.3/src/glog-0.3.3-lib/lib/include -I/mesos/build/3rdparty/nvml-352.79/src/nvml-352.79 -I/mesos/build/3rdparty/picojson-1.3.0/src/picojson-1.3.0 -I/mesos/build/3rdparty/protobuf-2.6.1/src/protobuf-2.6.1-lib/lib/include -I/usr/include/subversion-1 -I/mesos/3rdparty/stout/include -I/mesos/build/3rdparty/http_parser-2.6.2/src/http_parser-2.6.2 -I/mesos/build/3rdparty/libevent-2.1.5-beta/src/libevent-2.1.5-beta-lib/lib/include -I/mesos/build/3rdparty/gmock-1.7.0/src/gmock-1.7.0/include -I/mesos/build/3rdparty/gmock-1.7.0/src/gmock-1.7.0/gtest/include -I/mesos/3rdparty/libprocess/src/tests/src -I/mesos/3rdparty/libprocess/include -I/mesos/3rdparty/libprocess/src/tests/..    -o CMakeFiles/libprocess-tests.dir/mutex_tests.cpp.o -c /mesos/3rdparty/libprocess/src/tests/mutex_tests.cpp
/usr/bin/cmake -E cmake_progress_report /mesos/build/CMakeFiles 
[ 43%] Building CXX object src/CMakeFiles/mesos-1.3.0.dir/slave/containerizer/mesos/provisioner/backend.cpp.o
cd /mesos/build/src && /usr/bin/g++   -DBUILD_FLAGS=\"\" -DBUILD_JAVA_JVM_LIBRARY=\"\" -DHAS_AUTHENTICATION=1 -DLIBDIR=\"/usr/local/libmesos\" -DPICOJSON_USE_INT64 -DPKGDATADIR=\"/usr/local/share/mesos\" -DPKGLIBEXECDIR=\"/usr/local/libexec/mesos\" -DUSE_CMAKE_BUILD_CONFIG -DUSE_STATIC_LIB -DVERSION=\"1.3.0\" -D__STDC_FORMAT_MACROS -Dmesos_1_3_0_EXPORTS -O2 -std=c++11 -g -fPIC -I/mesos/build/include -I/mesos/build/include/mesos -I/mesos/build/src -I/mesos/src -isystem /mesos/build/3rdparty/protobuf-2.6.1/src/protobuf-2.6.1-lib/lib/include -isystem /mesos/3rdparty/libprocess/include -isystem /usr/include/apr-1.0 -isystem /mesos/build/3rdparty/boost-1.53.0/src/boost-1.53.0 -isystem /mesos/build/3rdparty/elfio-3.2/src/elfio-3.2 -isystem /mesos/build/3rdparty/glog-0.3.3/src/glog-0.3.3-lib/lib/include -isystem /mesos/build/3rdparty/nvml-352.79/src/nvml-352.79 -isystem /mesos/build/3rdparty/picojson-1.3.0/src/picojson-1.3.0 -isystem /usr/include/subversion-1 -isystem /mesos/3rdparty/stout/include -isystem /mesos/build/3rdparty/http_parser-2.6.2/src/http_parser-2.6.2 -isystem /mesos/build/3rdparty/libevent-2.1.5-beta/src/libevent-2.1.5-beta-lib/lib/include -isystem /mesos/build/3rdparty/zookeeper-3.4.8/src/zookeeper-3.4.8/src/c/include -isystem /mesos/build/3rdparty/zookeeper-3.4.8/src/zookeeper-3.4.8/src/c/generated -isystem /mesos/build/3rdparty/leveldb-1.19/src/leveldb-1.19/include -I/mesos/include    -o CMakeFiles/mesos-1.3.0.dir/slave/containerizer/mesos/provisioner/backend.cpp.o -c /mesos/src/slave/containerizer/mesos/provisioner/backend.cpp
/usr/bin/cmake -E cmake_progress_report /mesos/build/CMakeFiles 19
[ 44%] Building CXX object src/CMakeFiles/mesos-1.3.0.dir/slave/containerizer/mesos/provisioner/paths.cpp.o
cd /mesos/build/src && /usr/bin/g++   -DBUILD_FLAGS=\"\" -DBUILD_JAVA_JVM_LIBRARY=\"\" -DHAS_AUTHENTICATION=1 -DLIBDIR=\"/usr/local/libmesos\" -DPICOJSON_USE_INT64 -DPKGDATADIR=\"/usr/local/share/mesos\" -DPKGLIBEXECDIR=\"/usr/local/libexec/mesos\" -DUSE_CMAKE_BUILD_CONFIG -DUSE_STATIC_LIB -DVERSION=\"1.3.0\" -D__STDC_FORMAT_MACROS -Dmesos_1_3_0_EXPORTS -O2 -std=c++11 -g -fPIC -I/mesos/build/include -I/mesos/build/include/mesos -I/mesos/build/src -I/mesos/src -isystem /mesos/build/3rdparty/protobuf-2.6.1/src/protobuf-2.6.1-lib/lib/include -isystem /mesos/3rdparty/libprocess/include -isystem /usr/include/apr-1.0 -isystem /mesos/build/3rdparty/boost-1.53.0/src/boost-1.53.0 -isystem /mesos/build/3rdparty/elfio-3.2/src/elfio-3.2 -isystem /mesos/build/3rdparty/glog-0.3.3/src/glog-0.3.3-lib/lib/include -isystem /mesos/build/3rdparty/nvml-352.79/src/nvml-352.79 -isystem /mesos/build/3rdparty/picojson-1.3.0/src/picojson-1.3.0 -isystem /usr/include/subversion-1 -isystem /mesos/3rdparty/stout/include -isystem /mesos/build/3rdparty/http_parser-2.6.2/src/http_parser-2.6.2 -isystem /mesos/build/3rdparty/libevent-2.1.5-beta/src/libevent-2.1.5-beta-lib/lib/include -isystem /mesos/build/3rdparty/zookeeper-3.4.8/src/zookeeper-3.4.8/src/c/include -isystem /mesos/build/3rdparty/zookeeper-3.4.8/src/zookeeper-3.4.8/src/c/generated -isystem /mesos/build/3rdparty/leveldb-1.19/src/leveldb-1.19/include -I/mesos/include    -o CMakeFiles/mesos-1.3.0.dir/slave/containerizer/mesos/provisioner/paths.cpp.o -c /mesos/src/slave/containerizer/mesos/provisioner/paths.cpp
/usr/bin/cmake -E cmake_progress_report /mesos/build/CMakeFiles 
[ 44%] Building CXX object src/CMakeFiles/mesos-1.3.0.dir/slave/containerizer/mesos/provisioner/provisioner.cpp.o
cd /mesos/build/src && /usr/bin/g++   -DBUILD_FLAGS=\"\" -DBUILD_JAVA_JVM_LIBRARY=\"\" -DHAS_AUTHENTICATION=1 -DLIBDIR=\"/usr/local/libmesos\" -DPICOJSON_USE_INT64 -DPKGDATADIR=\"/usr/local/share/mesos\" -DPKGLIBEXECDIR=\"/usr/local/libexec/mesos\" -DUSE_CMAKE_BUILD_CONFIG -DUSE_STATIC_LIB -DVERSION=\"1.3.0\" -D__STDC_FORMAT_MACROS -Dmesos_1_3_0_EXPORTS -O2 -std=c++11 -g -fPIC -I/mesos/build/include -I/mesos/build/include/mesos -I/mesos/build/src -I/mesos/src -isystem /mesos/build/3rdparty/protobuf-2.6.1/src/protobuf-2.6.1-lib/lib/include -isystem /mesos/3rdparty/libprocess/include -isystem /usr/include/apr-1.0 -isystem /mesos/build/3rdparty/boost-1.53.0/src/boost-1.53.0 -isystem /mesos/build/3rdparty/elfio-3.2/src/elfio-3.2 -isystem /mesos/build/3rdparty/glog-0.3.3/src/glog-0.3.3-lib/lib/include -isystem /mesos/build/3rdparty/nvml-352.79/src/nvml-352.79 -isystem /mesos/build/3rdparty/picojson-1.3.0/src/picojson-1.3.0 -isystem /usr/include/subversion-1 -isystem /mesos/3rdparty/stout/include -isystem /mesos/build/3rdparty/http_parser-2.6.2/src/http_parser-2.6.2 -isystem /mesos/build/3rdparty/libevent-2.1.5-beta/src/libevent-2.1.5-beta-lib/lib/include -isystem /mesos/build/3rdparty/zookeeper-3.4.8/src/zookeeper-3.4.8/src/c/include -isystem /mesos/build/3rdparty/zookeeper-3.4.8/src/zookeeper-3.4.8/src/c/generated -isystem /mesos/build/3rdparty/leveldb-1.19/src/leveldb-1.19/include -I/mesos/include    -o CMakeFiles/mesos-1.3.0.dir/slave/containerizer/mesos/provisioner/provisioner.cpp.o -c /mesos/src/slave/containerizer/mesos/provisioner/provisioner.cpp
/usr/bin/cmake -E cmake_progress_report /mesos/build/CMakeFiles 
[ 44%] Building CXX object src/CMakeFiles/mesos-1.3.0.dir/slave/containerizer/mesos/provisioner/store.cpp.o
cd /mesos/build/src && /usr/bin/g++   -DBUILD_FLAGS=\"\" -DBUILD_JAVA_JVM_LIBRARY=\"\" -DHAS_AUTHENTICATION=1 -DLIBDIR=\"/usr/local/libmesos\" -DPICOJSON_USE_INT64 -DPKGDATADIR=\"/usr/local/share/mesos\" -DPKGLIBEXECDIR=\"/usr/local/libexec/mesos\" -DUSE_CMAKE_BUILD_CONFIG -DUSE_STATIC_LIB -DVERSION=\"1.3.0\" -D__STDC_FORMAT_MACROS -Dmesos_1_3_0_EXPORTS -O2 -std=c++11 -g -fPIC -I/mesos/build/include -I/mesos/build/include/mesos -I/mesos/build/src -I/mesos/src -isystem /mesos/build/3rdparty/protobuf-2.6.1/src/protobuf-2.6.1-lib/lib/include -isystem /mesos/3rdparty/libprocess/include -isystem /usr/include/apr-1.0 -isystem /mesos/build/3rdparty/boost-1.53.0/src/boost-1.53.0 -isystem /mesos/build/3rdparty/elfio-3.2/src/elfio-3.2 -isystem /mesos/build/3rdparty/glog-0.3.3/src/glog-0.3.3-lib/lib/include -isystem /mesos/build/3rdparty/nvml-352.79/src/nvml-352.79 -isystem /mesos/build/3rdparty/picojson-1.3.0/src/picojson-1.3.0 -isystem /usr/include/subversion-1 -isystem /mesos/3rdparty/stout/include -isystem /mesos/build/3rdparty/http_parser-2.6.2/src/http_parser-2.6.2 -isystem /mesos/build/3rdparty/libevent-2.1.5-beta/src/libevent-2.1.5-beta-lib/lib/include -isystem /mesos/build/3rdparty/zookeeper-3.4.8/src/zookeeper-3.4.8/src/c/include -isystem /mesos/build/3rdparty/zookeeper-3.4.8/src/zookeeper-3.4.8/src/c/generated -isystem /mesos/build/3rdparty/leveldb-1.19/src/leveldb-1.19/include -I/mesos/include    -o CMakeFiles/mesos-1.3.0.dir/slave/containerizer/mesos/provisioner/store.cpp.o -c /mesos/src/slave/containerizer/mesos/provisioner/store.cpp
/usr/bin/cmake -E cmake_progress_report /mesos/build/CMakeFiles 
[ 44%] Building CXX object src/CMakeFiles/mesos-1.3.0.dir/slave/containerizer/mesos/provisioner/utils.cpp.o
cd /mesos/build/src && /usr/bin/g++   -DBUILD_FLAGS=\"\" -DBUILD_JAVA_JVM_LIBRARY=\"\" -DHAS_AUTHENTICATION=1 -DLIBDIR=\"/usr/local/libmesos\" -DPICOJSON_USE_INT64 -DPKGDATADIR=\"/usr/local/share/mesos\" -DPKGLIBEXECDIR=\"/usr/local/libexec/mesos\" -DUSE_CMAKE_BUILD_CONFIG -DUSE_STATIC_LIB -DVERSION=\"1.3.0\" -D__STDC_FORMAT_MACROS -Dmesos_1_3_0_EXPORTS -O2 -std=c++11 -g -fPIC -I/mesos/build/include -I/mesos/build/include/mesos -I/mesos/build/src -I/mesos/src -isystem /mesos/build/3rdparty/protobuf-2.6.1/src/protobuf-2.6.1-lib/lib/include -isystem /mesos/3rdparty/libprocess/include -isystem /usr/include/apr-1.0 -isystem /mesos/build/3rdparty/boost-1.53.0/src/boost-1.53.0 -isystem /mesos/build/3rdparty/elfio-3.2/src/elfio-3.2 -isystem /mesos/build/3rdparty/glog-0.3.3/src/glog-0.3.3-lib/lib/include -isystem /mesos/build/3rdparty/nvml-352.79/src/nvml-352.79 -isystem /mesos/build/3rdparty/picojson-1.3.0/src/picojson-1.3.0 -isystem /usr/include/subversion-1 -isystem /mesos/3rdparty/stout/include -isystem /mesos/build/3rdparty/http_parser-2.6.2/src/http_parser-2.6.2 -isystem /mesos/build/3rdparty/libevent-2.1.5-beta/src/libevent-2.1.5-beta-lib/lib/include -isystem /mesos/build/3rdparty/zookeeper-3.4.8/src/zookeeper-3.4.8/src/c/include -isystem /mesos/build/3rdparty/zookeeper-3.4.8/src/zookeeper-3.4.8/src/c/generated -isystem /mesos/build/3rdparty/leveldb-1.19/src/leveldb-1.19/include -I/mesos/include    -o CMakeFiles/mesos-1.3.0.dir/slave/containerizer/mesos/provisioner/utils.cpp.o -c /mesos/src/slave/containerizer/mesos/provisioner/utils.cpp
/usr/bin/cmake -E cmake_progress_report /mesos/build/CMakeFiles 
[ 44%] Building CXX object 3rdparty/libprocess/src/tests/CMakeFiles/libprocess-tests.dir/owned_tests.cpp.o
cd /mesos/build/3rdparty/libprocess/src/tests && /usr/bin/g++   -DBUILD_DIR=\"/mesos/build/3rdparty/libprocess/src/tests\" -DBUILD_FLAGS=\"\" -DBUILD_JAVA_JVM_LIBRARY=\"\" -DHAS_AUTHENTICATION=1 -DLIBDIR=\"/usr/local/libmesos\" -DPICOJSON_USE_INT64 -DPKGDATADIR=\"/usr/local/share/mesos\" -DPKGLIBEXECDIR=\"/usr/local/libexec/mesos\" -DUSE_CMAKE_BUILD_CONFIG -DUSE_STATIC_LIB -DVERSION=\"1.3.0\" -D__STDC_FORMAT_MACROS -O2 -std=c++11 -g -fPIE -I/usr/include/apr-1.0 -I/mesos/build/3rdparty/boost-1.53.0/src/boost-1.53.0 -I/mesos/build/3rdparty/elfio-3.2/src/elfio-3.2 -I/mesos/build/3rdparty/glog-0.3.3/src/glog-0.3.3-lib/lib/include -I/mesos/build/3rdparty/nvml-352.79/src/nvml-352.79 -I/mesos/build/3rdparty/picojson-1.3.0/src/picojson-1.3.0 -I/mesos/build/3rdparty/protobuf-2.6.1/src/protobuf-2.6.1-lib/lib/include -I/usr/include/subversion-1 -I/mesos/3rdparty/stout/include -I/mesos/build/3rdparty/http_parser-2.6.2/src/http_parser-2.6.2 -I/mesos/build/3rdparty/libevent-2.1.5-beta/src/libevent-2.1.5-beta-lib/lib/include -I/mesos/build/3rdparty/gmock-1.7.0/src/gmock-1.7.0/include -I/mesos/build/3rdparty/gmock-1.7.0/src/gmock-1.7.0/gtest/include -I/mesos/3rdparty/libprocess/src/tests/src -I/mesos/3rdparty/libprocess/include -I/mesos/3rdparty/libprocess/src/tests/..    -o CMakeFiles/libprocess-tests.dir/owned_tests.cpp.o -c /mesos/3rdparty/libprocess/src/tests/owned_tests.cpp
/usr/bin/cmake -E cmake_progress_report /mesos/build/CMakeFiles 
[ 44%] /usr/bin/cmake -E cmake_progress_report /mesos/build/CMakeFiles 12
Building CXX object src/CMakeFiles/mesos-1.3.0.dir/slave/containerizer/mesos/provisioner/appc/cache.cpp.o
cd /mesos/build/src && /usr/bin/g++   -DBUILD_FLAGS=\"\" -DBUILD_JAVA_JVM_LIBRARY=\"\" -DHAS_AUTHENTICATION=1 -DLIBDIR=\"/usr/local/libmesos\" -DPICOJSON_USE_INT64 -DPKGDATADIR=\"/usr/local/share/mesos\" -DPKGLIBEXECDIR=\"/usr/local/libexec/mesos\" -DUSE_CMAKE_BUILD_CONFIG -DUSE_STATIC_LIB -DVERSION=\"1.3.0\" -D__STDC_FORMAT_MACROS -Dmesos_1_3_0_EXPORTS -O2 -std=c++11 -g -fPIC -I/mesos/build/include -I/mesos/build/include/mesos -I/mesos/build/src -I/mesos/src -isystem /mesos/build/3rdparty/protobuf-2.6.1/src/protobuf-2.6.1-lib/lib/include -isystem /mesos/3rdparty/libprocess/include -isystem /usr/include/apr-1.0 -isystem /mesos/build/3rdparty/boost-1.53.0/src/boost-1.53.0 -isystem /mesos/build/3rdparty/elfio-3.2/src/elfio-3.2 -isystem /mesos/build/3rdparty/glog-0.3.3/src/glog-0.3.3-lib/lib/include -isystem /mesos/build/3rdparty/nvml-352.79/src/nvml-352.79 -isystem /mesos/build/3rdparty/picojson-1.3.0/src/picojson-1.3.0 -isystem /usr/include/subversion-1 -isystem /mesos/3rdparty/stout/include -isystem /mesos/build/3rdparty/http_parser-2.6.2/src/http_parser-2.6.2 -isystem /mesos/build/3rdparty/libevent-2.1.5-beta/src/libevent-2.1.5-beta-lib/lib/include -isystem /mesos/build/3rdparty/zookeeper-3.4.8/src/zookeeper-3.4.8/src/c/include -isystem /mesos/build/3rdparty/zookeeper-3.4.8/src/zookeeper-3.4.8/src/c/generated -isystem /mesos/build/3rdparty/leveldb-1.19/src/leveldb-1.19/include -I/mesos/include    -o CMakeFiles/mesos-1.3.0.dir/slave/containerizer/mesos/provisioner/appc/cache.cpp.o -c /mesos/src/slave/containerizer/mesos/provisioner/appc/cache.cpp
[ 45%] Building CXX object 3rdparty/libprocess/src/tests/CMakeFiles/libprocess-tests.dir/process_tests.cpp.o
cd /mesos/build/3rdparty/libprocess/src/tests && /usr/bin/g++   -DBUILD_DIR=\"/mesos/build/3rdparty/libprocess/src/tests\" -DBUILD_FLAGS=\"\" -DBUILD_JAVA_JVM_LIBRARY=\"\" -DHAS_AUTHENTICATION=1 -DLIBDIR=\"/usr/local/libmesos\" -DPICOJSON_USE_INT64 -DPKGDATADIR=\"/usr/local/share/mesos\" -DPKGLIBEXECDIR=\"/usr/local/libexec/mesos\" -DUSE_CMAKE_BUILD_CONFIG -DUSE_STATIC_LIB -DVERSION=\"1.3.0\" -D__STDC_FORMAT_MACROS -O2 -std=c++11 -g -fPIE -I/usr/include/apr-1.0 -I/mesos/build/3rdparty/boost-1.53.0/src/boost-1.53.0 -I/mesos/build/3rdparty/elfio-3.2/src/elfio-3.2 -I/mesos/build/3rdparty/glog-0.3.3/src/glog-0.3.3-lib/lib/include -I/mesos/build/3rdparty/nvml-352.79/src/nvml-352.79 -I/mesos/build/3rdparty/picojson-1.3.0/src/picojson-1.3.0 -I/mesos/build/3rdparty/protobuf-2.6.1/src/protobuf-2.6.1-lib/lib/include -I/usr/include/subversion-1 -I/mesos/3rdparty/stout/include -I/mesos/build/3rdparty/http_parser-2.6.2/src/http_parser-2.6.2 -I/mesos/build/3rdparty/libevent-2.1.5-beta/src/libevent-2.1.5-beta-lib/lib/include -I/mesos/build/3rdparty/gmock-1.7.0/src/gmock-1.7.0/include -I/mesos/build/3rdparty/gmock-1.7.0/src/gmock-1.7.0/gtest/include -I/mesos/3rdparty/libprocess/src/tests/src -I/mesos/3rdparty/libprocess/include -I/mesos/3rdparty/libprocess/src/tests/..    -o CMakeFiles/libprocess-tests.dir/process_tests.cpp.o -c /mesos/3rdparty/libprocess/src/tests/process_tests.cpp
/usr/bin/cmake -E cmake_progress_report /mesos/build/CMakeFiles 
[ 45%] Building CXX object 3rdparty/libprocess/src/tests/CMakeFiles/libprocess-tests.dir/queue_tests.cpp.o
cd /mesos/build/3rdparty/libprocess/src/tests && /usr/bin/g++   -DBUILD_DIR=\"/mesos/build/3rdparty/libprocess/src/tests\" -DBUILD_FLAGS=\"\" -DBUILD_JAVA_JVM_LIBRARY=\"\" -DHAS_AUTHENTICATION=1 -DLIBDIR=\"/usr/local/libmesos\" -DPICOJSON_USE_INT64 -DPKGDATADIR=\"/usr/local/share/mesos\" -DPKGLIBEXECDIR=\"/usr/local/libexec/mesos\" -DUSE_CMAKE_BUILD_CONFIG -DUSE_STATIC_LIB -DVERSION=\"1.3.0\" -D__STDC_FORMAT_MACROS -O2 -std=c++11 -g -fPIE -I/usr/include/apr-1.0 -I/mesos/build/3rdparty/boost-1.53.0/src/boost-1.53.0 -I/mesos/build/3rdparty/elfio-3.2/src/elfio-3.2 -I/mesos/build/3rdparty/glog-0.3.3/src/glog-0.3.3-lib/lib/include -I/mesos/build/3rdparty/nvml-352.79/src/nvml-352.79 -I/mesos/build/3rdparty/picojson-1.3.0/src/picojson-1.3.0 -I/mesos/build/3rdparty/protobuf-2.6.1/src/protobuf-2.6.1-lib/lib/include -I/usr/include/subversion-1 -I/mesos/3rdparty/stout/include -I/mesos/build/3rdparty/http_parser-2.6.2/src/http_parser-2.6.2 -I/mesos/build/3rdparty/libevent-2.1.5-beta/src/libevent-2.1.5-beta-lib/lib/include -I/mesos/build/3rdparty/gmock-1.7.0/src/gmock-1.7.0/include -I/mesos/build/3rdparty/gmock-1.7.0/src/gmock-1.7.0/gtest/include -I/mesos/3rdparty/libprocess/src/tests/src -I/mesos/3rdparty/libprocess/include -I/mesos/3rdparty/libprocess/src/tests/..    -o CMakeFiles/libprocess-tests.dir/queue_tests.cpp.o -c /mesos/3rdparty/libprocess/src/tests/queue_tests.cpp
/usr/bin/cmake -E cmake_progress_report /mesos/build/CMakeFiles 
[ 45%] Building CXX object src/CMakeFiles/mesos-1.3.0.dir/slave/containerizer/mesos/provisioner/appc/fetcher.cpp.o
cd /mesos/build/src && /usr/bin/g++   -DBUILD_FLAGS=\"\" -DBUILD_JAVA_JVM_LIBRARY=\"\" -DHAS_AUTHENTICATION=1 -DLIBDIR=\"/usr/local/libmesos\" -DPICOJSON_USE_INT64 -DPKGDATADIR=\"/usr/local/share/mesos\" -DPKGLIBEXECDIR=\"/usr/local/libexec/mesos\" -DUSE_CMAKE_BUILD_CONFIG -DUSE_STATIC_LIB -DVERSION=\"1.3.0\" -D__STDC_FORMAT_MACROS -Dmesos_1_3_0_EXPORTS -O2 -std=c++11 -g -fPIC -I/mesos/build/include -I/mesos/build/include/mesos -I/mesos/build/src -I/mesos/src -isystem /mesos/build/3rdparty/protobuf-2.6.1/src/protobuf-2.6.1-lib/lib/include -isystem /mesos/3rdparty/libprocess/include -isystem /usr/include/apr-1.0 -isystem /mesos/build/3rdparty/boost-1.53.0/src/boost-1.53.0 -isystem /mesos/build/3rdparty/elfio-3.2/src/elfio-3.2 -isystem /mesos/build/3rdparty/glog-0.3.3/src/glog-0.3.3-lib/lib/include -isystem /mesos/build/3rdparty/nvml-352.79/src/nvml-352.79 -isystem /mesos/build/3rdparty/picojson-1.3.0/src/picojson-1.3.0 -isystem /usr/include/subversion-1 -isystem /mesos/3rdparty/stout/include -isystem /mesos/build/3rdparty/http_parser-2.6.2/src/http_parser-2.6.2 -isystem /mesos/build/3rdparty/libevent-2.1.5-beta/src/libevent-2.1.5-beta-lib/lib/include -isystem /mesos/build/3rdparty/zookeeper-3.4.8/src/zookeeper-3.4.8/src/c/include -isystem /mesos/build/3rdparty/zookeeper-3.4.8/src/zookeeper-3.4.8/src/c/generated -isystem /mesos/build/3rdparty/leveldb-1.19/src/leveldb-1.19/include -I/mesos/include    -o CMakeFiles/mesos-1.3.0.dir/slave/containerizer/mesos/provisioner/appc/fetcher.cpp.o -c /mesos/src/slave/containerizer/mesos/provisioner/appc/fetcher.cpp
/usr/bin/cmake -E cmake_progress_report /mesos/build/CMakeFiles 20
[ 46%] Building CXX object src/CMakeFiles/mesos-1.3.0.dir/slave/containerizer/mesos/provisioner/appc/paths.cpp.o
cd /mesos/build/src && /usr/bin/g++   -DBUILD_FLAGS=\"\" -DBUILD_JAVA_JVM_LIBRARY=\"\" -DHAS_AUTHENTICATION=1 -DLIBDIR=\"/usr/local/libmesos\" -DPICOJSON_USE_INT64 -DPKGDATADIR=\"/usr/local/share/mesos\" -DPKGLIBEXECDIR=\"/usr/local/libexec/mesos\" -DUSE_CMAKE_BUILD_CONFIG -DUSE_STATIC_LIB -DVERSION=\"1.3.0\" -D__STDC_FORMAT_MACROS -Dmesos_1_3_0_EXPORTS -O2 -std=c++11 -g -fPIC -I/mesos/build/include -I/mesos/build/include/mesos -I/mesos/build/src -I/mesos/src -isystem /mesos/build/3rdparty/protobuf-2.6.1/src/protobuf-2.6.1-lib/lib/include -isystem /mesos/3rdparty/libprocess/include -isystem /usr/include/apr-1.0 -isystem /mesos/build/3rdparty/boost-1.53.0/src/boost-1.53.0 -isystem /mesos/build/3rdparty/elfio-3.2/src/elfio-3.2 -isystem /mesos/build/3rdparty/glog-0.3.3/src/glog-0.3.3-lib/lib/include -isystem /mesos/build/3rdparty/nvml-352.79/src/nvml-352.79 -isystem /mesos/build/3rdparty/picojson-1.3.0/src/picojson-1.3.0 -isystem /usr/include/subversion-1 -isystem /mesos/3rdparty/stout/include -isystem /mesos/build/3rdparty/http_parser-2.6.2/src/http_parser-2.6.2 -isystem /mesos/build/3rdparty/libevent-2.1.5-beta/src/libevent-2.1.5-beta-lib/lib/include -isystem /mesos/build/3rdparty/zookeeper-3.4.8/src/zookeeper-3.4.8/src/c/include -isystem /mesos/build/3rdparty/zookeeper-3.4.8/src/zookeeper-3.4.8/src/c/generated -isystem /mesos/build/3rdparty/leveldb-1.19/src/leveldb-1.19/include -I/mesos/include    -o CMakeFiles/mesos-1.3.0.dir/slave/containerizer/mesos/provisioner/appc/paths.cpp.o -c /mesos/src/slave/containerizer/mesos/provisioner/appc/paths.cpp
/usr/bin/cmake -E cmake_progress_report /mesos/build/CMakeFiles 
[ 46%] Building CXX object src/CMakeFiles/mesos-1.3.0.dir/slave/containerizer/mesos/provisioner/appc/store.cpp.o
cd /mesos/build/src && /usr/bin/g++   -DBUILD_FLAGS=\"\" -DBUILD_JAVA_JVM_LIBRARY=\"\" -DHAS_AUTHENTICATION=1 -DLIBDIR=\"/usr/local/libmesos\" -DPICOJSON_USE_INT64 -DPKGDATADIR=\"/usr/local/share/mesos\" -DPKGLIBEXECDIR=\"/usr/local/libexec/mesos\" -DUSE_CMAKE_BUILD_CONFIG -DUSE_STATIC_LIB -DVERSION=\"1.3.0\" -D__STDC_FORMAT_MACROS -Dmesos_1_3_0_EXPORTS -O2 -std=c++11 -g -fPIC -I/mesos/build/include -I/mesos/build/include/mesos -I/mesos/build/src -I/mesos/src -isystem /mesos/build/3rdparty/protobuf-2.6.1/src/protobuf-2.6.1-lib/lib/include -isystem /mesos/3rdparty/libprocess/include -isystem /usr/include/apr-1.0 -isystem /mesos/build/3rdparty/boost-1.53.0/src/boost-1.53.0 -isystem /mesos/build/3rdparty/elfio-3.2/src/elfio-3.2 -isystem /mesos/build/3rdparty/glog-0.3.3/src/glog-0.3.3-lib/lib/include -isystem /mesos/build/3rdparty/nvml-352.79/src/nvml-352.79 -isystem /mesos/build/3rdparty/picojson-1.3.0/src/picojson-1.3.0 -isystem /usr/include/subversion-1 -isystem /mesos/3rdparty/stout/include -isystem /mesos/build/3rdparty/http_parser-2.6.2/src/http_parser-2.6.2 -isystem /mesos/build/3rdparty/libevent-2.1.5-beta/src/libevent-2.1.5-beta-lib/lib/include -isystem /mesos/build/3rdparty/zookeeper-3.4.8/src/zookeeper-3.4.8/src/c/include -isystem /mesos/build/3rdparty/zookeeper-3.4.8/src/zookeeper-3.4.8/src/c/generated -isystem /mesos/build/3rdparty/leveldb-1.19/src/leveldb-1.19/include -I/mesos/include    -o CMakeFiles/mesos-1.3.0.dir/slave/containerizer/mesos/provisioner/appc/store.cpp.o -c /mesos/src/slave/containerizer/mesos/provisioner/appc/store.cpp
/usr/bin/cmake -E cmake_progress_report /mesos/build/CMakeFiles 
[ 46%] Building CXX object 3rdparty/libprocess/src/tests/CMakeFiles/libprocess-tests.dir/sequence_tests.cpp.o
cd /mesos/build/3rdparty/libprocess/src/tests && /usr/bin/g++   -DBUILD_DIR=\"/mesos/build/3rdparty/libprocess/src/tests\" -DBUILD_FLAGS=\"\" -DBUILD_JAVA_JVM_LIBRARY=\"\" -DHAS_AUTHENTICATION=1 -DLIBDIR=\"/usr/local/libmesos\" -DPICOJSON_USE_INT64 -DPKGDATADIR=\"/usr/local/share/mesos\" -DPKGLIBEXECDIR=\"/usr/local/libexec/mesos\" -DUSE_CMAKE_BUILD_CONFIG -DUSE_STATIC_LIB -DVERSION=\"1.3.0\" -D__STDC_FORMAT_MACROS -O2 -std=c++11 -g -fPIE -I/usr/include/apr-1.0 -I/mesos/build/3rdparty/boost-1.53.0/src/boost-1.53.0 -I/mesos/build/3rdparty/elfio-3.2/src/elfio-3.2 -I/mesos/build/3rdparty/glog-0.3.3/src/glog-0.3.3-lib/lib/include -I/mesos/build/3rdparty/nvml-352.79/src/nvml-352.79 -I/mesos/build/3rdparty/picojson-1.3.0/src/picojson-1.3.0 -I/mesos/build/3rdparty/protobuf-2.6.1/src/protobuf-2.6.1-lib/lib/include -I/usr/include/subversion-1 -I/mesos/3rdparty/stout/include -I/mesos/build/3rdparty/http_parser-2.6.2/src/http_parser-2.6.2 -I/mesos/build/3rdparty/libevent-2.1.5-beta/src/libevent-2.1.5-beta-lib/lib/include -I/mesos/build/3rdparty/gmock-1.7.0/src/gmock-1.7.0/include -I/mesos/build/3rdparty/gmock-1.7.0/src/gmock-1.7.0/gtest/include -I/mesos/3rdparty/libprocess/src/tests/src -I/mesos/3rdparty/libprocess/include -I/mesos/3rdparty/libprocess/src/tests/..    -o CMakeFiles/libprocess-tests.dir/sequence_tests.cpp.o -c /mesos/3rdparty/libprocess/src/tests/sequence_tests.cpp
/usr/bin/cmake -E cmake_progress_report /mesos/build/CMakeFiles 
[ 46%] Building CXX object src/CMakeFiles/mesos-1.3.0.dir/slave/containerizer/mesos/provisioner/backends/copy.cpp.o
cd /mesos/build/src && /usr/bin/g++   -DBUILD_FLAGS=\"\" -DBUILD_JAVA_JVM_LIBRARY=\"\" -DHAS_AUTHENTICATION=1 -DLIBDIR=\"/usr/local/libmesos\" -DPICOJSON_USE_INT64 -DPKGDATADIR=\"/usr/local/share/mesos\" -DPKGLIBEXECDIR=\"/usr/local/libexec/mesos\" -DUSE_CMAKE_BUILD_CONFIG -DUSE_STATIC_LIB -DVERSION=\"1.3.0\" -D__STDC_FORMAT_MACROS -Dmesos_1_3_0_EXPORTS -O2 -std=c++11 -g -fPIC -I/mesos/build/include -I/mesos/build/include/mesos -I/mesos/build/src -I/mesos/src -isystem /mesos/build/3rdparty/protobuf-2.6.1/src/protobuf-2.6.1-lib/lib/include -isystem /mesos/3rdparty/libprocess/include -isystem /usr/include/apr-1.0 -isystem /mesos/build/3rdparty/boost-1.53.0/src/boost-1.53.0 -isystem /mesos/build/3rdparty/elfio-3.2/src/elfio-3.2 -isystem /mesos/build/3rdparty/glog-0.3.3/src/glog-0.3.3-lib/lib/include -isystem /mesos/build/3rdparty/nvml-352.79/src/nvml-352.79 -isystem /mesos/build/3rdparty/picojson-1.3.0/src/picojson-1.3.0 -isystem /usr/include/subversion-1 -isystem /mesos/3rdparty/stout/include -isystem /mesos/build/3rdparty/http_parser-2.6.2/src/http_parser-2.6.2 -isystem /mesos/build/3rdparty/libevent-2.1.5-beta/src/libevent-2.1.5-beta-lib/lib/include -isystem /mesos/build/3rdparty/zookeeper-3.4.8/src/zookeeper-3.4.8/src/c/include -isystem /mesos/build/3rdparty/zookeeper-3.4.8/src/zookeeper-3.4.8/src/c/generated -isystem /mesos/build/3rdparty/leveldb-1.19/src/leveldb-1.19/include -I/mesos/include    -o CMakeFiles/mesos-1.3.0.dir/slave/containerizer/mesos/provisioner/backends/copy.cpp.o -c /mesos/src/slave/containerizer/mesos/provisioner/backends/copy.cpp
/usr/bin/cmake -E cmake_progress_report /mesos/build/CMakeFiles 
[ 46%] Building CXX object 3rdparty/libprocess/src/tests/CMakeFiles/libprocess-tests.dir/shared_tests.cpp.o
cd /mesos/build/3rdparty/libprocess/src/tests && /usr/bin/g++   -DBUILD_DIR=\"/mesos/build/3rdparty/libprocess/src/tests\" -DBUILD_FLAGS=\"\" -DBUILD_JAVA_JVM_LIBRARY=\"\" -DHAS_AUTHENTICATION=1 -DLIBDIR=\"/usr/local/libmesos\" -DPICOJSON_USE_INT64 -DPKGDATADIR=\"/usr/local/share/mesos\" -DPKGLIBEXECDIR=\"/usr/local/libexec/mesos\" -DUSE_CMAKE_BUILD_CONFIG -DUSE_STATIC_LIB -DVERSION=\"1.3.0\" -D__STDC_FORMAT_MACROS -O2 -std=c++11 -g -fPIE -I/usr/include/apr-1.0 -I/mesos/build/3rdparty/boost-1.53.0/src/boost-1.53.0 -I/mesos/build/3rdparty/elfio-3.2/src/elfio-3.2 -I/mesos/build/3rdparty/glog-0.3.3/src/glog-0.3.3-lib/lib/include -I/mesos/build/3rdparty/nvml-352.79/src/nvml-352.79 -I/mesos/build/3rdparty/picojson-1.3.0/src/picojson-1.3.0 -I/mesos/build/3rdparty/protobuf-2.6.1/src/protobuf-2.6.1-lib/lib/include -I/usr/include/subversion-1 -I/mesos/3rdparty/stout/include -I/mesos/build/3rdparty/http_parser-2.6.2/src/http_parser-2.6.2 -I/mesos/build/3rdparty/libevent-2.1.5-beta/src/libevent-2.1.5-beta-lib/lib/include -I/mesos/build/3rdparty/gmock-1.7.0/src/gmock-1.7.0/include -I/mesos/build/3rdparty/gmock-1.7.0/src/gmock-1.7.0/gtest/include -I/mesos/3rdparty/libprocess/src/tests/src -I/mesos/3rdparty/libprocess/include -I/mesos/3rdparty/libprocess/src/tests/..    -o CMakeFiles/libprocess-tests.dir/shared_tests.cpp.o -c /mesos/3rdparty/libprocess/src/tests/shared_tests.cpp
/usr/bin/cmake -E cmake_progress_report /mesos/build/CMakeFiles 
[ 46%] Building CXX object src/CMakeFiles/mesos-1.3.0.dir/slave/containerizer/mesos/provisioner/docker/local_puller.cpp.o
cd /mesos/build/src && /usr/bin/g++   -DBUILD_FLAGS=\"\" -DBUILD_JAVA_JVM_LIBRARY=\"\" -DHAS_AUTHENTICATION=1 -DLIBDIR=\"/usr/local/libmesos\" -DPICOJSON_USE_INT64 -DPKGDATADIR=\"/usr/local/share/mesos\" -DPKGLIBEXECDIR=\"/usr/local/libexec/mesos\" -DUSE_CMAKE_BUILD_CONFIG -DUSE_STATIC_LIB -DVERSION=\"1.3.0\" -D__STDC_FORMAT_MACROS -Dmesos_1_3_0_EXPORTS -O2 -std=c++11 -g -fPIC -I/mesos/build/include -I/mesos/build/include/mesos -I/mesos/build/src -I/mesos/src -isystem /mesos/build/3rdparty/protobuf-2.6.1/src/protobuf-2.6.1-lib/lib/include -isystem /mesos/3rdparty/libprocess/include -isystem /usr/include/apr-1.0 -isystem /mesos/build/3rdparty/boost-1.53.0/src/boost-1.53.0 -isystem /mesos/build/3rdparty/elfio-3.2/src/elfio-3.2 -isystem /mesos/build/3rdparty/glog-0.3.3/src/glog-0.3.3-lib/lib/include -isystem /mesos/build/3rdparty/nvml-352.79/src/nvml-352.79 -isystem /mesos/build/3rdparty/picojson-1.3.0/src/picojson-1.3.0 -isystem /usr/include/subversion-1 -isystem /mesos/3rdparty/stout/include -isystem /mesos/build/3rdparty/http_parser-2.6.2/src/http_parser-2.6.2 -isystem /mesos/build/3rdparty/libevent-2.1.5-beta/src/libevent-2.1.5-beta-lib/lib/include -isystem /mesos/build/3rdparty/zookeeper-3.4.8/src/zookeeper-3.4.8/src/c/include -isystem /mesos/build/3rdparty/zookeeper-3.4.8/src/zookeeper-3.4.8/src/c/generated -isystem /mesos/build/3rdparty/leveldb-1.19/src/leveldb-1.19/include -I/mesos/include    -o CMakeFiles/mesos-1.3.0.dir/slave/containerizer/mesos/provisioner/docker/local_puller.cpp.o -c /mesos/src/slave/containerizer/mesos/provisioner/docker/local_puller.cpp
/usr/bin/cmake -E cmake_progress_report /mesos/build/CMakeFiles 
[ 46%] Building CXX object 3rdparty/libprocess/src/tests/CMakeFiles/libprocess-tests.dir/socket_tests.cpp.o
cd /mesos/build/3rdparty/libprocess/src/tests && /usr/bin/g++   -DBUILD_DIR=\"/mesos/build/3rdparty/libprocess/src/tests\" -DBUILD_FLAGS=\"\" -DBUILD_JAVA_JVM_LIBRARY=\"\" -DHAS_AUTHENTICATION=1 -DLIBDIR=\"/usr/local/libmesos\" -DPICOJSON_USE_INT64 -DPKGDATADIR=\"/usr/local/share/mesos\" -DPKGLIBEXECDIR=\"/usr/local/libexec/mesos\" -DUSE_CMAKE_BUILD_CONFIG -DUSE_STATIC_LIB -DVERSION=\"1.3.0\" -D__STDC_FORMAT_MACROS -O2 -std=c++11 -g -fPIE -I/usr/include/apr-1.0 -I/mesos/build/3rdparty/boost-1.53.0/src/boost-1.53.0 -I/mesos/build/3rdparty/elfio-3.2/src/elfio-3.2 -I/mesos/build/3rdparty/glog-0.3.3/src/glog-0.3.3-lib/lib/include -I/mesos/build/3rdparty/nvml-352.79/src/nvml-352.79 -I/mesos/build/3rdparty/picojson-1.3.0/src/picojson-1.3.0 -I/mesos/build/3rdparty/protobuf-2.6.1/src/protobuf-2.6.1-lib/lib/include -I/usr/include/subversion-1 -I/mesos/3rdparty/stout/include -I/mesos/build/3rdparty/http_parser-2.6.2/src/http_parser-2.6.2 -I/mesos/build/3rdparty/libevent-2.1.5-beta/src/libevent-2.1.5-beta-lib/lib/include -I/mesos/build/3rdparty/gmock-1.7.0/src/gmock-1.7.0/include -I/mesos/build/3rdparty/gmock-1.7.0/src/gmock-1.7.0/gtest/include -I/mesos/3rdparty/libprocess/src/tests/src -I/mesos/3rdparty/libprocess/include -I/mesos/3rdparty/libprocess/src/tests/..    -o CMakeFiles/libprocess-tests.dir/socket_tests.cpp.o -c /mesos/3rdparty/libprocess/src/tests/socket_tests.cpp
/usr/bin/cmake -E cmake_progress_report /mesos/build/CMakeFiles 
[ 46%] Building CXX object 3rdparty/libprocess/src/tests/CMakeFiles/libprocess-tests.dir/statistics_tests.cpp.o
cd /mesos/build/3rdparty/libprocess/src/tests && /usr/bin/g++   -DBUILD_DIR=\"/mesos/build/3rdparty/libprocess/src/tests\" -DBUILD_FLAGS=\"\" -DBUILD_JAVA_JVM_LIBRARY=\"\" -DHAS_AUTHENTICATION=1 -DLIBDIR=\"/usr/local/libmesos\" -DPICOJSON_USE_INT64 -DPKGDATADIR=\"/usr/local/share/mesos\" -DPKGLIBEXECDIR=\"/usr/local/libexec/mesos\" -DUSE_CMAKE_BUILD_CONFIG -DUSE_STATIC_LIB -DVERSION=\"1.3.0\" -D__STDC_FORMAT_MACROS -O2 -std=c++11 -g -fPIE -I/usr/include/apr-1.0 -I/mesos/build/3rdparty/boost-1.53.0/src/boost-1.53.0 -I/mesos/build/3rdparty/elfio-3.2/src/elfio-3.2 -I/mesos/build/3rdparty/glog-0.3.3/src/glog-0.3.3-lib/lib/include -I/mesos/build/3rdparty/nvml-352.79/src/nvml-352.79 -I/mesos/build/3rdparty/picojson-1.3.0/src/picojson-1.3.0 -I/mesos/build/3rdparty/protobuf-2.6.1/src/protobuf-2.6.1-lib/lib/include -I/usr/include/subversion-1 -I/mesos/3rdparty/stout/include -I/mesos/build/3rdparty/http_parser-2.6.2/src/http_parser-2.6.2 -I/mesos/build/3rdparty/libevent-2.1.5-beta/src/libevent-2.1.5-beta-lib/lib/include -I/mesos/build/3rdparty/gmock-1.7.0/src/gmock-1.7.0/include -I/mesos/build/3rdparty/gmock-1.7.0/src/gmock-1.7.0/gtest/include -I/mesos/3rdparty/libprocess/src/tests/src -I/mesos/3rdparty/libprocess/include -I/mesos/3rdparty/libprocess/src/tests/..    -o CMakeFiles/libprocess-tests.dir/statistics_tests.cpp.o -c /mesos/3rdparty/libprocess/src/tests/statistics_tests.cpp
/usr/bin/cmake -E cmake_progress_report /mesos/build/CMakeFiles 
[ 46%] Building CXX object 3rdparty/libprocess/src/tests/CMakeFiles/libprocess-tests.dir/subprocess_tests.cpp.o
cd /mesos/build/3rdparty/libprocess/src/tests && /usr/bin/g++   -DBUILD_DIR=\"/mesos/build/3rdparty/libprocess/src/tests\" -DBUILD_FLAGS=\"\" -DBUILD_JAVA_JVM_LIBRARY=\"\" -DHAS_AUTHENTICATION=1 -DLIBDIR=\"/usr/local/libmesos\" -DPICOJSON_USE_INT64 -DPKGDATADIR=\"/usr/local/share/mesos\" -DPKGLIBEXECDIR=\"/usr/local/libexec/mesos\" -DUSE_CMAKE_BUILD_CONFIG -DUSE_STATIC_LIB -DVERSION=\"1.3.0\" -D__STDC_FORMAT_MACROS -O2 -std=c++11 -g -fPIE -I/usr/include/apr-1.0 -I/mesos/build/3rdparty/boost-1.53.0/src/boost-1.53.0 -I/mesos/build/3rdparty/elfio-3.2/src/elfio-3.2 -I/mesos/build/3rdparty/glog-0.3.3/src/glog-0.3.3-lib/lib/include -I/mesos/build/3rdparty/nvml-352.79/src/nvml-352.79 -I/mesos/build/3rdparty/picojson-1.3.0/src/picojson-1.3.0 -I/mesos/build/3rdparty/protobuf-2.6.1/src/protobuf-2.6.1-lib/lib/include -I/usr/include/subversion-1 -I/mesos/3rdparty/stout/include -I/mesos/build/3rdparty/http_parser-2.6.2/src/http_parser-2.6.2 -I/mesos/build/3rdparty/libevent-2.1.5-beta/src/libevent-2.1.5-beta-lib/lib/include -I/mesos/build/3rdparty/gmock-1.7.0/src/gmock-1.7.0/include -I/mesos/build/3rdparty/gmock-1.7.0/src/gmock-1.7.0/gtest/include -I/mesos/3rdparty/libprocess/src/tests/src -I/mesos/3rdparty/libprocess/include -I/mesos/3rdparty/libprocess/src/tests/..    -o CMakeFiles/libprocess-tests.dir/subprocess_tests.cpp.o -c /mesos/3rdparty/libprocess/src/tests/subprocess_tests.cpp
/usr/bin/cmake -E cmake_progress_report /mesos/build/CMakeFiles 
[ 46%] Building CXX object src/CMakeFiles/mesos-1.3.0.dir/slave/containerizer/mesos/provisioner/docker/metadata_manager.cpp.o
cd /mesos/build/src && /usr/bin/g++   -DBUILD_FLAGS=\"\" -DBUILD_JAVA_JVM_LIBRARY=\"\" -DHAS_AUTHENTICATION=1 -DLIBDIR=\"/usr/local/libmesos\" -DPICOJSON_USE_INT64 -DPKGDATADIR=\"/usr/local/share/mesos\" -DPKGLIBEXECDIR=\"/usr/local/libexec/mesos\" -DUSE_CMAKE_BUILD_CONFIG -DUSE_STATIC_LIB -DVERSION=\"1.3.0\" -D__STDC_FORMAT_MACROS -Dmesos_1_3_0_EXPORTS -O2 -std=c++11 -g -fPIC -I/mesos/build/include -I/mesos/build/include/mesos -I/mesos/build/src -I/mesos/src -isystem /mesos/build/3rdparty/protobuf-2.6.1/src/protobuf-2.6.1-lib/lib/include -isystem /mesos/3rdparty/libprocess/include -isystem /usr/include/apr-1.0 -isystem /mesos/build/3rdparty/boost-1.53.0/src/boost-1.53.0 -isystem /mesos/build/3rdparty/elfio-3.2/src/elfio-3.2 -isystem /mesos/build/3rdparty/glog-0.3.3/src/glog-0.3.3-lib/lib/include -isystem /mesos/build/3rdparty/nvml-352.79/src/nvml-352.79 -isystem /mesos/build/3rdparty/picojson-1.3.0/src/picojson-1.3.0 -isystem /usr/include/subversion-1 -isystem /mesos/3rdparty/stout/include -isystem /mesos/build/3rdparty/http_parser-2.6.2/src/http_parser-2.6.2 -isystem /mesos/build/3rdparty/libevent-2.1.5-beta/src/libevent-2.1.5-beta-lib/lib/include -isystem /mesos/build/3rdparty/zookeeper-3.4.8/src/zookeeper-3.4.8/src/c/include -isystem /mesos/build/3rdparty/zookeeper-3.4.8/src/zookeeper-3.4.8/src/c/generated -isystem /mesos/build/3rdparty/leveldb-1.19/src/leveldb-1.19/include -I/mesos/include    -o CMakeFiles/mesos-1.3.0.dir/slave/containerizer/mesos/provisioner/docker/metadata_manager.cpp.o -c /mesos/src/slave/containerizer/mesos/provisioner/docker/metadata_manager.cpp
/usr/bin/cmake -E cmake_progress_report /mesos/build/CMakeFiles 
[ 46%] Building CXX object src/CMakeFiles/mesos-1.3.0.dir/slave/containerizer/mesos/provisioner/docker/paths.cpp.o
cd /mesos/build/src && /usr/bin/g++   -DBUILD_FLAGS=\"\" -DBUILD_JAVA_JVM_LIBRARY=\"\" -DHAS_AUTHENTICATION=1 -DLIBDIR=\"/usr/local/libmesos\" -DPICOJSON_USE_INT64 -DPKGDATADIR=\"/usr/local/share/mesos\" -DPKGLIBEXECDIR=\"/usr/local/libexec/mesos\" -DUSE_CMAKE_BUILD_CONFIG -DUSE_STATIC_LIB -DVERSION=\"1.3.0\" -D__STDC_FORMAT_MACROS -Dmesos_1_3_0_EXPORTS -O2 -std=c++11 -g -fPIC -I/mesos/build/include -I/mesos/build/include/mesos -I/mesos/build/src -I/mesos/src -isystem /mesos/build/3rdparty/protobuf-2.6.1/src/protobuf-2.6.1-lib/lib/include -isystem /mesos/3rdparty/libprocess/include -isystem /usr/include/apr-1.0 -isystem /mesos/build/3rdparty/boost-1.53.0/src/boost-1.53.0 -isystem /mesos/build/3rdparty/elfio-3.2/src/elfio-3.2 -isystem /mesos/build/3rdparty/glog-0.3.3/src/glog-0.3.3-lib/lib/include -isystem /mesos/build/3rdparty/nvml-352.79/src/nvml-352.79 -isystem /mesos/build/3rdparty/picojson-1.3.0/src/picojson-1.3.0 -isystem /usr/include/subversion-1 -isystem /mesos/3rdparty/stout/include -isystem /mesos/build/3rdparty/http_parser-2.6.2/src/http_parser-2.6.2 -isystem /mesos/build/3rdparty/libevent-2.1.5-beta/src/libevent-2.1.5-beta-lib/lib/include -isystem /mesos/build/3rdparty/zookeeper-3.4.8/src/zookeeper-3.4.8/src/c/include -isystem /mesos/build/3rdparty/zookeeper-3.4.8/src/zookeeper-3.4.8/src/c/generated -isystem /mesos/build/3rdparty/leveldb-1.19/src/leveldb-1.19/include -I/mesos/include    -o CMakeFiles/mesos-1.3.0.dir/slave/containerizer/mesos/provisioner/docker/paths.cpp.o -c /mesos/src/slave/containerizer/mesos/provisioner/docker/paths.cpp
/usr/bin/cmake -E cmake_progress_report /mesos/build/CMakeFiles 21
[ 47%] Building CXX object src/CMakeFiles/mesos-1.3.0.dir/slave/containerizer/mesos/provisioner/docker/puller.cpp.o
cd /mesos/build/src && /usr/bin/g++   -DBUILD_FLAGS=\"\" -DBUILD_JAVA_JVM_LIBRARY=\"\" -DHAS_AUTHENTICATION=1 -DLIBDIR=\"/usr/local/libmesos\" -DPICOJSON_USE_INT64 -DPKGDATADIR=\"/usr/local/share/mesos\" -DPKGLIBEXECDIR=\"/usr/local/libexec/mesos\" -DUSE_CMAKE_BUILD_CONFIG -DUSE_STATIC_LIB -DVERSION=\"1.3.0\" -D__STDC_FORMAT_MACROS -Dmesos_1_3_0_EXPORTS -O2 -std=c++11 -g -fPIC -I/mesos/build/include -I/mesos/build/include/mesos -I/mesos/build/src -I/mesos/src -isystem /mesos/build/3rdparty/protobuf-2.6.1/src/protobuf-2.6.1-lib/lib/include -isystem /mesos/3rdparty/libprocess/include -isystem /usr/include/apr-1.0 -isystem /mesos/build/3rdparty/boost-1.53.0/src/boost-1.53.0 -isystem /mesos/build/3rdparty/elfio-3.2/src/elfio-3.2 -isystem /mesos/build/3rdparty/glog-0.3.3/src/glog-0.3.3-lib/lib/include -isystem /mesos/build/3rdparty/nvml-352.79/src/nvml-352.79 -isystem /mesos/build/3rdparty/picojson-1.3.0/src/picojson-1.3.0 -isystem /usr/include/subversion-1 -isystem /mesos/3rdparty/stout/include -isystem /mesos/build/3rdparty/http_parser-2.6.2/src/http_parser-2.6.2 -isystem /mesos/build/3rdparty/libevent-2.1.5-beta/src/libevent-2.1.5-beta-lib/lib/include -isystem /mesos/build/3rdparty/zookeeper-3.4.8/src/zookeeper-3.4.8/src/c/include -isystem /mesos/build/3rdparty/zookeeper-3.4.8/src/zookeeper-3.4.8/src/c/generated -isystem /mesos/build/3rdparty/leveldb-1.19/src/leveldb-1.19/include -I/mesos/include    -o CMakeFiles/mesos-1.3.0.dir/slave/containerizer/mesos/provisioner/docker/puller.cpp.o -c /mesos/src/slave/containerizer/mesos/provisioner/docker/puller.cpp
/usr/bin/cmake -E cmake_progress_report /mesos/build/CMakeFiles 13
[ 48%] Building CXX object 3rdparty/libprocess/src/tests/CMakeFiles/libprocess-tests.dir/system_tests.cpp.o
cd /mesos/build/3rdparty/libprocess/src/tests && /usr/bin/g++   -DBUILD_DIR=\"/mesos/build/3rdparty/libprocess/src/tests\" -DBUILD_FLAGS=\"\" -DBUILD_JAVA_JVM_LIBRARY=\"\" -DHAS_AUTHENTICATION=1 -DLIBDIR=\"/usr/local/libmesos\" -DPICOJSON_USE_INT64 -DPKGDATADIR=\"/usr/local/share/mesos\" -DPKGLIBEXECDIR=\"/usr/local/libexec/mesos\" -DUSE_CMAKE_BUILD_CONFIG -DUSE_STATIC_LIB -DVERSION=\"1.3.0\" -D__STDC_FORMAT_MACROS -O2 -std=c++11 -g -fPIE -I/usr/include/apr-1.0 -I/mesos/build/3rdparty/boost-1.53.0/src/boost-1.53.0 -I/mesos/build/3rdparty/elfio-3.2/src/elfio-3.2 -I/mesos/build/3rdparty/glog-0.3.3/src/glog-0.3.3-lib/lib/include -I/mesos/build/3rdparty/nvml-352.79/src/nvml-352.79 -I/mesos/build/3rdparty/picojson-1.3.0/src/picojson-1.3.0 -I/mesos/build/3rdparty/protobuf-2.6.1/src/protobuf-2.6.1-lib/lib/include -I/usr/include/subversion-1 -I/mesos/3rdparty/stout/include -I/mesos/build/3rdparty/http_parser-2.6.2/src/http_parser-2.6.2 -I/mesos/build/3rdparty/libevent-2.1.5-beta/src/libevent-2.1.5-beta-lib/lib/include -I/mesos/build/3rdparty/gmock-1.7.0/src/gmock-1.7.0/include -I/mesos/build/3rdparty/gmock-1.7.0/src/gmock-1.7.0/gtest/include -I/mesos/3rdparty/libprocess/src/tests/src -I/mesos/3rdparty/libprocess/include -I/mesos/3rdparty/libprocess/src/tests/..    -o CMakeFiles/libprocess-tests.dir/system_tests.cpp.o -c /mesos/3rdparty/libprocess/src/tests/system_tests.cpp
/usr/bin/cmake -E cmake_progress_report /mesos/build/CMakeFiles 
[ 48%] Building CXX object 3rdparty/libprocess/src/tests/CMakeFiles/libprocess-tests.dir/time_tests.cpp.o
cd /mesos/build/3rdparty/libprocess/src/tests && /usr/bin/g++   -DBUILD_DIR=\"/mesos/build/3rdparty/libprocess/src/tests\" -DBUILD_FLAGS=\"\" -DBUILD_JAVA_JVM_LIBRARY=\"\" -DHAS_AUTHENTICATION=1 -DLIBDIR=\"/usr/local/libmesos\" -DPICOJSON_USE_INT64 -DPKGDATADIR=\"/usr/local/share/mesos\" -DPKGLIBEXECDIR=\"/usr/local/libexec/mesos\" -DUSE_CMAKE_BUILD_CONFIG -DUSE_STATIC_LIB -DVERSION=\"1.3.0\" -D__STDC_FORMAT_MACROS -O2 -std=c++11 -g -fPIE -I/usr/include/apr-1.0 -I/mesos/build/3rdparty/boost-1.53.0/src/boost-1.53.0 -I/mesos/build/3rdparty/elfio-3.2/src/elfio-3.2 -I/mesos/build/3rdparty/glog-0.3.3/src/glog-0.3.3-lib/lib/include -I/mesos/build/3rdparty/nvml-352.79/src/nvml-352.79 -I/mesos/build/3rdparty/picojson-1.3.0/src/picojson-1.3.0 -I/mesos/build/3rdparty/protobuf-2.6.1/src/protobuf-2.6.1-lib/lib/include -I/usr/include/subversion-1 -I/mesos/3rdparty/stout/include -I/mesos/build/3rdparty/http_parser-2.6.2/src/http_parser-2.6.2 -I/mesos/build/3rdparty/libevent-2.1.5-beta/src/libevent-2.1.5-beta-lib/lib/include -I/mesos/build/3rdparty/gmock-1.7.0/src/gmock-1.7.0/include -I/mesos/build/3rdparty/gmock-1.7.0/src/gmock-1.7.0/gtest/include -I/mesos/3rdparty/libprocess/src/tests/src -I/mesos/3rdparty/libprocess/include -I/mesos/3rdparty/libprocess/src/tests/..    -o CMakeFiles/libprocess-tests.dir/time_tests.cpp.o -c /mesos/3rdparty/libprocess/src/tests/time_tests.cpp
/usr/bin/cmake -E cmake_progress_report /mesos/build/CMakeFiles 
[ 48%] Building CXX object src/CMakeFiles/mesos-1.3.0.dir/slave/containerizer/mesos/provisioner/docker/registry_puller.cpp.o
cd /mesos/build/src && /usr/bin/g++   -DBUILD_FLAGS=\"\" -DBUILD_JAVA_JVM_LIBRARY=\"\" -DHAS_AUTHENTICATION=1 -DLIBDIR=\"/usr/local/libmesos\" -DPICOJSON_USE_INT64 -DPKGDATADIR=\"/usr/local/share/mesos\" -DPKGLIBEXECDIR=\"/usr/local/libexec/mesos\" -DUSE_CMAKE_BUILD_CONFIG -DUSE_STATIC_LIB -DVERSION=\"1.3.0\" -D__STDC_FORMAT_MACROS -Dmesos_1_3_0_EXPORTS -O2 -std=c++11 -g -fPIC -I/mesos/build/include -I/mesos/build/include/mesos -I/mesos/build/src -I/mesos/src -isystem /mesos/build/3rdparty/protobuf-2.6.1/src/protobuf-2.6.1-lib/lib/include -isystem /mesos/3rdparty/libprocess/include -isystem /usr/include/apr-1.0 -isystem /mesos/build/3rdparty/boost-1.53.0/src/boost-1.53.0 -isystem /mesos/build/3rdparty/elfio-3.2/src/elfio-3.2 -isystem /mesos/build/3rdparty/glog-0.3.3/src/glog-0.3.3-lib/lib/include -isystem /mesos/build/3rdparty/nvml-352.79/src/nvml-352.79 -isystem /mesos/build/3rdparty/picojson-1.3.0/src/picojson-1.3.0 -isystem /usr/include/subversion-1 -isystem /mesos/3rdparty/stout/include -isystem /mesos/build/3rdparty/http_parser-2.6.2/src/http_parser-2.6.2 -isystem /mesos/build/3rdparty/libevent-2.1.5-beta/src/libevent-2.1.5-beta-lib/lib/include -isystem /mesos/build/3rdparty/zookeeper-3.4.8/src/zookeeper-3.4.8/src/c/include -isystem /mesos/build/3rdparty/zookeeper-3.4.8/src/zookeeper-3.4.8/src/c/generated -isystem /mesos/build/3rdparty/leveldb-1.19/src/leveldb-1.19/include -I/mesos/include    -o CMakeFiles/mesos-1.3.0.dir/slave/containerizer/mesos/provisioner/docker/registry_puller.cpp.o -c /mesos/src/slave/containerizer/mesos/provisioner/docker/registry_puller.cpp
/usr/bin/cmake -E cmake_progress_report /mesos/build/CMakeFiles 
[ 48%] Building CXX object 3rdparty/libprocess/src/tests/CMakeFiles/libprocess-tests.dir/timeseries_tests.cpp.o
cd /mesos/build/3rdparty/libprocess/src/tests && /usr/bin/g++   -DBUILD_DIR=\"/mesos/build/3rdparty/libprocess/src/tests\" -DBUILD_FLAGS=\"\" -DBUILD_JAVA_JVM_LIBRARY=\"\" -DHAS_AUTHENTICATION=1 -DLIBDIR=\"/usr/local/libmesos\" -DPICOJSON_USE_INT64 -DPKGDATADIR=\"/usr/local/share/mesos\" -DPKGLIBEXECDIR=\"/usr/local/libexec/mesos\" -DUSE_CMAKE_BUILD_CONFIG -DUSE_STATIC_LIB -DVERSION=\"1.3.0\" -D__STDC_FORMAT_MACROS -O2 -std=c++11 -g -fPIE -I/usr/include/apr-1.0 -I/mesos/build/3rdparty/boost-1.53.0/src/boost-1.53.0 -I/mesos/build/3rdparty/elfio-3.2/src/elfio-3.2 -I/mesos/build/3rdparty/glog-0.3.3/src/glog-0.3.3-lib/lib/include -I/mesos/build/3rdparty/nvml-352.79/src/nvml-352.79 -I/mesos/build/3rdparty/picojson-1.3.0/src/picojson-1.3.0 -I/mesos/build/3rdparty/protobuf-2.6.1/src/protobuf-2.6.1-lib/lib/include -I/usr/include/subversion-1 -I/mesos/3rdparty/stout/include -I/mesos/build/3rdparty/http_parser-2.6.2/src/http_parser-2.6.2 -I/mesos/build/3rdparty/libevent-2.1.5-beta/src/libevent-2.1.5-beta-lib/lib/include -I/mesos/build/3rdparty/gmock-1.7.0/src/gmock-1.7.0/include -I/mesos/build/3rdparty/gmock-1.7.0/src/gmock-1.7.0/gtest/include -I/mesos/3rdparty/libprocess/src/tests/src -I/mesos/3rdparty/libprocess/include -I/mesos/3rdparty/libprocess/src/tests/..    -o CMakeFiles/libprocess-tests.dir/timeseries_tests.cpp.o -c /mesos/3rdparty/libprocess/src/tests/timeseries_tests.cpp
/usr/bin/cmake -E cmake_progress_report /mesos/build/CMakeFiles 
[ 48%] /usr/bin/cmake -E cmake_progress_report /mesos/build/CMakeFiles 
[ 48%] Building CXX object 3rdparty/libprocess/src/tests/CMakeFiles/libprocess-tests.dir/io_tests.cpp.o
cd /mesos/build/3rdparty/libprocess/src/tests && /usr/bin/g++   -DBUILD_DIR=\"/mesos/build/3rdparty/libprocess/src/tests\" -DBUILD_FLAGS=\"\" -DBUILD_JAVA_JVM_LIBRARY=\"\" -DHAS_AUTHENTICATION=1 -DLIBDIR=\"/usr/local/libmesos\" -DPICOJSON_USE_INT64 -DPKGDATADIR=\"/usr/local/share/mesos\" -DPKGLIBEXECDIR=\"/usr/local/libexec/mesos\" -DUSE_CMAKE_BUILD_CONFIG -DUSE_STATIC_LIB -DVERSION=\"1.3.0\" -D__STDC_FORMAT_MACROS -O2 -std=c++11 -g -fPIE -I/usr/include/apr-1.0 -I/mesos/build/3rdparty/boost-1.53.0/src/boost-1.53.0 -I/mesos/build/3rdparty/elfio-3.2/src/elfio-3.2 -I/mesos/build/3rdparty/glog-0.3.3/src/glog-0.3.3-lib/lib/include -I/mesos/build/3rdparty/nvml-352.79/src/nvml-352.79 -I/mesos/build/3rdparty/picojson-1.3.0/src/picojson-1.3.0 -I/mesos/build/3rdparty/protobuf-2.6.1/src/protobuf-2.6.1-lib/lib/include -I/usr/include/subversion-1 -I/mesos/3rdparty/stout/include -I/mesos/build/3rdparty/http_parser-2.6.2/src/http_parser-2.6.2 -I/mesos/build/3rdparty/libevent-2.1.5-beta/src/libevent-2.1.5-beta-lib/lib/include -I/mesos/build/3rdparty/gmock-1.7.0/src/gmock-1.7.0/include -I/mesos/build/3rdparty/gmock-1.7.0/src/gmock-1.7.0/gtest/include -I/mesos/3rdparty/libprocess/src/tests/src -I/mesos/3rdparty/libprocess/include -I/mesos/3rdparty/libprocess/src/tests/..    -o CMakeFiles/libprocess-tests.dir/io_tests.cpp.o -c /mesos/3rdparty/libprocess/src/tests/io_tests.cpp
Building CXX object 3rdparty/libprocess/src/tests/CMakeFiles/libprocess-tests.dir/reap_tests.cpp.o
cd /mesos/build/3rdparty/libprocess/src/tests && /usr/bin/g++   -DBUILD_DIR=\"/mesos/build/3rdparty/libprocess/src/tests\" -DBUILD_FLAGS=\"\" -DBUILD_JAVA_JVM_LIBRARY=\"\" -DHAS_AUTHENTICATION=1 -DLIBDIR=\"/usr/local/libmesos\" -DPICOJSON_USE_INT64 -DPKGDATADIR=\"/usr/local/share/mesos\" -DPKGLIBEXECDIR=\"/usr/local/libexec/mesos\" -DUSE_CMAKE_BUILD_CONFIG -DUSE_STATIC_LIB -DVERSION=\"1.3.0\" -D__STDC_FORMAT_MACROS -O2 -std=c++11 -g -fPIE -I/usr/include/apr-1.0 -I/mesos/build/3rdparty/boost-1.53.0/src/boost-1.53.0 -I/mesos/build/3rdparty/elfio-3.2/src/elfio-3.2 -I/mesos/build/3rdparty/glog-0.3.3/src/glog-0.3.3-lib/lib/include -I/mesos/build/3rdparty/nvml-352.79/src/nvml-352.79 -I/mesos/build/3rdparty/picojson-1.3.0/src/picojson-1.3.0 -I/mesos/build/3rdparty/protobuf-2.6.1/src/protobuf-2.6.1-lib/lib/include -I/usr/include/subversion-1 -I/mesos/3rdparty/stout/include -I/mesos/build/3rdparty/http_parser-2.6.2/src/http_parser-2.6.2 -I/mesos/build/3rdparty/libevent-2.1.5-beta/src/libevent-2.1.5-beta-lib/lib/include -I/mesos/build/3rdparty/gmock-1.7.0/src/gmock-1.7.0/include -I/mesos/build/3rdparty/gmock-1.7.0/src/gmock-1.7.0/gtest/include -I/mesos/3rdparty/libprocess/src/tests/src -I/mesos/3rdparty/libprocess/include -I/mesos/3rdparty/libprocess/src/tests/..    -o CMakeFiles/libprocess-tests.dir/reap_tests.cpp.o -c /mesos/3rdparty/libprocess/src/tests/reap_tests.cpp
/usr/bin/cmake -E cmake_progress_report /mesos/build/CMakeFiles 
[ 48%] Building CXX object src/CMakeFiles/mesos-1.3.0.dir/slave/containerizer/mesos/provisioner/docker/store.cpp.o
cd /mesos/build/src && /usr/bin/g++   -DBUILD_FLAGS=\"\" -DBUILD_JAVA_JVM_LIBRARY=\"\" -DHAS_AUTHENTICATION=1 -DLIBDIR=\"/usr/local/libmesos\" -DPICOJSON_USE_INT64 -DPKGDATADIR=\"/usr/local/share/mesos\" -DPKGLIBEXECDIR=\"/usr/local/libexec/mesos\" -DUSE_CMAKE_BUILD_CONFIG -DUSE_STATIC_LIB -DVERSION=\"1.3.0\" -D__STDC_FORMAT_MACROS -Dmesos_1_3_0_EXPORTS -O2 -std=c++11 -g -fPIC -I/mesos/build/include -I/mesos/build/include/mesos -I/mesos/build/src -I/mesos/src -isystem /mesos/build/3rdparty/protobuf-2.6.1/src/protobuf-2.6.1-lib/lib/include -isystem /mesos/3rdparty/libprocess/include -isystem /usr/include/apr-1.0 -isystem /mesos/build/3rdparty/boost-1.53.0/src/boost-1.53.0 -isystem /mesos/build/3rdparty/elfio-3.2/src/elfio-3.2 -isystem /mesos/build/3rdparty/glog-0.3.3/src/glog-0.3.3-lib/lib/include -isystem /mesos/build/3rdparty/nvml-352.79/src/nvml-352.79 -isystem /mesos/build/3rdparty/picojson-1.3.0/src/picojson-1.3.0 -isystem /usr/include/subversion-1 -isystem /mesos/3rdparty/stout/include -isystem /mesos/build/3rdparty/http_parser-2.6.2/src/http_parser-2.6.2 -isystem /mesos/build/3rdparty/libevent-2.1.5-beta/src/libevent-2.1.5-beta-lib/lib/include -isystem /mesos/build/3rdparty/zookeeper-3.4.8/src/zookeeper-3.4.8/src/c/include -isystem /mesos/build/3rdparty/zookeeper-3.4.8/src/zookeeper-3.4.8/src/c/generated -isystem /mesos/build/3rdparty/leveldb-1.19/src/leveldb-1.19/include -I/mesos/include    -o CMakeFiles/mesos-1.3.0.dir/slave/containerizer/mesos/provisioner/docker/store.cpp.o -c /mesos/src/slave/containerizer/mesos/provisioner/docker/store.cpp
/usr/bin/cmake -E cmake_progress_report /mesos/build/CMakeFiles 
[ 48%] Building CXX object src/CMakeFiles/mesos-1.3.0.dir/slave/resource_estimators/noop.cpp.o
cd /mesos/build/src && /usr/bin/g++   -DBUILD_FLAGS=\"\" -DBUILD_JAVA_JVM_LIBRARY=\"\" -DHAS_AUTHENTICATION=1 -DLIBDIR=\"/usr/local/libmesos\" -DPICOJSON_USE_INT64 -DPKGDATADIR=\"/usr/local/share/mesos\" -DPKGLIBEXECDIR=\"/usr/local/libexec/mesos\" -DUSE_CMAKE_BUILD_CONFIG -DUSE_STATIC_LIB -DVERSION=\"1.3.0\" -D__STDC_FORMAT_MACROS -Dmesos_1_3_0_EXPORTS -O2 -std=c++11 -g -fPIC -I/mesos/build/include -I/mesos/build/include/mesos -I/mesos/build/src -I/mesos/src -isystem /mesos/build/3rdparty/protobuf-2.6.1/src/protobuf-2.6.1-lib/lib/include -isystem /mesos/3rdparty/libprocess/include -isystem /usr/include/apr-1.0 -isystem /mesos/build/3rdparty/boost-1.53.0/src/boost-1.53.0 -isystem /mesos/build/3rdparty/elfio-3.2/src/elfio-3.2 -isystem /mesos/build/3rdparty/glog-0.3.3/src/glog-0.3.3-lib/lib/include -isystem /mesos/build/3rdparty/nvml-352.79/src/nvml-352.79 -isystem /mesos/build/3rdparty/picojson-1.3.0/src/picojson-1.3.0 -isystem /usr/include/subversion-1 -isystem /mesos/3rdparty/stout/include -isystem /mesos/build/3rdparty/http_parser-2.6.2/src/http_parser-2.6.2 -isystem /mesos/build/3rdparty/libevent-2.1.5-beta/src/libevent-2.1.5-beta-lib/lib/include -isystem /mesos/build/3rdparty/zookeeper-3.4.8/src/zookeeper-3.4.8/src/c/include -isystem /mesos/build/3rdparty/zookeeper-3.4.8/src/zookeeper-3.4.8/src/c/generated -isystem /mesos/build/3rdparty/leveldb-1.19/src/leveldb-1.19/include -I/mesos/include    -o CMakeFiles/mesos-1.3.0.dir/slave/resource_estimators/noop.cpp.o -c /mesos/src/slave/resource_estimators/noop.cpp
/usr/bin/cmake -E cmake_progress_report /mesos/build/CMakeFiles 
[ 48%] Building CXX object src/CMakeFiles/mesos-1.3.0.dir/slave/containerizer/mesos/isolators/docker/volume/driver.cpp.o
cd /mesos/build/src && /usr/bin/g++   -DBUILD_FLAGS=\"\" -DBUILD_JAVA_JVM_LIBRARY=\"\" -DHAS_AUTHENTICATION=1 -DLIBDIR=\"/usr/local/libmesos\" -DPICOJSON_USE_INT64 -DPKGDATADIR=\"/usr/local/share/mesos\" -DPKGLIBEXECDIR=\"/usr/local/libexec/mesos\" -DUSE_CMAKE_BUILD_CONFIG -DUSE_STATIC_LIB -DVERSION=\"1.3.0\" -D__STDC_FORMAT_MACROS -Dmesos_1_3_0_EXPORTS -O2 -std=c++11 -g -fPIC -I/mesos/build/include -I/mesos/build/include/mesos -I/mesos/build/src -I/mesos/src -isystem /mesos/build/3rdparty/protobuf-2.6.1/src/protobuf-2.6.1-lib/lib/include -isystem /mesos/3rdparty/libprocess/include -isystem /usr/include/apr-1.0 -isystem /mesos/build/3rdparty/boost-1.53.0/src/boost-1.53.0 -isystem /mesos/build/3rdparty/elfio-3.2/src/elfio-3.2 -isystem /mesos/build/3rdparty/glog-0.3.3/src/glog-0.3.3-lib/lib/include -isystem /mesos/build/3rdparty/nvml-352.79/src/nvml-352.79 -isystem /mesos/build/3rdparty/picojson-1.3.0/src/picojson-1.3.0 -isystem /usr/include/subversion-1 -isystem /mesos/3rdparty/stout/include -isystem /mesos/build/3rdparty/http_parser-2.6.2/src/http_parser-2.6.2 -isystem /mesos/build/3rdparty/libevent-2.1.5-beta/src/libevent-2.1.5-beta-lib/lib/include -isystem /mesos/build/3rdparty/zookeeper-3.4.8/src/zookeeper-3.4.8/src/c/include -isystem /mesos/build/3rdparty/zookeeper-3.4.8/src/zookeeper-3.4.8/src/c/generated -isystem /mesos/build/3rdparty/leveldb-1.19/src/leveldb-1.19/include -I/mesos/include    -o CMakeFiles/mesos-1.3.0.dir/slave/containerizer/mesos/isolators/docker/volume/driver.cpp.o -c /mesos/src/slave/containerizer/mesos/isolators/docker/volume/driver.cpp
/usr/bin/cmake -E cmake_progress_report /mesos/build/CMakeFiles 
[ 48%] Building CXX object src/CMakeFiles/mesos-1.3.0.dir/slave/containerizer/mesos/isolators/docker/volume/paths.cpp.o
cd /mesos/build/src && /usr/bin/g++   -DBUILD_FLAGS=\"\" -DBUILD_JAVA_JVM_LIBRARY=\"\" -DHAS_AUTHENTICATION=1 -DLIBDIR=\"/usr/local/libmesos\" -DPICOJSON_USE_INT64 -DPKGDATADIR=\"/usr/local/share/mesos\" -DPKGLIBEXECDIR=\"/usr/local/libexec/mesos\" -DUSE_CMAKE_BUILD_CONFIG -DUSE_STATIC_LIB -DVERSION=\"1.3.0\" -D__STDC_FORMAT_MACROS -Dmesos_1_3_0_EXPORTS -O2 -std=c++11 -g -fPIC -I/mesos/build/include -I/mesos/build/include/mesos -I/mesos/build/src -I/mesos/src -isystem /mesos/build/3rdparty/protobuf-2.6.1/src/protobuf-2.6.1-lib/lib/include -isystem /mesos/3rdparty/libprocess/include -isystem /usr/include/apr-1.0 -isystem /mesos/build/3rdparty/boost-1.53.0/src/boost-1.53.0 -isystem /mesos/build/3rdparty/elfio-3.2/src/elfio-3.2 -isystem /mesos/build/3rdparty/glog-0.3.3/src/glog-0.3.3-lib/lib/include -isystem /mesos/build/3rdparty/nvml-352.79/src/nvml-352.79 -isystem /mesos/build/3rdparty/picojson-1.3.0/src/picojson-1.3.0 -isystem /usr/include/subversion-1 -isystem /mesos/3rdparty/stout/include -isystem /mesos/build/3rdparty/http_parser-2.6.2/src/http_parser-2.6.2 -isystem /mesos/build/3rdparty/libevent-2.1.5-beta/src/libevent-2.1.5-beta-lib/lib/include -isystem /mesos/build/3rdparty/zookeeper-3.4.8/src/zookeeper-3.4.8/src/c/include -isystem /mesos/build/3rdparty/zookeeper-3.4.8/src/zookeeper-3.4.8/src/c/generated -isystem /mesos/build/3rdparty/leveldb-1.19/src/leveldb-1.19/include -I/mesos/include    -o CMakeFiles/mesos-1.3.0.dir/slave/containerizer/mesos/isolators/docker/volume/paths.cpp.o -c /mesos/src/slave/containerizer/mesos/isolators/docker/volume/paths.cpp
/usr/bin/cmake -E cmake_progress_report /mesos/build/CMakeFiles 
[ 48%] Building CXX object src/CMakeFiles/mesos-1.3.0.dir/slave/containerizer/mesos/isolators/filesystem/posix.cpp.o
cd /mesos/build/src && /usr/bin/g++   -DBUILD_FLAGS=\"\" -DBUILD_JAVA_JVM_LIBRARY=\"\" -DHAS_AUTHENTICATION=1 -DLIBDIR=\"/usr/local/libmesos\" -DPICOJSON_USE_INT64 -DPKGDATADIR=\"/usr/local/share/mesos\" -DPKGLIBEXECDIR=\"/usr/local/libexec/mesos\" -DUSE_CMAKE_BUILD_CONFIG -DUSE_STATIC_LIB -DVERSION=\"1.3.0\" -D__STDC_FORMAT_MACROS -Dmesos_1_3_0_EXPORTS -O2 -std=c++11 -g -fPIC -I/mesos/build/include -I/mesos/build/include/mesos -I/mesos/build/src -I/mesos/src -isystem /mesos/build/3rdparty/protobuf-2.6.1/src/protobuf-2.6.1-lib/lib/include -isystem /mesos/3rdparty/libprocess/include -isystem /usr/include/apr-1.0 -isystem /mesos/build/3rdparty/boost-1.53.0/src/boost-1.53.0 -isystem /mesos/build/3rdparty/elfio-3.2/src/elfio-3.2 -isystem /mesos/build/3rdparty/glog-0.3.3/src/glog-0.3.3-lib/lib/include -isystem /mesos/build/3rdparty/nvml-352.79/src/nvml-352.79 -isystem /mesos/build/3rdparty/picojson-1.3.0/src/picojson-1.3.0 -isystem /usr/include/subversion-1 -isystem /mesos/3rdparty/stout/include -isystem /mesos/build/3rdparty/http_parser-2.6.2/src/http_parser-2.6.2 -isystem /mesos/build/3rdparty/libevent-2.1.5-beta/src/libevent-2.1.5-beta-lib/lib/include -isystem /mesos/build/3rdparty/zookeeper-3.4.8/src/zookeeper-3.4.8/src/c/include -isystem /mesos/build/3rdparty/zookeeper-3.4.8/src/zookeeper-3.4.8/src/c/generated -isystem /mesos/build/3rdparty/leveldb-1.19/src/leveldb-1.19/include -I/mesos/include    -o CMakeFiles/mesos-1.3.0.dir/slave/containerizer/mesos/isolators/filesystem/posix.cpp.o -c /mesos/src/slave/containerizer/mesos/isolators/filesystem/posix.cpp
/usr/bin/cmake -E cmake_progress_report /mesos/build/CMakeFiles 22
[ 49%] Building CXX object src/CMakeFiles/mesos-1.3.0.dir/slave/containerizer/mesos/isolators/network/cni/paths.cpp.o
cd /mesos/build/src && /usr/bin/g++   -DBUILD_FLAGS=\"\" -DBUILD_JAVA_JVM_LIBRARY=\"\" -DHAS_AUTHENTICATION=1 -DLIBDIR=\"/usr/local/libmesos\" -DPICOJSON_USE_INT64 -DPKGDATADIR=\"/usr/local/share/mesos\" -DPKGLIBEXECDIR=\"/usr/local/libexec/mesos\" -DUSE_CMAKE_BUILD_CONFIG -DUSE_STATIC_LIB -DVERSION=\"1.3.0\" -D__STDC_FORMAT_MACROS -Dmesos_1_3_0_EXPORTS -O2 -std=c++11 -g -fPIC -I/mesos/build/include -I/mesos/build/include/mesos -I/mesos/build/src -I/mesos/src -isystem /mesos/build/3rdparty/protobuf-2.6.1/src/protobuf-2.6.1-lib/lib/include -isystem /mesos/3rdparty/libprocess/include -isystem /usr/include/apr-1.0 -isystem /mesos/build/3rdparty/boost-1.53.0/src/boost-1.53.0 -isystem /mesos/build/3rdparty/elfio-3.2/src/elfio-3.2 -isystem /mesos/build/3rdparty/glog-0.3.3/src/glog-0.3.3-lib/lib/include -isystem /mesos/build/3rdparty/nvml-352.79/src/nvml-352.79 -isystem /mesos/build/3rdparty/picojson-1.3.0/src/picojson-1.3.0 -isystem /usr/include/subversion-1 -isystem /mesos/3rdparty/stout/include -isystem /mesos/build/3rdparty/http_parser-2.6.2/src/http_parser-2.6.2 -isystem /mesos/build/3rdparty/libevent-2.1.5-beta/src/libevent-2.1.5-beta-lib/lib/include -isystem /mesos/build/3rdparty/zookeeper-3.4.8/src/zookeeper-3.4.8/src/c/include -isystem /mesos/build/3rdparty/zookeeper-3.4.8/src/zookeeper-3.4.8/src/c/generated -isystem /mesos/build/3rdparty/leveldb-1.19/src/leveldb-1.19/include -I/mesos/include    -o CMakeFiles/mesos-1.3.0.dir/slave/containerizer/mesos/isolators/network/cni/paths.cpp.o -c /mesos/src/slave/containerizer/mesos/isolators/network/cni/paths.cpp
Linking CXX executable libprocess-tests
cd /mesos/build/3rdparty/libprocess/src/tests && /usr/bin/cmake -E cmake_link_script CMakeFiles/libprocess-tests.dir/link.txt --verbose=1
/usr/bin/g++    -O2 -std=c++11 -g    CMakeFiles/libprocess-tests.dir/main.cpp.o CMakeFiles/libprocess-tests.dir/after_tests.cpp.o CMakeFiles/libprocess-tests.dir/collect_tests.cpp.o CMakeFiles/libprocess-tests.dir/decoder_tests.cpp.o CMakeFiles/libprocess-tests.dir/encoder_tests.cpp.o CMakeFiles/libprocess-tests.dir/future_tests.cpp.o CMakeFiles/libprocess-tests.dir/http_tests.cpp.o CMakeFiles/libprocess-tests.dir/limiter_tests.cpp.o CMakeFiles/libprocess-tests.dir/loop_tests.cpp.o CMakeFiles/libprocess-tests.dir/metrics_tests.cpp.o CMakeFiles/libprocess-tests.dir/mutex_tests.cpp.o CMakeFiles/libprocess-tests.dir/owned_tests.cpp.o CMakeFiles/libprocess-tests.dir/process_tests.cpp.o CMakeFiles/libprocess-tests.dir/queue_tests.cpp.o CMakeFiles/libprocess-tests.dir/sequence_tests.cpp.o CMakeFiles/libprocess-tests.dir/shared_tests.cpp.o CMakeFiles/libprocess-tests.dir/socket_tests.cpp.o CMakeFiles/libprocess-tests.dir/statistics_tests.cpp.o CMakeFiles/libprocess-tests.dir/subprocess_tests.cpp.o CMakeFiles/libprocess-tests.dir/system_tests.cpp.o CMakeFiles/libprocess-tests.dir/time_tests.cpp.o CMakeFiles/libprocess-tests.dir/timeseries_tests.cpp.o CMakeFiles/libprocess-tests.dir/io_tests.cpp.o CMakeFiles/libprocess-tests.dir/reap_tests.cpp.o  -o libprocess-tests  -L/mesos/build/3rdparty/glog-0.3.3/src/glog-0.3.3-lib/lib/lib  -L/mesos/build/3rdparty/protobuf-2.6.1/src/protobuf-2.6.1-lib/lib/lib  -L/mesos/build/3rdparty/http_parser-2.6.2/src/http_parser-2.6.2-build  -L/mesos/build/3rdparty/libevent-2.1.5-beta/src/libevent-2.1.5-beta-lib/lib/lib  -L/mesos/build/3rdparty/libprocess/..  -L/mesos/build/3rdparty/gmock-1.7.0/src/gmock-1.7.0-lib/lib  -L/mesos/build/3rdparty/gmock-1.7.0/src/gmock-1.7.0-build/gtest/lib/.libs -rdynamic ../libprocess-0.0.1.so.0.0.1 -lapr-1 -lcurl -lglog -lsvn_delta-1 -lsvn_diff-1 -lsvn_subr-1 -lprotobuf -ldl -lapr-1 -lrt -lhttp_parser -levent -lrt -lz -lpthread -lgmock -lgtest -lhttp_parser -levent -lz -lpthread -Wl,-rpath,/mesos/build/3rdparty/glog-0.3.3/src/glog-0.3.3-lib/lib/lib:/mesos/build/3rdparty/protobuf-2.6.1/src/protobuf-2.6.1-lib/lib/lib:/mesos/build/3rdparty/http_parser-2.6.2/src/http_parser-2.6.2-build:/mesos/build/3rdparty/libevent-2.1.5-beta/src/libevent-2.1.5-beta-lib/lib/lib:/mesos/build/3rdparty/libprocess/..:/mesos/build/3rdparty/gmock-1.7.0/src/gmock-1.7.0-lib/lib:/mesos/build/3rdparty/gmock-1.7.0/src/gmock-1.7.0-build/gtest/lib/.libs:/mesos/build/3rdparty/libprocess/src 
make[3]: Leaving directory `/mesos/build'
/usr/bin/cmake -E cmake_progress_report /mesos/build/CMakeFiles  10 11 12 13
[ 49%] Built target libprocess-tests
/usr/bin/cmake -E cmake_progress_report /mesos/build/CMakeFiles 
[ 49%] Building CXX object src/CMakeFiles/mesos-1.3.0.dir/slave/containerizer/mesos/isolators/network/cni/spec.cpp.o
cd /mesos/build/src && /usr/bin/g++   -DBUILD_FLAGS=\"\" -DBUILD_JAVA_JVM_LIBRARY=\"\" -DHAS_AUTHENTICATION=1 -DLIBDIR=\"/usr/local/libmesos\" -DPICOJSON_USE_INT64 -DPKGDATADIR=\"/usr/local/share/mesos\" -DPKGLIBEXECDIR=\"/usr/local/libexec/mesos\" -DUSE_CMAKE_BUILD_CONFIG -DUSE_STATIC_LIB -DVERSION=\"1.3.0\" -D__STDC_FORMAT_MACROS -Dmesos_1_3_0_EXPORTS -O2 -std=c++11 -g -fPIC -I/mesos/build/include -I/mesos/build/include/mesos -I/mesos/build/src -I/mesos/src -isystem /mesos/build/3rdparty/protobuf-2.6.1/src/protobuf-2.6.1-lib/lib/include -isystem /mesos/3rdparty/libprocess/include -isystem /usr/include/apr-1.0 -isystem /mesos/build/3rdparty/boost-1.53.0/src/boost-1.53.0 -isystem /mesos/build/3rdparty/elfio-3.2/src/elfio-3.2 -isystem /mesos/build/3rdparty/glog-0.3.3/src/glog-0.3.3-lib/lib/include -isystem /mesos/build/3rdparty/nvml-352.79/src/nvml-352.79 -isystem /mesos/build/3rdparty/picojson-1.3.0/src/picojson-1.3.0 -isystem /usr/include/subversion-1 -isystem /mesos/3rdparty/stout/include -isystem /mesos/build/3rdparty/http_parser-2.6.2/src/http_parser-2.6.2 -isystem /mesos/build/3rdparty/libevent-2.1.5-beta/src/libevent-2.1.5-beta-lib/lib/include -isystem /mesos/build/3rdparty/zookeeper-3.4.8/src/zookeeper-3.4.8/src/c/include -isystem /mesos/build/3rdparty/zookeeper-3.4.8/src/zookeeper-3.4.8/src/c/generated -isystem /mesos/build/3rdparty/leveldb-1.19/src/leveldb-1.19/include -I/mesos/include    -o CMakeFiles/mesos-1.3.0.dir/slave/containerizer/mesos/isolators/network/cni/spec.cpp.o -c /mesos/src/slave/containerizer/mesos/isolators/network/cni/spec.cpp
/usr/bin/cmake -E cmake_progress_report /mesos/build/CMakeFiles 
[ 49%] Building CXX object src/CMakeFiles/mesos-1.3.0.dir/slave/containerizer/mesos/isolators/posix/disk.cpp.o
cd /mesos/build/src && /usr/bin/g++   -DBUILD_FLAGS=\"\" -DBUILD_JAVA_JVM_LIBRARY=\"\" -DHAS_AUTHENTICATION=1 -DLIBDIR=\"/usr/local/libmesos\" -DPICOJSON_USE_INT64 -DPKGDATADIR=\"/usr/local/share/mesos\" -DPKGLIBEXECDIR=\"/usr/local/libexec/mesos\" -DUSE_CMAKE_BUILD_CONFIG -DUSE_STATIC_LIB -DVERSION=\"1.3.0\" -D__STDC_FORMAT_MACROS -Dmesos_1_3_0_EXPORTS -O2 -std=c++11 -g -fPIC -I/mesos/build/include -I/mesos/build/include/mesos -I/mesos/build/src -I/mesos/src -isystem /mesos/build/3rdparty/protobuf-2.6.1/src/protobuf-2.6.1-lib/lib/include -isystem /mesos/3rdparty/libprocess/include -isystem /usr/include/apr-1.0 -isystem /mesos/build/3rdparty/boost-1.53.0/src/boost-1.53.0 -isystem /mesos/build/3rdparty/elfio-3.2/src/elfio-3.2 -isystem /mesos/build/3rdparty/glog-0.3.3/src/glog-0.3.3-lib/lib/include -isystem /mesos/build/3rdparty/nvml-352.79/src/nvml-352.79 -isystem /mesos/build/3rdparty/picojson-1.3.0/src/picojson-1.3.0 -isystem /usr/include/subversion-1 -isystem /mesos/3rdparty/stout/include -isystem /mesos/build/3rdparty/http_parser-2.6.2/src/http_parser-2.6.2 -isystem /mesos/build/3rdparty/libevent-2.1.5-beta/src/libevent-2.1.5-beta-lib/lib/include -isystem /mesos/build/3rdparty/zookeeper-3.4.8/src/zookeeper-3.4.8/src/c/include -isystem /mesos/build/3rdparty/zookeeper-3.4.8/src/zookeeper-3.4.8/src/c/generated -isystem /mesos/build/3rdparty/leveldb-1.19/src/leveldb-1.19/include -I/mesos/include    -o CMakeFiles/mesos-1.3.0.dir/slave/containerizer/mesos/isolators/posix/disk.cpp.o -c /mesos/src/slave/containerizer/mesos/isolators/posix/disk.cpp
/usr/bin/cmake -E cmake_progress_report /mesos/build/CMakeFiles 
[ 49%] Building CXX object src/CMakeFiles/mesos-1.3.0.dir/slave/containerizer/mesos/isolators/posix/rlimits.cpp.o
cd /mesos/build/src && /usr/bin/g++   -DBUILD_FLAGS=\"\" -DBUILD_JAVA_JVM_LIBRARY=\"\" -DHAS_AUTHENTICATION=1 -DLIBDIR=\"/usr/local/libmesos\" -DPICOJSON_USE_INT64 -DPKGDATADIR=\"/usr/local/share/mesos\" -DPKGLIBEXECDIR=\"/usr/local/libexec/mesos\" -DUSE_CMAKE_BUILD_CONFIG -DUSE_STATIC_LIB -DVERSION=\"1.3.0\" -D__STDC_FORMAT_MACROS -Dmesos_1_3_0_EXPORTS -O2 -std=c++11 -g -fPIC -I/mesos/build/include -I/mesos/build/include/mesos -I/mesos/build/src -I/mesos/src -isystem /mesos/build/3rdparty/protobuf-2.6.1/src/protobuf-2.6.1-lib/lib/include -isystem /mesos/3rdparty/libprocess/include -isystem /usr/include/apr-1.0 -isystem /mesos/build/3rdparty/boost-1.53.0/src/boost-1.53.0 -isystem /mesos/build/3rdparty/elfio-3.2/src/elfio-3.2 -isystem /mesos/build/3rdparty/glog-0.3.3/src/glog-0.3.3-lib/lib/include -isystem /mesos/build/3rdparty/nvml-352.79/src/nvml-352.79 -isystem /mesos/build/3rdparty/picojson-1.3.0/src/picojson-1.3.0 -isystem /usr/include/subversion-1 -isystem /mesos/3rdparty/stout/include -isystem /mesos/build/3rdparty/http_parser-2.6.2/src/http_parser-2.6.2 -isystem /mesos/build/3rdparty/libevent-2.1.5-beta/src/libevent-2.1.5-beta-lib/lib/include -isystem /mesos/build/3rdparty/zookeeper-3.4.8/src/zookeeper-3.4.8/src/c/include -isystem /mesos/build/3rdparty/zookeeper-3.4.8/src/zookeeper-3.4.8/src/c/generated -isystem /mesos/build/3rdparty/leveldb-1.19/src/leveldb-1.19/include -I/mesos/include    -o CMakeFiles/mesos-1.3.0.dir/slave/containerizer/mesos/isolators/posix/rlimits.cpp.o -c /mesos/src/slave/containerizer/mesos/isolators/posix/rlimits.cpp
/usr/bin/cmake -E cmake_progress_report /mesos/build/CMakeFiles 
[ 49%] Building CXX object src/CMakeFiles/mesos-1.3.0.dir/slave/containerizer/mesos/isolators/volume/sandbox_path.cpp.o
cd /mesos/build/src && /usr/bin/g++   -DBUILD_FLAGS=\"\" -DBUILD_JAVA_JVM_LIBRARY=\"\" -DHAS_AUTHENTICATION=1 -DLIBDIR=\"/usr/local/libmesos\" -DPICOJSON_USE_INT64 -DPKGDATADIR=\"/usr/local/share/mesos\" -DPKGLIBEXECDIR=\"/usr/local/libexec/mesos\" -DUSE_CMAKE_BUILD_CONFIG -DUSE_STATIC_LIB -DVERSION=\"1.3.0\" -D__STDC_FORMAT_MACROS -Dmesos_1_3_0_EXPORTS -O2 -std=c++11 -g -fPIC -I/mesos/build/include -I/mesos/build/include/mesos -I/mesos/build/src -I/mesos/src -isystem /mesos/build/3rdparty/protobuf-2.6.1/src/protobuf-2.6.1-lib/lib/include -isystem /mesos/3rdparty/libprocess/include -isystem /usr/include/apr-1.0 -isystem /mesos/build/3rdparty/boost-1.53.0/src/boost-1.53.0 -isystem /mesos/build/3rdparty/elfio-3.2/src/elfio-3.2 -isystem /mesos/build/3rdparty/glog-0.3.3/src/glog-0.3.3-lib/lib/include -isystem /mesos/build/3rdparty/nvml-352.79/src/nvml-352.79 -isystem /mesos/build/3rdparty/picojson-1.3.0/src/picojson-1.3.0 -isystem /usr/include/subversion-1 -isystem /mesos/3rdparty/stout/include -isystem /mesos/build/3rdparty/http_parser-2.6.2/src/http_parser-2.6.2 -isystem /mesos/build/3rdparty/libevent-2.1.5-beta/src/libevent-2.1.5-beta-lib/lib/include -isystem /mesos/build/3rdparty/zookeeper-3.4.8/src/zookeeper-3.4.8/src/c/include -isystem /mesos/build/3rdparty/zookeeper-3.4.8/src/zookeeper-3.4.8/src/c/generated -isystem /mesos/build/3rdparty/leveldb-1.19/src/leveldb-1.19/include -I/mesos/include    -o CMakeFiles/mesos-1.3.0.dir/slave/containerizer/mesos/isolators/volume/sandbox_path.cpp.o -c /mesos/src/slave/containerizer/mesos/isolators/volume/sandbox_path.cpp
/usr/bin/cmake -E cmake_progress_report /mesos/build/CMakeFiles 
[ 49%] Building CXX object src/CMakeFiles/mesos-1.3.0.dir/appc/spec.cpp.o
cd /mesos/build/src && /usr/bin/g++   -DBUILD_FLAGS=\"\" -DBUILD_JAVA_JVM_LIBRARY=\"\" -DHAS_AUTHENTICATION=1 -DLIBDIR=\"/usr/local/libmesos\" -DPICOJSON_USE_INT64 -DPKGDATADIR=\"/usr/local/share/mesos\" -DPKGLIBEXECDIR=\"/usr/local/libexec/mesos\" -DUSE_CMAKE_BUILD_CONFIG -DUSE_STATIC_LIB -DVERSION=\"1.3.0\" -D__STDC_FORMAT_MACROS -Dmesos_1_3_0_EXPORTS -O2 -std=c++11 -g -fPIC -I/mesos/build/include -I/mesos/build/include/mesos -I/mesos/build/src -I/mesos/src -isystem /mesos/build/3rdparty/protobuf-2.6.1/src/protobuf-2.6.1-lib/lib/include -isystem /mesos/3rdparty/libprocess/include -isystem /usr/include/apr-1.0 -isystem /mesos/build/3rdparty/boost-1.53.0/src/boost-1.53.0 -isystem /mesos/build/3rdparty/elfio-3.2/src/elfio-3.2 -isystem /mesos/build/3rdparty/glog-0.3.3/src/glog-0.3.3-lib/lib/include -isystem /mesos/build/3rdparty/nvml-352.79/src/nvml-352.79 -isystem /mesos/build/3rdparty/picojson-1.3.0/src/picojson-1.3.0 -isystem /usr/include/subversion-1 -isystem /mesos/3rdparty/stout/include -isystem /mesos/build/3rdparty/http_parser-2.6.2/src/http_parser-2.6.2 -isystem /mesos/build/3rdparty/libevent-2.1.5-beta/src/libevent-2.1.5-beta-lib/lib/include -isystem /mesos/build/3rdparty/zookeeper-3.4.8/src/zookeeper-3.4.8/src/c/include -isystem /mesos/build/3rdparty/zookeeper-3.4.8/src/zookeeper-3.4.8/src/c/generated -isystem /mesos/build/3rdparty/leveldb-1.19/src/leveldb-1.19/include -I/mesos/include    -o CMakeFiles/mesos-1.3.0.dir/appc/spec.cpp.o -c /mesos/src/appc/spec.cpp
/usr/bin/cmake -E cmake_progress_report /mesos/build/CMakeFiles 23
[ 50%] Building CXX object src/CMakeFiles/mesos-1.3.0.dir/authentication/http/basic_authenticator_factory.cpp.o
cd /mesos/build/src && /usr/bin/g++   -DBUILD_FLAGS=\"\" -DBUILD_JAVA_JVM_LIBRARY=\"\" -DHAS_AUTHENTICATION=1 -DLIBDIR=\"/usr/local/libmesos\" -DPICOJSON_USE_INT64 -DPKGDATADIR=\"/usr/local/share/mesos\" -DPKGLIBEXECDIR=\"/usr/local/libexec/mesos\" -DUSE_CMAKE_BUILD_CONFIG -DUSE_STATIC_LIB -DVERSION=\"1.3.0\" -D__STDC_FORMAT_MACROS -Dmesos_1_3_0_EXPORTS -O2 -std=c++11 -g -fPIC -I/mesos/build/include -I/mesos/build/include/mesos -I/mesos/build/src -I/mesos/src -isystem /mesos/build/3rdparty/protobuf-2.6.1/src/protobuf-2.6.1-lib/lib/include -isystem /mesos/3rdparty/libprocess/include -isystem /usr/include/apr-1.0 -isystem /mesos/build/3rdparty/boost-1.53.0/src/boost-1.53.0 -isystem /mesos/build/3rdparty/elfio-3.2/src/elfio-3.2 -isystem /mesos/build/3rdparty/glog-0.3.3/src/glog-0.3.3-lib/lib/include -isystem /mesos/build/3rdparty/nvml-352.79/src/nvml-352.79 -isystem /mesos/build/3rdparty/picojson-1.3.0/src/picojson-1.3.0 -isystem /usr/include/subversion-1 -isystem /mesos/3rdparty/stout/include -isystem /mesos/build/3rdparty/http_parser-2.6.2/src/http_parser-2.6.2 -isystem /mesos/build/3rdparty/libevent-2.1.5-beta/src/libevent-2.1.5-beta-lib/lib/include -isystem /mesos/build/3rdparty/zookeeper-3.4.8/src/zookeeper-3.4.8/src/c/include -isystem /mesos/build/3rdparty/zookeeper-3.4.8/src/zookeeper-3.4.8/src/c/generated -isystem /mesos/build/3rdparty/leveldb-1.19/src/leveldb-1.19/include -I/mesos/include    -o CMakeFiles/mesos-1.3.0.dir/authentication/http/basic_authenticator_factory.cpp.o -c /mesos/src/authentication/http/basic_authenticator_factory.cpp
/usr/bin/cmake -E cmake_progress_report /mesos/build/CMakeFiles 
[ 50%] Building CXX object src/CMakeFiles/mesos-1.3.0.dir/authentication/cram_md5/authenticatee.cpp.o
cd /mesos/build/src && /usr/bin/g++   -DBUILD_FLAGS=\"\" -DBUILD_JAVA_JVM_LIBRARY=\"\" -DHAS_AUTHENTICATION=1 -DLIBDIR=\"/usr/local/libmesos\" -DPICOJSON_USE_INT64 -DPKGDATADIR=\"/usr/local/share/mesos\" -DPKGLIBEXECDIR=\"/usr/local/libexec/mesos\" -DUSE_CMAKE_BUILD_CONFIG -DUSE_STATIC_LIB -DVERSION=\"1.3.0\" -D__STDC_FORMAT_MACROS -Dmesos_1_3_0_EXPORTS -O2 -std=c++11 -g -fPIC -I/mesos/build/include -I/mesos/build/include/mesos -I/mesos/build/src -I/mesos/src -isystem /mesos/build/3rdparty/protobuf-2.6.1/src/protobuf-2.6.1-lib/lib/include -isystem /mesos/3rdparty/libprocess/include -isystem /usr/include/apr-1.0 -isystem /mesos/build/3rdparty/boost-1.53.0/src/boost-1.53.0 -isystem /mesos/build/3rdparty/elfio-3.2/src/elfio-3.2 -isystem /mesos/build/3rdparty/glog-0.3.3/src/glog-0.3.3-lib/lib/include -isystem /mesos/build/3rdparty/nvml-352.79/src/nvml-352.79 -isystem /mesos/build/3rdparty/picojson-1.3.0/src/picojson-1.3.0 -isystem /usr/include/subversion-1 -isystem /mesos/3rdparty/stout/include -isystem /mesos/build/3rdparty/http_parser-2.6.2/src/http_parser-2.6.2 -isystem /mesos/build/3rdparty/libevent-2.1.5-beta/src/libevent-2.1.5-beta-lib/lib/include -isystem /mesos/build/3rdparty/zookeeper-3.4.8/src/zookeeper-3.4.8/src/c/include -isystem /mesos/build/3rdparty/zookeeper-3.4.8/src/zookeeper-3.4.8/src/c/generated -isystem /mesos/build/3rdparty/leveldb-1.19/src/leveldb-1.19/include -I/mesos/include    -o CMakeFiles/mesos-1.3.0.dir/authentication/cram_md5/authenticatee.cpp.o -c /mesos/src/authentication/cram_md5/authenticatee.cpp
/usr/bin/cmake -E cmake_progress_report /mesos/build/CMakeFiles 
[ 50%] Building CXX object src/CMakeFiles/mesos-1.3.0.dir/authentication/cram_md5/authenticator.cpp.o
cd /mesos/build/src && /usr/bin/g++   -DBUILD_FLAGS=\"\" -DBUILD_JAVA_JVM_LIBRARY=\"\" -DHAS_AUTHENTICATION=1 -DLIBDIR=\"/usr/local/libmesos\" -DPICOJSON_USE_INT64 -DPKGDATADIR=\"/usr/local/share/mesos\" -DPKGLIBEXECDIR=\"/usr/local/libexec/mesos\" -DUSE_CMAKE_BUILD_CONFIG -DUSE_STATIC_LIB -DVERSION=\"1.3.0\" -D__STDC_FORMAT_MACROS -Dmesos_1_3_0_EXPORTS -O2 -std=c++11 -g -fPIC -I/mesos/build/include -I/mesos/build/include/mesos -I/mesos/build/src -I/mesos/src -isystem /mesos/build/3rdparty/protobuf-2.6.1/src/protobuf-2.6.1-lib/lib/include -isystem /mesos/3rdparty/libprocess/include -isystem /usr/include/apr-1.0 -isystem /mesos/build/3rdparty/boost-1.53.0/src/boost-1.53.0 -isystem /mesos/build/3rdparty/elfio-3.2/src/elfio-3.2 -isystem /mesos/build/3rdparty/glog-0.3.3/src/glog-0.3.3-lib/lib/include -isystem /mesos/build/3rdparty/nvml-352.79/src/nvml-352.79 -isystem /mesos/build/3rdparty/picojson-1.3.0/src/picojson-1.3.0 -isystem /usr/include/subversion-1 -isystem /mesos/3rdparty/stout/include -isystem /mesos/build/3rdparty/http_parser-2.6.2/src/http_parser-2.6.2 -isystem /mesos/build/3rdparty/libevent-2.1.5-beta/src/libevent-2.1.5-beta-lib/lib/include -isystem /mesos/build/3rdparty/zookeeper-3.4.8/src/zookeeper-3.4.8/src/c/include -isystem /mesos/build/3rdparty/zookeeper-3.4.8/src/zookeeper-3.4.8/src/c/generated -isystem /mesos/build/3rdparty/leveldb-1.19/src/leveldb-1.19/include -I/mesos/include    -o CMakeFiles/mesos-1.3.0.dir/authentication/cram_md5/authenticator.cpp.o -c /mesos/src/authentication/cram_md5/authenticator.cpp
/usr/bin/cmake -E cmake_progress_report /mesos/build/CMakeFiles 
[ 50%] Building CXX object src/CMakeFiles/mesos-1.3.0.dir/authentication/cram_md5/auxprop.cpp.o
cd /mesos/build/src && /usr/bin/g++   -DBUILD_FLAGS=\"\" -DBUILD_JAVA_JVM_LIBRARY=\"\" -DHAS_AUTHENTICATION=1 -DLIBDIR=\"/usr/local/libmesos\" -DPICOJSON_USE_INT64 -DPKGDATADIR=\"/usr/local/share/mesos\" -DPKGLIBEXECDIR=\"/usr/local/libexec/mesos\" -DUSE_CMAKE_BUILD_CONFIG -DUSE_STATIC_LIB -DVERSION=\"1.3.0\" -D__STDC_FORMAT_MACROS -Dmesos_1_3_0_EXPORTS -O2 -std=c++11 -g -fPIC -I/mesos/build/include -I/mesos/build/include/mesos -I/mesos/build/src -I/mesos/src -isystem /mesos/build/3rdparty/protobuf-2.6.1/src/protobuf-2.6.1-lib/lib/include -isystem /mesos/3rdparty/libprocess/include -isystem /usr/include/apr-1.0 -isystem /mesos/build/3rdparty/boost-1.53.0/src/boost-1.53.0 -isystem /mesos/build/3rdparty/elfio-3.2/src/elfio-3.2 -isystem /mesos/build/3rdparty/glog-0.3.3/src/glog-0.3.3-lib/lib/include -isystem /mesos/build/3rdparty/nvml-352.79/src/nvml-352.79 -isystem /mesos/build/3rdparty/picojson-1.3.0/src/picojson-1.3.0 -isystem /usr/include/subversion-1 -isystem /mesos/3rdparty/stout/include -isystem /mesos/build/3rdparty/http_parser-2.6.2/src/http_parser-2.6.2 -isystem /mesos/build/3rdparty/libevent-2.1.5-beta/src/libevent-2.1.5-beta-lib/lib/include -isystem /mesos/build/3rdparty/zookeeper-3.4.8/src/zookeeper-3.4.8/src/c/include -isystem /mesos/build/3rdparty/zookeeper-3.4.8/src/zookeeper-3.4.8/src/c/generated -isystem /mesos/build/3rdparty/leveldb-1.19/src/leveldb-1.19/include -I/mesos/include    -o CMakeFiles/mesos-1.3.0.dir/authentication/cram_md5/auxprop.cpp.o -c /mesos/src/authentication/cram_md5/auxprop.cpp
/usr/bin/cmake -E cmake_progress_report /mesos/build/CMakeFiles 
[ 50%] Building CXX object src/CMakeFiles/mesos-1.3.0.dir/authorizer/acls.cpp.o
cd /mesos/build/src && /usr/bin/g++   -DBUILD_FLAGS=\"\" -DBUILD_JAVA_JVM_LIBRARY=\"\" -DHAS_AUTHENTICATION=1 -DLIBDIR=\"/usr/local/libmesos\" -DPICOJSON_USE_INT64 -DPKGDATADIR=\"/usr/local/share/mesos\" -DPKGLIBEXECDIR=\"/usr/local/libexec/mesos\" -DUSE_CMAKE_BUILD_CONFIG -DUSE_STATIC_LIB -DVERSION=\"1.3.0\" -D__STDC_FORMAT_MACROS -Dmesos_1_3_0_EXPORTS -O2 -std=c++11 -g -fPIC -I/mesos/build/include -I/mesos/build/include/mesos -I/mesos/build/src -I/mesos/src -isystem /mesos/build/3rdparty/protobuf-2.6.1/src/protobuf-2.6.1-lib/lib/include -isystem /mesos/3rdparty/libprocess/include -isystem /usr/include/apr-1.0 -isystem /mesos/build/3rdparty/boost-1.53.0/src/boost-1.53.0 -isystem /mesos/build/3rdparty/elfio-3.2/src/elfio-3.2 -isystem /mesos/build/3rdparty/glog-0.3.3/src/glog-0.3.3-lib/lib/include -isystem /mesos/build/3rdparty/nvml-352.79/src/nvml-352.79 -isystem /mesos/build/3rdparty/picojson-1.3.0/src/picojson-1.3.0 -isystem /usr/include/subversion-1 -isystem /mesos/3rdparty/stout/include -isystem /mesos/build/3rdparty/http_parser-2.6.2/src/http_parser-2.6.2 -isystem /mesos/build/3rdparty/libevent-2.1.5-beta/src/libevent-2.1.5-beta-lib/lib/include -isystem /mesos/build/3rdparty/zookeeper-3.4.8/src/zookeeper-3.4.8/src/c/include -isystem /mesos/build/3rdparty/zookeeper-3.4.8/src/zookeeper-3.4.8/src/c/generated -isystem /mesos/build/3rdparty/leveldb-1.19/src/leveldb-1.19/include -I/mesos/include    -o CMakeFiles/mesos-1.3.0.dir/authorizer/acls.cpp.o -c /mesos/src/authorizer/acls.cpp
/usr/bin/cmake -E cmake_progress_report /mesos/build/CMakeFiles 
[ 50%] Building CXX object src/CMakeFiles/mesos-1.3.0.dir/authorizer/authorizer.cpp.o
cd /mesos/build/src && /usr/bin/g++   -DBUILD_FLAGS=\"\" -DBUILD_JAVA_JVM_LIBRARY=\"\" -DHAS_AUTHENTICATION=1 -DLIBDIR=\"/usr/local/libmesos\" -DPICOJSON_USE_INT64 -DPKGDATADIR=\"/usr/local/share/mesos\" -DPKGLIBEXECDIR=\"/usr/local/libexec/mesos\" -DUSE_CMAKE_BUILD_CONFIG -DUSE_STATIC_LIB -DVERSION=\"1.3.0\" -D__STDC_FORMAT_MACROS -Dmesos_1_3_0_EXPORTS -O2 -std=c++11 -g -fPIC -I/mesos/build/include -I/mesos/build/include/mesos -I/mesos/build/src -I/mesos/src -isystem /mesos/build/3rdparty/protobuf-2.6.1/src/protobuf-2.6.1-lib/lib/include -isystem /mesos/3rdparty/libprocess/include -isystem /usr/include/apr-1.0 -isystem /mesos/build/3rdparty/boost-1.53.0/src/boost-1.53.0 -isystem /mesos/build/3rdparty/elfio-3.2/src/elfio-3.2 -isystem /mesos/build/3rdparty/glog-0.3.3/src/glog-0.3.3-lib/lib/include -isystem /mesos/build/3rdparty/nvml-352.79/src/nvml-352.79 -isystem /mesos/build/3rdparty/picojson-1.3.0/src/picojson-1.3.0 -isystem /usr/include/subversion-1 -isystem /mesos/3rdparty/stout/include -isystem /mesos/build/3rdparty/http_parser-2.6.2/src/http_parser-2.6.2 -isystem /mesos/build/3rdparty/libevent-2.1.5-beta/src/libevent-2.1.5-beta-lib/lib/include -isystem /mesos/build/3rdparty/zookeeper-3.4.8/src/zookeeper-3.4.8/src/c/include -isystem /mesos/build/3rdparty/zookeeper-3.4.8/src/zookeeper-3.4.8/src/c/generated -isystem /mesos/build/3rdparty/leveldb-1.19/src/leveldb-1.19/include -I/mesos/include    -o CMakeFiles/mesos-1.3.0.dir/authorizer/authorizer.cpp.o -c /mesos/src/authorizer/authorizer.cpp
/usr/bin/cmake -E cmake_progress_report /mesos/build/CMakeFiles 24
[ 51%] Building CXX object src/CMakeFiles/mesos-1.3.0.dir/authorizer/local/authorizer.cpp.o
cd /mesos/build/src && /usr/bin/g++   -DBUILD_FLAGS=\"\" -DBUILD_JAVA_JVM_LIBRARY=\"\" -DHAS_AUTHENTICATION=1 -DLIBDIR=\"/usr/local/libmesos\" -DPICOJSON_USE_INT64 -DPKGDATADIR=\"/usr/local/share/mesos\" -DPKGLIBEXECDIR=\"/usr/local/libexec/mesos\" -DUSE_CMAKE_BUILD_CONFIG -DUSE_STATIC_LIB -DVERSION=\"1.3.0\" -D__STDC_FORMAT_MACROS -Dmesos_1_3_0_EXPORTS -O2 -std=c++11 -g -fPIC -I/mesos/build/include -I/mesos/build/include/mesos -I/mesos/build/src -I/mesos/src -isystem /mesos/build/3rdparty/protobuf-2.6.1/src/protobuf-2.6.1-lib/lib/include -isystem /mesos/3rdparty/libprocess/include -isystem /usr/include/apr-1.0 -isystem /mesos/build/3rdparty/boost-1.53.0/src/boost-1.53.0 -isystem /mesos/build/3rdparty/elfio-3.2/src/elfio-3.2 -isystem /mesos/build/3rdparty/glog-0.3.3/src/glog-0.3.3-lib/lib/include -isystem /mesos/build/3rdparty/nvml-352.79/src/nvml-352.79 -isystem /mesos/build/3rdparty/picojson-1.3.0/src/picojson-1.3.0 -isystem /usr/include/subversion-1 -isystem /mesos/3rdparty/stout/include -isystem /mesos/build/3rdparty/http_parser-2.6.2/src/http_parser-2.6.2 -isystem /mesos/build/3rdparty/libevent-2.1.5-beta/src/libevent-2.1.5-beta-lib/lib/include -isystem /mesos/build/3rdparty/zookeeper-3.4.8/src/zookeeper-3.4.8/src/c/include -isystem /mesos/build/3rdparty/zookeeper-3.4.8/src/zookeeper-3.4.8/src/c/generated -isystem /mesos/build/3rdparty/leveldb-1.19/src/leveldb-1.19/include -I/mesos/include    -o CMakeFiles/mesos-1.3.0.dir/authorizer/local/authorizer.cpp.o -c /mesos/src/authorizer/local/authorizer.cpp
/usr/bin/cmake -E cmake_progress_report /mesos/build/CMakeFiles 
[ 51%] Building CXX object src/CMakeFiles/mesos-1.3.0.dir/common/attributes.cpp.o
cd /mesos/build/src && /usr/bin/g++   -DBUILD_FLAGS=\"\" -DBUILD_JAVA_JVM_LIBRARY=\"\" -DHAS_AUTHENTICATION=1 -DLIBDIR=\"/usr/local/libmesos\" -DPICOJSON_USE_INT64 -DPKGDATADIR=\"/usr/local/share/mesos\" -DPKGLIBEXECDIR=\"/usr/local/libexec/mesos\" -DUSE_CMAKE_BUILD_CONFIG -DUSE_STATIC_LIB -DVERSION=\"1.3.0\" -D__STDC_FORMAT_MACROS -Dmesos_1_3_0_EXPORTS -O2 -std=c++11 -g -fPIC -I/mesos/build/include -I/mesos/build/include/mesos -I/mesos/build/src -I/mesos/src -isystem /mesos/build/3rdparty/protobuf-2.6.1/src/protobuf-2.6.1-lib/lib/include -isystem /mesos/3rdparty/libprocess/include -isystem /usr/include/apr-1.0 -isystem /mesos/build/3rdparty/boost-1.53.0/src/boost-1.53.0 -isystem /mesos/build/3rdparty/elfio-3.2/src/elfio-3.2 -isystem /mesos/build/3rdparty/glog-0.3.3/src/glog-0.3.3-lib/lib/include -isystem /mesos/build/3rdparty/nvml-352.79/src/nvml-352.79 -isystem /mesos/build/3rdparty/picojson-1.3.0/src/picojson-1.3.0 -isystem /usr/include/subversion-1 -isystem /mesos/3rdparty/stout/include -isystem /mesos/build/3rdparty/http_parser-2.6.2/src/http_parser-2.6.2 -isystem /mesos/build/3rdparty/libevent-2.1.5-beta/src/libevent-2.1.5-beta-lib/lib/include -isystem /mesos/build/3rdparty/zookeeper-3.4.8/src/zookeeper-3.4.8/src/c/include -isystem /mesos/build/3rdparty/zookeeper-3.4.8/src/zookeeper-3.4.8/src/c/generated -isystem /mesos/build/3rdparty/leveldb-1.19/src/leveldb-1.19/include -I/mesos/include    -o CMakeFiles/mesos-1.3.0.dir/common/attributes.cpp.o -c /mesos/src/common/attributes.cpp
/usr/bin/cmake -E cmake_progress_report /mesos/build/CMakeFiles 
[ 51%] Building CXX object src/CMakeFiles/mesos-1.3.0.dir/common/build.cpp.o
cd /mesos/build/src && /usr/bin/g++   -DBUILD_FLAGS=\"\" -DBUILD_JAVA_JVM_LIBRARY=\"\" -DHAS_AUTHENTICATION=1 -DLIBDIR=\"/usr/local/libmesos\" -DPICOJSON_USE_INT64 -DPKGDATADIR=\"/usr/local/share/mesos\" -DPKGLIBEXECDIR=\"/usr/local/libexec/mesos\" -DUSE_CMAKE_BUILD_CONFIG -DUSE_STATIC_LIB -DVERSION=\"1.3.0\" -D__STDC_FORMAT_MACROS -Dmesos_1_3_0_EXPORTS -O2 -std=c++11 -g -fPIC -I/mesos/build/include -I/mesos/build/include/mesos -I/mesos/build/src -I/mesos/src -isystem /mesos/build/3rdparty/protobuf-2.6.1/src/protobuf-2.6.1-lib/lib/include -isystem /mesos/3rdparty/libprocess/include -isystem /usr/include/apr-1.0 -isystem /mesos/build/3rdparty/boost-1.53.0/src/boost-1.53.0 -isystem /mesos/build/3rdparty/elfio-3.2/src/elfio-3.2 -isystem /mesos/build/3rdparty/glog-0.3.3/src/glog-0.3.3-lib/lib/include -isystem /mesos/build/3rdparty/nvml-352.79/src/nvml-352.79 -isystem /mesos/build/3rdparty/picojson-1.3.0/src/picojson-1.3.0 -isystem /usr/include/subversion-1 -isystem /mesos/3rdparty/stout/include -isystem /mesos/build/3rdparty/http_parser-2.6.2/src/http_parser-2.6.2 -isystem /mesos/build/3rdparty/libevent-2.1.5-beta/src/libevent-2.1.5-beta-lib/lib/include -isystem /mesos/build/3rdparty/zookeeper-3.4.8/src/zookeeper-3.4.8/src/c/include -isystem /mesos/build/3rdparty/zookeeper-3.4.8/src/zookeeper-3.4.8/src/c/generated -isystem /mesos/build/3rdparty/leveldb-1.19/src/leveldb-1.19/include -I/mesos/include    -o CMakeFiles/mesos-1.3.0.dir/common/build.cpp.o -c /mesos/src/common/build.cpp
/usr/bin/cmake -E cmake_progress_report /mesos/build/CMakeFiles 
[ 51%] Building CXX object src/CMakeFiles/mesos-1.3.0.dir/common/command_utils.cpp.o
cd /mesos/build/src && /usr/bin/g++   -DBUILD_FLAGS=\"\" -DBUILD_JAVA_JVM_LIBRARY=\"\" -DHAS_AUTHENTICATION=1 -DLIBDIR=\"/usr/local/libmesos\" -DPICOJSON_USE_INT64 -DPKGDATADIR=\"/usr/local/share/mesos\" -DPKGLIBEXECDIR=\"/usr/local/libexec/mesos\" -DUSE_CMAKE_BUILD_CONFIG -DUSE_STATIC_LIB -DVERSION=\"1.3.0\" -D__STDC_FORMAT_MACROS -Dmesos_1_3_0_EXPORTS -O2 -std=c++11 -g -fPIC -I/mesos/build/include -I/mesos/build/include/mesos -I/mesos/build/src -I/mesos/src -isystem /mesos/build/3rdparty/protobuf-2.6.1/src/protobuf-2.6.1-lib/lib/include -isystem /mesos/3rdparty/libprocess/include -isystem /usr/include/apr-1.0 -isystem /mesos/build/3rdparty/boost-1.53.0/src/boost-1.53.0 -isystem /mesos/build/3rdparty/elfio-3.2/src/elfio-3.2 -isystem /mesos/build/3rdparty/glog-0.3.3/src/glog-0.3.3-lib/lib/include -isystem /mesos/build/3rdparty/nvml-352.79/src/nvml-352.79 -isystem /mesos/build/3rdparty/picojson-1.3.0/src/picojson-1.3.0 -isystem /usr/include/subversion-1 -isystem /mesos/3rdparty/stout/include -isystem /mesos/build/3rdparty/http_parser-2.6.2/src/http_parser-2.6.2 -isystem /mesos/build/3rdparty/libevent-2.1.5-beta/src/libevent-2.1.5-beta-lib/lib/include -isystem /mesos/build/3rdparty/zookeeper-3.4.8/src/zookeeper-3.4.8/src/c/include -isystem /mesos/build/3rdparty/zookeeper-3.4.8/src/zookeeper-3.4.8/src/c/generated -isystem /mesos/build/3rdparty/leveldb-1.19/src/leveldb-1.19/include -I/mesos/include    -o CMakeFiles/mesos-1.3.0.dir/common/command_utils.cpp.o -c /mesos/src/common/command_utils.cpp
/mesos/src/common/build.cpp:41:26: error: 'BUILD_USER' was not declared in this scope
 const std::string USER = BUILD_USER;
                          ^
make[3]: *** [src/CMakeFiles/mesos-1.3.0.dir/common/build.cpp.o] Error 1
make[3]: *** Waiting for unfinished jobs....
make[3]: Leaving directory `/mesos/build'
make[2]: *** [src/CMakeFiles/mesos-1.3.0.dir/all] Error 2
make[2]: Leaving directory `/mesos/build'
make[1]: *** [CMakeFiles/check.dir/rule] Error 2
make[1]: Leaving directory `/mesos/build'
make: *** [check] Error 2
+ docker rmi mesos-1488412431-10442
Untagged: mesos-1488412431-10442:latest
Deleted: sha256:0ad47f2b10bb60dcc8a07bbeaf35d820ce31542179cae3a9d6ce8e0f301e4cb6
Deleted: sha256:857763b33d0d9d8caa8e883280a2187d2e22bb3013b11e921cc0890467564251
Deleted: sha256:1ca5455dc9ee7df356d0d25d5a581e8e48ef3f33924e79b70cb21de73944b77c
Deleted: sha256:5c68592afdd8f2738f895a8d73af20bf1070b14cc649ed3179e2842c68c6da2b
Deleted: sha256:1a9b3de712f9f7065f4bdc36c4c6cd077bca2acf9f1b705a8b16c024dd736b09
Deleted: sha256:f01069459096cc88519ed3bdcd7843f5e5d6f31309e6efa6ad7c8e81d8076028
Deleted: sha256:e2e04b1e6e8d13d9e51cc60f16372122eeb03151ec7c32cb7ca7cf1663f6ac2b
Deleted: sha256:5c2e04f56dc2687e42e20dc646bcef44288edc8ac172705bac7f682f89ac16e6
Deleted: sha256:38b04e564d5897f1e10cb678db63f20b978750f123ae4b50bff8f5ad94f980e9
Deleted: sha256:039797b8665b0d7f2163c9ae159c944ecf58f2cc7246e5148d152a200dd053c1
Deleted: sha256:e2b9b6fc36d9189ab7c14777f715247e6aafa688716c4ed8986c720b6a78bd93
Deleted: sha256:d6d9cf1f64e3e8a56e743db8acd0021645af8a2d1ba9cd6046206011014ee6c8
Deleted: sha256:ae1bf50d9b1a5e9661c6549379e43c4b3ec553f13afb7eeeab35ad78cc25195e
Deleted: sha256:3b870bb79e7c6e27c33e3262e193112acab2455de043e233990cfd419990ce4e
Deleted: sha256:a7df0d95b65b889271842ac9f18c1ec2c9af5bcf4fd0bf842f04c2a273e936ce
Deleted: sha256:a8d7aee21d6a8272fc7374f10855ccef06ee3a8d2a5336290ea9dfa89e0139a4
Deleted: sha256:88bc0f24b335d4d44908d56604f9de00d9d8049191ce5de66cb0d4354fa8a205
Deleted: sha256:94b8b08d098233cc926f869e437169e0cc8efa240f54b54b0e597b3d65a85cc4
Deleted: sha256:7d02d9d5ebbd50548d08f3c43cb555a00bbf02f020cce355486bed90502e54ee
Deleted: sha256:5d7ffde8bb8b450a6559413c142e7adca3e68348f06c700945e4b1c03e6f31c5
Deleted: sha256:53bf1b4690190b7a9b5b4d4bebaa5e19a0fe9e913d6f6df370c1867259a28dec
Deleted: sha256:423a31936eed69adeb00dbdd609eb6ea17b9f8334e28cc77ba3c7625dd5751ed
Deleted: sha256:7d02a0c77b7e530293fe4925235ddff060d71c349f5e57f627984283d8a544e8
Deleted: sha256:430a6102c435cd03630772ce6e5c9ee48d2c2994639b558e2f6b00e464210d25
Build step 'Execute shell' marked build as failure

Mime
View raw message