mesos-builds mailing list archives

Site index · List index
Message view « Date » · « Thread »
Top « Date » · « Thread »
From Apache Jenkins Server <jenk...@builds.apache.org>
Subject Build failed in Jenkins: Mesos-Buildbot » cmake,gcc,--verbose,GLOG_v=1 MESOS_VERBOSE=1,ubuntu:14.04,(docker||Hadoop)&&(!ubuntu-us1)&&(!ubuntu-eu2) #3328
Date Wed, 01 Mar 2017 20:18:12 GMT
See <https://builds.apache.org/job/Mesos-Buildbot/BUILDTOOL=cmake,COMPILER=gcc,CONFIGURATION=--verbose,ENVIRONMENT=GLOG_v=1%20MESOS_VERBOSE=1,OS=ubuntu%3A14.04,label_exp=(docker%7C%7CHadoop)&&(!ubuntu-us1)&&(!ubuntu-eu2)/3328/display/redirect?page=changes>

Changes:

[klueska] Renamed 'SubprocessInfo' to 'ContainerIO' in 'ContainerLogger'.

[klueska] Added STDIN IO to 'ContainerLogger::ContainerIO' class.

[klueska] Fixed ContainerLogger / IOSwitchboard FD leaks.

[klueska] Pulled 'ContainerIO' out of the 'ContainerLogger'.

------------------------------------------
[...truncated 23.69 MB...]
I0301 20:18:07.209545 26295 status_update_manager.cpp:177] Pausing sending status updates
I0301 20:18:07.210078 26298 state.cpp:62] Recovering state from '/tmp/Endpoint_SlaveEndpointTest_AuthorizedRequest_1_7f58ss/meta'
I0301 20:18:07.210263 26289 status_update_manager.cpp:203] Recovering status update manager
I0301 20:18:07.210408 26287 containerizer.cpp:600] Recovering containerizer
I0301 20:18:07.211146 26288 provisioner.cpp:410] Provisioner recovery complete
I0301 20:18:07.211316 26298 slave.cpp:5558] Finished recovery
I0301 20:18:07.211756 26298 slave.cpp:5732] Querying resource estimator for oversubscribable
resources
I0301 20:18:07.211874 26291 slave.cpp:5746] Received oversubscribable resources {} from the
resource estimator
I0301 20:18:07.212615 26296 process.cpp:3704] Handling HTTP event for process 'slave(693)'
with path: '/slave(693)/monitor/statistics.json'
I0301 20:18:07.213083 26295 http.cpp:871] Authorizing principal 'test-principal' to GET the
'/monitor/statistics.json' endpoint
I0301 20:18:07.214745 26299 slave.cpp:803] Agent terminating
[       OK ] Endpoint/SlaveEndpointTest.AuthorizedRequest/1 (13 ms)
[ RUN      ] Endpoint/SlaveEndpointTest.AuthorizedRequest/2
I0301 20:18:07.219365 26284 containerizer.cpp:221] Using isolation: posix/cpu,posix/mem,filesystem/posix,network/cni
W0301 20:18:07.219601 26284 backend.cpp:76] Failed to create 'aufs' backend: AufsBackend requires
root privileges
W0301 20:18:07.219636 26284 backend.cpp:76] Failed to create 'bind' backend: BindBackend requires
root privileges
I0301 20:18:07.219646 26284 provisioner.cpp:249] Using default backend 'copy'
I0301 20:18:07.220561 26299 slave.cpp:211] Mesos agent started on (694)@172.17.0.2:42709
I0301 20:18:07.220577 26299 slave.cpp:212] Flags at startup: --acls="" --appc_simple_discovery_uri_prefix="http://"
--appc_store_dir="/tmp/mesos/store/appc" --authenticate_http_readonly="true" --authenticate_http_readwrite="true"
--authenticatee="crammd5" --authentication_backoff_factor="1secs" --authorizer="local" --cgroups_cpu_enable_pids_and_tids_count="false"
--cgroups_enable_cfs="false" --cgroups_hierarchy="/sys/fs/cgroup" --cgroups_limit_swap="false"
--cgroups_root="mesos" --container_disk_watch_interval="15secs" --containerizers="mesos" --credential="/tmp/Endpoint_SlaveEndpointTest_AuthorizedRequest_2_PCnB8e/credential"
--default_role="*" --disk_watch_interval="1mins" --docker="docker" --docker_kill_orphans="true"
--docker_registry="https://registry-1.docker.io" --docker_remove_delay="6hrs" --docker_socket="/var/run/docker.sock"
--docker_stop_timeout="0ns" --docker_store_dir="/tmp/mesos/store/docker" --docker_volume_checkpoint_dir="/var/run/mesos/isolators/docker/volume"
--enforce_container_disk_quota="false" --executor_registration_timeout="1mins" --executor_shutdown_grace_period="5secs"
--fetcher_cache_dir="/tmp/Endpoint_SlaveEndpointTest_AuthorizedRequest_2_PCnB8e/fetch" --fetcher_cache_size="2GB"
--frameworks_home="" --gc_delay="1weeks" --gc_disk_headroom="0.1" --hadoop_home="" --help="false"
--hostname_lookup="true" --http_authenticators="basic" --http_command_executor="false" --http_credentials="/tmp/Endpoint_SlaveEndpointTest_AuthorizedRequest_2_PCnB8e/http_credentials"
--http_heartbeat_interval="30secs" --initialize_driver_logging="true" --isolation="posix/cpu,posix/mem"
--launcher="posix" --launcher_dir="/mesos/build/src" --logbufsecs="0" --logging_level="INFO"
--max_completed_executors_per_framework="150" --oversubscribed_resources_interval="15secs"
--perf_duration="10secs" --perf_interval="1mins" --qos_correction_interval_min="0ns" --quiet="false"
--recover="reconnect" --recovery_timeout="15mins" --registration_backoff_factor="10ms" --resources="cpus:2;gpus:0;mem:1024;disk:1024;ports:[31000-32000]"
--revocable_cpu_low_priority="true" --runtime_dir="/tmp/Endpoint_SlaveEndpointTest_AuthorizedRequest_2_PCnB8e"
--sandbox_directory="/mnt/mesos/sandbox" --strict="true" --switch_user="true" --systemd_enable_support="true"
--systemd_runtime_directory="/run/systemd/system" --version="false" --work_dir="/tmp/Endpoint_SlaveEndpointTest_AuthorizedRequest_2_5cCDZS"
I0301 20:18:07.220957 26299 credentials.hpp:86] Loading credential for authentication from
'/tmp/Endpoint_SlaveEndpointTest_AuthorizedRequest_2_PCnB8e/credential'
I0301 20:18:07.221047 26299 slave.cpp:354] Agent using credential for: test-principal
I0301 20:18:07.221061 26299 credentials.hpp:37] Loading credentials for authentication from
'/tmp/Endpoint_SlaveEndpointTest_AuthorizedRequest_2_PCnB8e/http_credentials'
I0301 20:18:07.221146 26299 http.cpp:919] Using default 'basic' HTTP authenticator for realm
'mesos-agent-readonly'
I0301 20:18:07.221184 26299 http.cpp:919] Using default 'basic' HTTP authenticator for realm
'mesos-agent-readwrite'
I0301 20:18:07.221529 26299 slave.cpp:541] Agent resources: cpus(*):2; mem(*):1024; disk(*):1024;
ports(*):[31000-32000]
I0301 20:18:07.221563 26299 slave.cpp:549] Agent attributes: [  ]
I0301 20:18:07.221575 26299 slave.cpp:554] Agent hostname: 31e06b6e37a8
I0301 20:18:07.221652 26296 status_update_manager.cpp:177] Pausing sending status updates
I0301 20:18:07.221830 26286 state.cpp:62] Recovering state from '/tmp/Endpoint_SlaveEndpointTest_AuthorizedRequest_2_5cCDZS/meta'
I0301 20:18:07.222038 26300 status_update_manager.cpp:203] Recovering status update manager
I0301 20:18:07.222157 26285 containerizer.cpp:600] Recovering containerizer
I0301 20:18:07.222584 26294 provisioner.cpp:410] Provisioner recovery complete
I0301 20:18:07.222774 26291 slave.cpp:5558] Finished recovery
I0301 20:18:07.223153 26291 slave.cpp:5732] Querying resource estimator for oversubscribable
resources
I0301 20:18:07.223294 26300 slave.cpp:5746] Received oversubscribable resources {} from the
resource estimator
I0301 20:18:07.224015 26287 process.cpp:3704] Handling HTTP event for process 'slave(694)'
with path: '/slave(694)/containers'
I0301 20:18:07.224364 26285 http.cpp:871] Authorizing principal 'test-principal' to GET the
'/containers' endpoint
I0301 20:18:07.225616 26299 slave.cpp:803] Agent terminating
[       OK ] Endpoint/SlaveEndpointTest.AuthorizedRequest/2 (11 ms)
[ RUN      ] Endpoint/SlaveEndpointTest.UnauthorizedRequest/0
I0301 20:18:07.231422 26284 containerizer.cpp:221] Using isolation: posix/cpu,posix/mem,filesystem/posix,network/cni
W0301 20:18:07.231808 26284 backend.cpp:76] Failed to create 'aufs' backend: AufsBackend requires
root privileges
W0301 20:18:07.231853 26284 backend.cpp:76] Failed to create 'bind' backend: BindBackend requires
root privileges
I0301 20:18:07.231894 26284 provisioner.cpp:249] Using default backend 'copy'
I0301 20:18:07.233340 26299 slave.cpp:211] Mesos agent started on (695)@172.17.0.2:42709
I0301 20:18:07.233361 26299 slave.cpp:212] Flags at startup: --acls="" --appc_simple_discovery_uri_prefix="http://"
--appc_store_dir="/tmp/mesos/store/appc" --authenticate_http_readonly="true" --authenticate_http_readwrite="true"
--authenticatee="crammd5" --authentication_backoff_factor="1secs" --authorizer="local" --cgroups_cpu_enable_pids_and_tids_count="false"
--cgroups_enable_cfs="false" --cgroups_hierarchy="/sys/fs/cgroup" --cgroups_limit_swap="false"
--cgroups_root="mesos" --container_disk_watch_interval="15secs" --containerizers="mesos" --credential="/tmp/Endpoint_SlaveEndpointTest_UnauthorizedRequest_0_dJxFOF/credential"
--default_role="*" --disk_watch_interval="1mins" --docker="docker" --docker_kill_orphans="true"
--docker_registry="https://registry-1.docker.io" --docker_remove_delay="6hrs" --docker_socket="/var/run/docker.sock"
--docker_stop_timeout="0ns" --docker_store_dir="/tmp/mesos/store/docker" --docker_volume_checkpoint_dir="/var/run/mesos/isolators/docker/volume"
--enforce_container_disk_quota="false" --executor_registration_timeout="1mins" --executor_shutdown_grace_period="5secs"
--fetcher_cache_dir="/tmp/Endpoint_SlaveEndpointTest_UnauthorizedRequest_0_dJxFOF/fetch" --fetcher_cache_size="2GB"
--frameworks_home="" --gc_delay="1weeks" --gc_disk_headroom="0.1" --hadoop_home="" --help="false"
--hostname_lookup="true" --http_authenticators="basic" --http_command_executor="false" --http_credentials="/tmp/Endpoint_SlaveEndpointTest_UnauthorizedRequest_0_dJxFOF/http_credentials"
--http_heartbeat_interval="30secs" --initialize_driver_logging="true" --isolation="posix/cpu,posix/mem"
--launcher="posix" --launcher_dir="/mesos/build/src" --logbufsecs="0" --logging_level="INFO"
--max_completed_executors_per_framework="150" --oversubscribed_resources_interval="15secs"
--perf_duration="10secs" --perf_interval="1mins" --qos_correction_interval_min="0ns" --quiet="false"
--recover="reconnect" --recovery_timeout="15mins" --registration_backoff_factor="10ms" --resources="cpus:2;gpus:0;mem:1024;disk:1024;ports:[31000-32000]"
--revocable_cpu_low_priority="true" --runtime_dir="/tmp/Endpoint_SlaveEndpointTest_UnauthorizedRequest_0_dJxFOF"
--sandbox_directory="/mnt/mesos/sandbox" --strict="true" --switch_user="true" --systemd_enable_support="true"
--systemd_runtime_directory="/run/systemd/system" --version="false" --work_dir="/tmp/Endpoint_SlaveEndpointTest_UnauthorizedRequest_0_D06ODj"
I0301 20:18:07.233767 26299 credentials.hpp:86] Loading credential for authentication from
'/tmp/Endpoint_SlaveEndpointTest_UnauthorizedRequest_0_dJxFOF/credential'
I0301 20:18:07.233872 26299 slave.cpp:354] Agent using credential for: test-principal
I0301 20:18:07.233891 26299 credentials.hpp:37] Loading credentials for authentication from
'/tmp/Endpoint_SlaveEndpointTest_UnauthorizedRequest_0_dJxFOF/http_credentials'
I0301 20:18:07.234050 26299 http.cpp:919] Using default 'basic' HTTP authenticator for realm
'mesos-agent-readonly'
I0301 20:18:07.234109 26299 http.cpp:919] Using default 'basic' HTTP authenticator for realm
'mesos-agent-readwrite'
I0301 20:18:07.234614 26299 slave.cpp:541] Agent resources: cpus(*):2; mem(*):1024; disk(*):1024;
ports(*):[31000-32000]
I0301 20:18:07.234658 26299 slave.cpp:549] Agent attributes: [  ]
I0301 20:18:07.234666 26299 slave.cpp:554] Agent hostname: 31e06b6e37a8
I0301 20:18:07.234773 26297 status_update_manager.cpp:177] Pausing sending status updates
I0301 20:18:07.235235 26300 state.cpp:62] Recovering state from '/tmp/Endpoint_SlaveEndpointTest_UnauthorizedRequest_0_D06ODj/meta'
I0301 20:18:07.235433 26292 status_update_manager.cpp:203] Recovering status update manager
I0301 20:18:07.235682 26287 containerizer.cpp:600] Recovering containerizer
I0301 20:18:07.236367 26298 provisioner.cpp:410] Provisioner recovery complete
I0301 20:18:07.236569 26293 slave.cpp:5558] Finished recovery
I0301 20:18:07.236953 26293 slave.cpp:5732] Querying resource estimator for oversubscribable
resources
I0301 20:18:07.237099 26295 slave.cpp:5746] Received oversubscribable resources {} from the
resource estimator
I0301 20:18:07.237931 26291 process.cpp:3704] Handling HTTP event for process 'slave(695)'
with path: '/slave(695)/monitor/statistics'
I0301 20:18:07.238458 26299 http.cpp:871] Authorizing principal 'test-principal' to GET the
'/monitor/statistics' endpoint
I0301 20:18:07.239982 26298 slave.cpp:803] Agent terminating
[       OK ] Endpoint/SlaveEndpointTest.UnauthorizedRequest/0 (13 ms)
[ RUN      ] Endpoint/SlaveEndpointTest.UnauthorizedRequest/1
I0301 20:18:07.244310 26284 containerizer.cpp:221] Using isolation: posix/cpu,posix/mem,filesystem/posix,network/cni
W0301 20:18:07.244640 26284 backend.cpp:76] Failed to create 'aufs' backend: AufsBackend requires
root privileges
W0301 20:18:07.244691 26284 backend.cpp:76] Failed to create 'bind' backend: BindBackend requires
root privileges
I0301 20:18:07.244714 26284 provisioner.cpp:249] Using default backend 'copy'
I0301 20:18:07.245546 26300 slave.cpp:211] Mesos agent started on (696)@172.17.0.2:42709
I0301 20:18:07.245563 26300 slave.cpp:212] Flags at startup: --acls="" --appc_simple_discovery_uri_prefix="http://"
--appc_store_dir="/tmp/mesos/store/appc" --authenticate_http_readonly="true" --authenticate_http_readwrite="true"
--authenticatee="crammd5" --authentication_backoff_factor="1secs" --authorizer="local" --cgroups_cpu_enable_pids_and_tids_count="false"
--cgroups_enable_cfs="false" --cgroups_hierarchy="/sys/fs/cgroup" --cgroups_limit_swap="false"
--cgroups_root="mesos" --container_disk_watch_interval="15secs" --containerizers="mesos" --credential="/tmp/Endpoint_SlaveEndpointTest_UnauthorizedRequest_1_BQ4uD6/credential"
--default_role="*" --disk_watch_interval="1mins" --docker="docker" --docker_kill_orphans="true"
--docker_registry="https://registry-1.docker.io" --docker_remove_delay="6hrs" --docker_socket="/var/run/docker.sock"
--docker_stop_timeout="0ns" --docker_store_dir="/tmp/mesos/store/docker" --docker_volume_checkpoint_dir="/var/run/mesos/isolators/docker/volume"
--enforce_container_disk_quota="false" --executor_registration_timeout="1mins" --executor_shutdown_grace_period="5secs"
--fetcher_cache_dir="/tmp/Endpoint_SlaveEndpointTest_UnauthorizedRequest_1_BQ4uD6/fetch" --fetcher_cache_size="2GB"
--frameworks_home="" --gc_delay="1weeks" --gc_disk_headroom="0.1" --hadoop_home="" --help="false"
--hostname_lookup="true" --http_authenticators="basic" --http_command_executor="false" --http_credentials="/tmp/Endpoint_SlaveEndpointTest_UnauthorizedRequest_1_BQ4uD6/http_credentials"
--http_heartbeat_interval="30secs" --initialize_driver_logging="true" --isolation="posix/cpu,posix/mem"
--launcher="posix" --launcher_dir="/mesos/build/src" --logbufsecs="0" --logging_level="INFO"
--max_completed_executors_per_framework="150" --oversubscribed_resources_interval="15secs"
--perf_duration="10secs" --perf_interval="1mins" --qos_correction_interval_min="0ns" --quiet="false"
--recover="reconnect" --recovery_timeout="15mins" --registration_backoff_factor="10ms" --resources="cpus:2;gpus:0;mem:1024;disk:1024;ports:[31000-32000]"
--revocable_cpu_low_priority="true" --runtime_dir="/tmp/Endpoint_SlaveEndpointTest_UnauthorizedRequest_1_BQ4uD6"
--sandbox_directory="/mnt/mesos/sandbox" --strict="true" --switch_user="true" --systemd_enable_support="true"
--systemd_runtime_directory="/run/systemd/system" --version="false" --work_dir="/tmp/Endpoint_SlaveEndpointTest_UnauthorizedRequest_1_dwXuqK"
I0301 20:18:07.245970 26300 credentials.hpp:86] Loading credential for authentication from
'/tmp/Endpoint_SlaveEndpointTest_UnauthorizedRequest_1_BQ4uD6/credential'
I0301 20:18:07.246054 26300 slave.cpp:354] Agent using credential for: test-principal
I0301 20:18:07.246069 26300 credentials.hpp:37] Loading credentials for authentication from
'/tmp/Endpoint_SlaveEndpointTest_UnauthorizedRequest_1_BQ4uD6/http_credentials'
I0301 20:18:07.246153 26300 http.cpp:919] Using default 'basic' HTTP authenticator for realm
'mesos-agent-readonly'
I0301 20:18:07.246191 26300 http.cpp:919] Using default 'basic' HTTP authenticator for realm
'mesos-agent-readwrite'
I0301 20:18:07.246512 26300 slave.cpp:541] Agent resources: cpus(*):2; mem(*):1024; disk(*):1024;
ports(*):[31000-32000]
I0301 20:18:07.246546 26300 slave.cpp:549] Agent attributes: [  ]
I0301 20:18:07.246553 26300 slave.cpp:554] Agent hostname: 31e06b6e37a8
I0301 20:18:07.246655 26289 status_update_manager.cpp:177] Pausing sending status updates
I0301 20:18:07.246810 26298 state.cpp:62] Recovering state from '/tmp/Endpoint_SlaveEndpointTest_UnauthorizedRequest_1_dwXuqK/meta'
I0301 20:18:07.246984 26298 status_update_manager.cpp:203] Recovering status update manager
I0301 20:18:07.247218 26295 containerizer.cpp:600] Recovering containerizer
I0301 20:18:07.247846 26300 provisioner.cpp:410] Provisioner recovery complete
I0301 20:18:07.248132 26293 slave.cpp:5558] Finished recovery
I0301 20:18:07.248602 26293 slave.cpp:5732] Querying resource estimator for oversubscribable
resources
I0301 20:18:07.248739 26287 slave.cpp:5746] Received oversubscribable resources {} from the
resource estimator
I0301 20:18:07.249518 26300 process.cpp:3704] Handling HTTP event for process 'slave(696)'
with path: '/slave(696)/monitor/statistics.json'
I0301 20:18:07.249979 26286 http.cpp:871] Authorizing principal 'test-principal' to GET the
'/monitor/statistics.json' endpoint
I0301 20:18:07.251139 26293 slave.cpp:803] Agent terminating
[       OK ] Endpoint/SlaveEndpointTest.UnauthorizedRequest/1 (11 ms)
[ RUN      ] Endpoint/SlaveEndpointTest.UnauthorizedRequest/2
I0301 20:18:07.256180 26284 containerizer.cpp:221] Using isolation: posix/cpu,posix/mem,filesystem/posix,network/cni
W0301 20:18:07.256492 26284 backend.cpp:76] Failed to create 'aufs' backend: AufsBackend requires
root privileges
W0301 20:18:07.256534 26284 backend.cpp:76] Failed to create 'bind' backend: BindBackend requires
root privileges
I0301 20:18:07.256548 26284 provisioner.cpp:249] Using default backend 'copy'
I0301 20:18:07.258311 26287 slave.cpp:211] Mesos agent started on (697)@172.17.0.2:42709
I0301 20:18:07.258337 26287 slave.cpp:212] Flags at startup: --acls="" --appc_simple_discovery_uri_prefix="http://"
--appc_store_dir="/tmp/mesos/store/appc" --authenticate_http_readonly="true" --authenticate_http_readwrite="true"
--authenticatee="crammd5" --authentication_backoff_factor="1secs" --authorizer="local" --cgroups_cpu_enable_pids_and_tids_count="false"
--cgroups_enable_cfs="false" --cgroups_hierarchy="/sys/fs/cgroup" --cgroups_limit_swap="false"
--cgroups_root="mesos" --container_disk_watch_interval="15secs" --containerizers="mesos" --credential="/tmp/Endpoint_SlaveEndpointTest_UnauthorizedRequest_2_XylQzx/credential"
--default_role="*" --disk_watch_interval="1mins" --docker="docker" --docker_kill_orphans="true"
--docker_registry="https://registry-1.docker.io" --docker_remove_delay="6hrs" --docker_socket="/var/run/docker.sock"
--docker_stop_timeout="0ns" --docker_store_dir="/tmp/mesos/store/docker" --docker_volume_checkpoint_dir="/var/run/mesos/isolators/docker/volume"
--enforce_container_disk_quota="false" --executor_registration_timeout="1mins" --executor_shutdown_grace_period="5secs"
--fetcher_cache_dir="/tmp/Endpoint_SlaveEndpointTest_UnauthorizedRequest_2_XylQzx/fetch" --fetcher_cache_size="2GB"
--frameworks_home="" --gc_delay="1weeks" --gc_disk_headroom="0.1" --hadoop_home="" --help="false"
--hostname_lookup="true" --http_authenticators="basic" --http_command_executor="false" --http_credentials="/tmp/Endpoint_SlaveEndpointTest_UnauthorizedRequest_2_XylQzx/http_credentials"
--http_heartbeat_interval="30secs" --initialize_driver_logging="true" --isolation="posix/cpu,posix/mem"
--launcher="posix" --launcher_dir="/mesos/build/src" --logbufsecs="0" --logging_level="INFO"
--max_completed_executors_per_framework="150" --oversubscribed_resources_interval="15secs"
--perf_duration="10secs" --perf_interval="1mins" --qos_correction_interval_min="0ns" --quiet="false"
--recover="reconnect" --recovery_timeout="15mins" --registration_backoff_factor="10ms" --resources="cpus:2;gpus:0;mem:1024;disk:1024;ports:[31000-32000]"
--revocable_cpu_low_priority="true" --runtime_dir="/tmp/Endpoint_SlaveEndpointTest_UnauthorizedRequest_2_XylQzx"
--sandbox_directory="/mnt/mesos/sandbox" --strict="true" --switch_user="true" --systemd_enable_support="true"
--systemd_runtime_directory="/run/systemd/system" --version="false" --work_dir="/tmp/Endpoint_SlaveEndpointTest_UnauthorizedRequest_2_nwjXkb"
I0301 20:18:07.258726 26287 credentials.hpp:86] Loading credential for authentication from
'/tmp/Endpoint_SlaveEndpointTest_UnauthorizedRequest_2_XylQzx/credential'
I0301 20:18:07.258831 26287 slave.cpp:354] Agent using credential for: test-principal
I0301 20:18:07.258851 26287 credentials.hpp:37] Loading credentials for authentication from
'/tmp/Endpoint_SlaveEndpointTest_UnauthorizedRequest_2_XylQzx/http_credentials'
I0301 20:18:07.259023 26287 http.cpp:919] Using default 'basic' HTTP authenticator for realm
'mesos-agent-readonly'
I0301 20:18:07.259085 26287 http.cpp:919] Using default 'basic' HTTP authenticator for realm
'mesos-agent-readwrite'
I0301 20:18:07.259521 26287 slave.cpp:541] Agent resources: cpus(*):2; mem(*):1024; disk(*):1024;
ports(*):[31000-32000]
I0301 20:18:07.259567 26287 slave.cpp:549] Agent attributes: [  ]
I0301 20:18:07.259580 26287 slave.cpp:554] Agent hostname: 31e06b6e37a8
I0301 20:18:07.259692 26285 status_update_manager.cpp:177] Pausing sending status updates
I0301 20:18:07.260005 26295 state.cpp:62] Recovering state from '/tmp/Endpoint_SlaveEndpointTest_UnauthorizedRequest_2_nwjXkb/meta'
I0301 20:18:07.260220 26291 status_update_manager.cpp:203] Recovering status update manager
I0301 20:18:07.260398 26299 containerizer.cpp:600] Recovering containerizer
I0301 20:18:07.261020 26294 provisioner.cpp:410] Provisioner recovery complete
I0301 20:18:07.261235 26294 slave.cpp:5558] Finished recovery
I0301 20:18:07.261651 26294 slave.cpp:5732] Querying resource estimator for oversubscribable
resources
I0301 20:18:07.261780 26287 slave.cpp:5746] Received oversubscribable resources {} from the
resource estimator
I0301 20:18:07.262465 26289 process.cpp:3704] Handling HTTP event for process 'slave(697)'
with path: '/slave(697)/containers'
I0301 20:18:07.263051 26300 http.cpp:871] Authorizing principal 'test-principal' to GET the
'/containers' endpoint
I0301 20:18:07.263942 26293 slave.cpp:803] Agent terminating
[       OK ] Endpoint/SlaveEndpointTest.UnauthorizedRequest/2 (13 ms)
[ RUN      ] Endpoint/SlaveEndpointTest.NoAuthorizer/0
I0301 20:18:07.269939 26284 containerizer.cpp:221] Using isolation: posix/cpu,posix/mem,filesystem/posix,network/cni
W0301 20:18:07.270314 26284 backend.cpp:76] Failed to create 'aufs' backend: AufsBackend requires
root privileges
W0301 20:18:07.270356 26284 backend.cpp:76] Failed to create 'bind' backend: BindBackend requires
root privileges
I0301 20:18:07.270373 26284 provisioner.cpp:249] Using default backend 'copy'
I0301 20:18:07.270967 26284 cluster.cpp:446] Creating default 'local' authorizer
I0301 20:18:07.271555 26290 slave.cpp:211] Mesos agent started on (698)@172.17.0.2:42709
I0301 20:18:07.271575 26290 slave.cpp:212] Flags at startup: --acls="" --appc_simple_discovery_uri_prefix="http://"
--appc_store_dir="/tmp/mesos/store/appc" --authenticate_http_readonly="true" --authenticate_http_readwrite="true"
--authenticatee="crammd5" --authentication_backoff_factor="1secs" --authorizer="local" --cgroups_cpu_enable_pids_and_tids_count="false"
--cgroups_enable_cfs="false" --cgroups_hierarchy="/sys/fs/cgroup" --cgroups_limit_swap="false"
--cgroups_root="mesos" --container_disk_watch_interval="15secs" --containerizers="mesos" --credential="/tmp/Endpoint_SlaveEndpointTest_NoAuthorizer_0_d5nWEY/credential"
--default_role="*" --disk_watch_interval="1mins" --docker="docker" --docker_kill_orphans="true"
--docker_registry="https://registry-1.docker.io" --docker_remove_delay="6hrs" --docker_socket="/var/run/docker.sock"
--docker_stop_timeout="0ns" --docker_store_dir="/tmp/mesos/store/docker" --docker_volume_checkpoint_dir="/var/run/mesos/isolators/docker/volume"
--enforce_container_disk_quota="false" --executor_registration_timeout="1mins" --executor_shutdown_grace_period="5secs"
--fetcher_cache_dir="/tmp/Endpoint_SlaveEndpointTest_NoAuthorizer_0_d5nWEY/fetch" --fetcher_cache_size="2GB"
--frameworks_home="" --gc_delay="1weeks" --gc_disk_headroom="0.1" --hadoop_home="" --help="false"
--hostname_lookup="true" --http_authenticators="basic" --http_command_executor="false" --http_credentials="/tmp/Endpoint_SlaveEndpointTest_NoAuthorizer_0_d5nWEY/http_credentials"
--http_heartbeat_interval="30secs" --initialize_driver_logging="true" --isolation="posix/cpu,posix/mem"
--launcher="posix" --launcher_dir="/mesos/build/src" --logbufsecs="0" --logging_level="INFO"
--max_completed_executors_per_framework="150" --oversubscribed_resources_interval="15secs"
--perf_duration="10secs" --perf_interval="1mins" --qos_correction_interval_min="0ns" --quiet="false"
--recover="reconnect" --recovery_timeout="15mins" --registration_backoff_factor="10ms" --resources="cpus:2;gpus:0;mem:1024;disk:1024;ports:[31000-32000]"
--revocable_cpu_low_priority="true" --runtime_dir="/tmp/Endpoint_SlaveEndpointTest_NoAuthorizer_0_d5nWEY"
--sandbox_directory="/mnt/mesos/sandbox" --strict="true" --switch_user="true" --systemd_enable_support="true"
--systemd_runtime_directory="/run/systemd/system" --version="false" --work_dir="/tmp/Endpoint_SlaveEndpointTest_NoAuthorizer_0_xBXPnC"
I0301 20:18:07.271939 26290 credentials.hpp:86] Loading credential for authentication from
'/tmp/Endpoint_SlaveEndpointTest_NoAuthorizer_0_d5nWEY/credential'
I0301 20:18:07.272047 26290 slave.cpp:354] Agent using credential for: test-principal
I0301 20:18:07.272066 26290 credentials.hpp:37] Loading credentials for authentication from
'/tmp/Endpoint_SlaveEndpointTest_NoAuthorizer_0_d5nWEY/http_credentials'
I0301 20:18:07.272197 26290 http.cpp:919] Using default 'basic' HTTP authenticator for realm
'mesos-agent-readonly'
I0301 20:18:07.272258 26290 http.cpp:919] Using default 'basic' HTTP authenticator for realm
'mesos-agent-readwrite'
I0301 20:18:07.272857 26290 slave.cpp:541] Agent resources: cpus(*):2; mem(*):1024; disk(*):1024;
ports(*):[31000-32000]
I0301 20:18:07.272902 26290 slave.cpp:549] Agent attributes: [  ]
I0301 20:18:07.272912 26290 slave.cpp:554] Agent hostname: 31e06b6e37a8
I0301 20:18:07.272994 26286 status_update_manager.cpp:177] Pausing sending status updates
I0301 20:18:07.273367 26299 state.cpp:62] Recovering state from '/tmp/Endpoint_SlaveEndpointTest_NoAuthorizer_0_xBXPnC/meta'
I0301 20:18:07.273618 26299 status_update_manager.cpp:203] Recovering status update manager
I0301 20:18:07.273739 26287 containerizer.cpp:600] Recovering containerizer
I0301 20:18:07.274417 26286 provisioner.cpp:410] Provisioner recovery complete
I0301 20:18:07.274588 26285 slave.cpp:5558] Finished recovery
I0301 20:18:07.275059 26285 slave.cpp:5732] Querying resource estimator for oversubscribable
resources
I0301 20:18:07.275241 26288 slave.cpp:5746] Received oversubscribable resources {} from the
resource estimator
I0301 20:18:07.276016 26288 process.cpp:3704] Handling HTTP event for process 'slave(698)'
with path: '/slave(698)/monitor/statistics'
I0301 20:18:07.276505 26293 http.cpp:871] Authorizing principal 'test-principal' to GET the
'/monitor/statistics' endpoint
I0301 20:18:07.277961 26294 slave.cpp:803] Agent terminating
[       OK ] Endpoint/SlaveEndpointTest.NoAuthorizer/0 (13 ms)
[ RUN      ] Endpoint/SlaveEndpointTest.NoAuthorizer/1
I0301 20:18:07.283572 26284 containerizer.cpp:221] Using isolation: posix/cpu,posix/mem,filesystem/posix,network/cni
W0301 20:18:07.283911 26284 backend.cpp:76] Failed to create 'aufs' backend: AufsBackend requires
root privileges
W0301 20:18:07.283954 26284 backend.cpp:76] Failed to create 'bind' backend: BindBackend requires
root privileges
I0301 20:18:07.283967 26284 provisioner.cpp:249] Using default backend 'copy'
I0301 20:18:07.284538 26284 cluster.cpp:446] Creating default 'local' authorizer
I0301 20:18:07.285054 26297 slave.cpp:211] Mesos agent started on (699)@172.17.0.2:42709
I0301 20:18:07.285078 26297 slave.cpp:212] Flags at startup: --acls="" --appc_simple_discovery_uri_prefix="http://"
--appc_store_dir="/tmp/mesos/store/appc" --authenticate_http_readonly="true" --authenticate_http_readwrite="true"
--authenticatee="crammd5" --authentication_backoff_factor="1secs" --authorizer="local" --cgroups_cpu_enable_pids_and_tids_count="false"
--cgroups_enable_cfs="false" --cgroups_hierarchy="/sys/fs/cgroup" --cgroups_limit_swap="false"
--cgroups_root="mesos" --container_disk_watch_interval="15secs" --containerizers="mesos" --credential="/tmp/Endpoint_SlaveEndpointTest_NoAuthorizer_1_P6dOSp/credential"
--default_role="*" --disk_watch_interval="1mins" --docker="docker" --docker_kill_orphans="true"
--docker_registry="https://registry-1.docker.io" --docker_remove_delay="6hrs" --docker_socket="/var/run/docker.sock"
--docker_stop_timeout="0ns" --docker_store_dir="/tmp/mesos/store/docker" --docker_volume_checkpoint_dir="/var/run/mesos/isolators/docker/volume"
--enforce_container_disk_quota="false" --executor_registration_timeout="1mins" --executor_shutdown_grace_period="5secs"
--fetcher_cache_dir="/tmp/Endpoint_SlaveEndpointTest_NoAuthorizer_1_P6dOSp/fetch" --fetcher_cache_size="2GB"
--frameworks_home="" --gc_delay="1weeks" --gc_disk_headroom="0.1" --hadoop_home="" --help="false"
--hostname_lookup="true" --http_authenticators="basic" --http_command_executor="false" --http_credentials="/tmp/Endpoint_SlaveEndpointTest_NoAuthorizer_1_P6dOSp/http_credentials"
--http_heartbeat_interval="30secs" --initialize_driver_logging="true" --isolation="posix/cpu,posix/mem"
--launcher="posix" --launcher_dir="/mesos/build/src" --logbufsecs="0" --logging_level="INFO"
--max_completed_executors_per_framework="150" --oversubscribed_resources_interval="15secs"
--perf_duration="10secs" --perf_interval="1mins" --qos_correction_interval_min="0ns" --quiet="false"
--recover="reconnect" --recovery_timeout="15mins" --registration_backoff_factor="10ms" --resources="cpus:2;gpus:0;mem:1024;disk:1024;ports:[31000-32000]"
--revocable_cpu_low_priority="true" --runtime_dir="/tmp/Endpoint_SlaveEndpointTest_NoAuthorizer_1_P6dOSp"
--sandbox_directory="/mnt/mesos/sandbox" --strict="true" --switch_user="true" --systemd_enable_support="true"
--systemd_runtime_directory="/run/systemd/system" --version="false" --work_dir="/tmp/Endpoint_SlaveEndpointTest_NoAuthorizer_1_l8mvz3"
I0301 20:18:07.285681 26297 credentials.hpp:86] Loading credential for authentication from
'/tmp/Endpoint_SlaveEndpointTest_NoAuthorizer_1_P6dOSp/credential'
I0301 20:18:07.285794 26297 slave.cpp:354] Agent using credential for: test-principal
I0301 20:18:07.285810 26297 credentials.hpp:37] Loading credentials for authentication from
'/tmp/Endpoint_SlaveEndpointTest_NoAuthorizer_1_P6dOSp/http_credentials'
I0301 20:18:07.285938 26297 http.cpp:919] Using default 'basic' HTTP authenticator for realm
'mesos-agent-readonly'
I0301 20:18:07.285990 26297 http.cpp:919] Using default 'basic' HTTP authenticator for realm
'mesos-agent-readwrite'
I0301 20:18:07.286470 26297 slave.cpp:541] Agent resources: cpus(*):2; mem(*):1024; disk(*):1024;
ports(*):[31000-32000]
I0301 20:18:07.286516 26297 slave.cpp:549] Agent attributes: [  ]
I0301 20:18:07.286535 26297 slave.cpp:554] Agent hostname: 31e06b6e37a8
I0301 20:18:07.286639 26288 status_update_manager.cpp:177] Pausing sending status updates
I0301 20:18:07.286929 26297 state.cpp:62] Recovering state from '/tmp/Endpoint_SlaveEndpointTest_NoAuthorizer_1_l8mvz3/meta'
I0301 20:18:07.287216 26299 status_update_manager.cpp:203] Recovering status update manager
I0301 20:18:07.287298 26299 containerizer.cpp:600] Recovering containerizer
I0301 20:18:07.288081 26292 provisioner.cpp:410] Provisioner recovery complete
I0301 20:18:07.288326 26289 slave.cpp:5558] Finished recovery
I0301 20:18:07.288713 26289 slave.cpp:5732] Querying resource estimator for oversubscribable
resources
I0301 20:18:07.288842 26293 slave.cpp:5746] Received oversubscribable resources {} from the
resource estimator
I0301 20:18:07.289538 26289 process.cpp:3704] Handling HTTP event for process 'slave(699)'
with path: '/slave(699)/monitor/statistics.json'
I0301 20:18:07.290022 26288 http.cpp:871] Authorizing principal 'test-principal' to GET the
'/monitor/statistics.json' endpoint
I0301 20:18:07.291676 26290 slave.cpp:803] Agent terminating
[       OK ] Endpoint/SlaveEndpointTest.NoAuthorizer/1 (13 ms)
[ RUN      ] Endpoint/SlaveEndpointTest.NoAuthorizer/2
I0301 20:18:07.297472 26284 containerizer.cpp:221] Using isolation: posix/cpu,posix/mem,filesystem/posix,network/cni
W0301 20:18:07.297837 26284 backend.cpp:76] Failed to create 'aufs' backend: AufsBackend requires
root privileges
W0301 20:18:07.297878 26284 backend.cpp:76] Failed to create 'bind' backend: BindBackend requires
root privileges
I0301 20:18:07.297894 26284 provisioner.cpp:249] Using default backend 'copy'
I0301 20:18:07.298528 26284 cluster.cpp:446] Creating default 'local' authorizer
I0301 20:18:07.299096 26300 slave.cpp:211] Mesos agent started on (700)@172.17.0.2:42709
I0301 20:18:07.299120 26300 slave.cpp:212] Flags at startup: --acls="" --appc_simple_discovery_uri_prefix="http://"
--appc_store_dir="/tmp/mesos/store/appc" --authenticate_http_readonly="true" --authenticate_http_readwrite="true"
--authenticatee="crammd5" --authentication_backoff_factor="1secs" --authorizer="local" --cgroups_cpu_enable_pids_and_tids_count="false"
--cgroups_enable_cfs="false" --cgroups_hierarchy="/sys/fs/cgroup" --cgroups_limit_swap="false"
--cgroups_root="mesos" --container_disk_watch_interval="15secs" --containerizers="mesos" --credential="/tmp/Endpoint_SlaveEndpointTest_NoAuthorizer_2_FJOIfR/credential"
--default_role="*" --disk_watch_interval="1mins" --docker="docker" --docker_kill_orphans="true"
--docker_registry="https://registry-1.docker.io" --docker_remove_delay="6hrs" --docker_socket="/var/run/docker.sock"
--docker_stop_timeout="0ns" --docker_store_dir="/tmp/mesos/store/docker" --docker_volume_checkpoint_dir="/var/run/mesos/isolators/docker/volume"
--enforce_container_disk_quota="false" --executor_registration_timeout="1mins" --executor_shutdown_grace_period="5secs"
--fetcher_cache_dir="/tmp/Endpoint_SlaveEndpointTest_NoAuthorizer_2_FJOIfR/fetch" --fetcher_cache_size="2GB"
--frameworks_home="" --gc_delay="1weeks" --gc_disk_headroom="0.1" --hadoop_home="" --help="false"
--hostname_lookup="true" --http_authenticators="basic" --http_command_executor="false" --http_credentials="/tmp/Endpoint_SlaveEndpointTest_NoAuthorizer_2_FJOIfR/http_credentials"
--http_heartbeat_interval="30secs" --initialize_driver_logging="true" --isolation="posix/cpu,posix/mem"
--launcher="posix" --launcher_dir="/mesos/build/src" --logbufsecs="0" --logging_level="INFO"
--max_completed_executors_per_framework="150" --oversubscribed_resources_interval="15secs"
--perf_duration="10secs" --perf_interval="1mins" --qos_correction_interval_min="0ns" --quiet="false"
--recover="reconnect" --recovery_timeout="15mins" --registration_backoff_factor="10ms" --resources="cpus:2;gpus:0;mem:1024;disk:1024;ports:[31000-32000]"
--revocable_cpu_low_priority="true" --runtime_dir="/tmp/Endpoint_SlaveEndpointTest_NoAuthorizer_2_FJOIfR"
--sandbox_directory="/mnt/mesos/sandbox" --strict="true" --switch_user="true" --systemd_enable_support="true"
--systemd_runtime_directory="/run/systemd/system" --version="false" --work_dir="/tmp/Endpoint_SlaveEndpointTest_NoAuthorizer_2_lx48Tu"
I0301 20:18:07.299564 26300 credentials.hpp:86] Loading credential for authentication from
'/tmp/Endpoint_SlaveEndpointTest_NoAuthorizer_2_FJOIfR/credential'
I0301 20:18:07.299681 26300 slave.cpp:354] Agent using credential for: test-principal
I0301 20:18:07.299706 26300 credentials.hpp:37] Loading credentials for authentication from
'/tmp/Endpoint_SlaveEndpointTest_NoAuthorizer_2_FJOIfR/http_credentials'
I0301 20:18:07.299868 26300 http.cpp:919] Using default 'basic' HTTP authenticator for realm
'mesos-agent-readonly'
I0301 20:18:07.299970 26300 http.cpp:919] Using default 'basic' HTTP authenticator for realm
'mesos-agent-readwrite'
I0301 20:18:07.300559 26300 slave.cpp:541] Agent resources: cpus(*):2; mem(*):1024; disk(*):1024;
ports(*):[31000-32000]
I0301 20:18:07.300606 26300 slave.cpp:549] Agent attributes: [  ]
I0301 20:18:07.300618 26300 slave.cpp:554] Agent hostname: 31e06b6e37a8
I0301 20:18:07.300696 26298 status_update_manager.cpp:177] Pausing sending status updates
I0301 20:18:07.301138 26299 state.cpp:62] Recovering state from '/tmp/Endpoint_SlaveEndpointTest_NoAuthorizer_2_lx48Tu/meta'
I0301 20:18:07.301345 26300 status_update_manager.cpp:203] Recovering status update manager
I0301 20:18:07.301651 26296 containerizer.cpp:600] Recovering containerizer
I0301 20:18:07.302568 26297 provisioner.cpp:410] Provisioner recovery complete
I0301 20:18:07.302776 26294 slave.cpp:5558] Finished recovery
I0301 20:18:07.303205 26294 slave.cpp:5732] Querying resource estimator for oversubscribable
resources
I0301 20:18:07.303349 26298 slave.cpp:5746] Received oversubscribable resources {} from the
resource estimator
I0301 20:18:07.304050 26291 process.cpp:3704] Handling HTTP event for process 'slave(700)'
with path: '/slave(700)/containers'
I0301 20:18:07.304585 26298 http.cpp:871] Authorizing principal 'test-principal' to GET the
'/containers' endpoint
I0301 20:18:07.306362 26284 slave.cpp:803] Agent terminating
[       OK ] Endpoint/SlaveEndpointTest.NoAuthorizer/2 (14 ms)
[----------] 9 tests from Endpoint/SlaveEndpointTest (117 ms total)

[----------] Global test environment tear-down
[==========] 1444 tests from 160 test cases ran. (190850 ms total)
[  PASSED  ] 1443 tests.
[  FAILED  ] 1 test, listed below:
[  FAILED  ] ContainerLoggerTest.LOGROTATE_RotateInSandbox

 1 FAILED TEST
  YOU HAVE 11 DISABLED TESTS

make[3]: *** [CMakeFiles/check] Error 1
make[3]: Leaving directory `/mesos/build'
make[2]: *** [CMakeFiles/check.dir/all] Error 2
make[2]: Leaving directory `/mesos/build'
make[1]: *** [CMakeFiles/check.dir/rule] Error 2
make[1]: Leaving directory `/mesos/build'
make: *** [check] Error 2
+ docker rmi mesos-1488396896-7523
Untagged: mesos-1488396896-7523:latest
Deleted: sha256:8f4b48464a7f0755a1dee1be3dce875462a600a884d59489ebd21518f9919db9
Deleted: sha256:a45253304d68751cca4cf9cb354e03417b639be82a647726e7497fc38a48fe3b
Deleted: sha256:c0d88bb72ca67765db924ed3bf42715a3e853d190fe87085e9168aae316c3d59
Deleted: sha256:750cd3ab6d921ffd1a59fc8cdd80fd12ea4b66826bc0aaeb6f5f1a0b682e0760
Deleted: sha256:1ccf4158d6d185fb7296a67256ea1015415516c15642b0666f708fbbd58cfa59
Deleted: sha256:eac8fbd2e7f57a13eb6a99e51dd17ce4e684a7e40676482076c93580df619623
Deleted: sha256:1e6df64d8bb8dcebf9341451b813032576764c76d8e845980112f4b7574243c1
Deleted: sha256:f5e9a6606ad93dc43351ef915ea05fceaa04db898e5102dc90a637d2dfd514fc
Deleted: sha256:91cc3976b969a199df077ddf8ea6557d76ff24724f1f7ecac954778b11b9d39b
Deleted: sha256:7714e41448deb2253f606d20ce1a74f9dff4878346aadc068a6c89e8a1bb3274
Deleted: sha256:7ff60ea68e81c19705e6da51d31685bdbb3307d125223c7c886563c22e8623f5
Deleted: sha256:2d82bae5063496d53b2e6128c40d9cb780f7d8f05ce54f0b6f674509c317a9d3
Deleted: sha256:f0f49bfa9917fd8bafd773bb26564ba2d13e5d266db0d48a1971df02dd0ae589
Deleted: sha256:020f59426a38d9420f6f4024c1b174439dd5c0e92a1c2acef7126a0f89f6fc2a
Deleted: sha256:4e9e2e4a764f879773b38809405403770e39676993e5e9d642d24a84e7d9be62
Deleted: sha256:59b9f136c14a26441b93f88184666c41de9f20f3bd2aed5550b3682742e8f407
Deleted: sha256:ff3bf339dabdb56154c30fb0f92a23fbb2e7b698d671e5696fd7d06e2a4609f1
Deleted: sha256:aee301dc8da5ff489d1d31f49cc6ea5d26fb9629b29ba08438b2f53234536727
Deleted: sha256:288db5141fef473640d652ef34dfaa66cecab0c76d6e93667c7faa741c0eacb4
Deleted: sha256:8a31b94452b946fc09f79a3c7a63f1e5fff68791f4525a21ba82d376d2270459
Deleted: sha256:4642b173f54405a3d1af0688c05b9522c456046c65556544688323481b9e05e6
Deleted: sha256:b66fb9c62e2cef88b4828e6c3ffe67da9a6db14201f80c83f4f5546bda8870c2
Deleted: sha256:2dfa55269b65dc141464c7c3825d5e5f2479ffece2d04912c3a720b4f477cfc9
Deleted: sha256:80183b338ab90a0853bedfae1cb83aefa4cb564efcae5b9612a3cf324087d321
Build step 'Execute shell' marked build as failure

Mime
View raw message