mesos-builds mailing list archives

Site index · List index
Message view « Date » · « Thread »
Top « Date » · « Thread »
From Apache Jenkins Server <jenk...@builds.apache.org>
Subject Build failed in Jenkins: Mesos-Reviewbot #17376
Date Thu, 09 Mar 2017 22:02:07 GMT
See <https://builds.apache.org/job/Mesos-Reviewbot/17376/display/redirect>

------------------------------------------
[...truncated 25.70 MB...]
I0309 22:02:01.585363 30445 status_update_manager.cpp:203] Recovering status update manager
I0309 22:02:01.585561 30446 containerizer.cpp:600] Recovering containerizer
I0309 22:02:01.586885 30443 provisioner.cpp:410] Provisioner recovery complete
I0309 22:02:01.587430 30435 slave.cpp:5572] Finished recovery
I0309 22:02:01.587916 30435 slave.cpp:5754] Querying resource estimator for oversubscribable
resources
I0309 22:02:01.588136 30443 slave.cpp:5768] Received oversubscribable resources {} from the
resource estimator
I0309 22:02:01.591663 30443 process.cpp:3705] Handling HTTP event for process 'slave(708)'
with path: '/slave(708)/monitor/statistics.json'
I0309 22:02:01.593021 30441 http.cpp:916] Authorizing principal 'test-principal' to GET the
'/monitor/statistics.json' endpoint
I0309 22:02:01.596379 30449 slave.cpp:808] Agent terminating
[       OK ] Endpoint/SlaveEndpointTest.AuthorizedRequest/1 (32 ms)
[ RUN      ] Endpoint/SlaveEndpointTest.AuthorizedRequest/2
I0309 22:02:01.608217 30415 containerizer.cpp:221] Using isolation: posix/cpu,posix/mem,filesystem/posix,network/cni
W0309 22:02:01.608846 30415 backend.cpp:76] Failed to create 'aufs' backend: AufsBackend requires
root privileges
W0309 22:02:01.608961 30415 backend.cpp:76] Failed to create 'bind' backend: BindBackend requires
root privileges
I0309 22:02:01.609005 30415 provisioner.cpp:249] Using default backend 'copy'
I0309 22:02:01.612434 30436 slave.cpp:215] Mesos agent started on (709)@172.17.0.2:58592
I0309 22:02:01.612459 30436 slave.cpp:216] Flags at startup: --acls="" --appc_simple_discovery_uri_prefix="http://"
--appc_store_dir="/tmp/mesos/store/appc" --authenticate_http_readonly="true" --authenticate_http_readwrite="true"
--authenticatee="crammd5" --authentication_backoff_factor="1secs" --authorizer="local" --cgroups_cpu_enable_pids_and_tids_count="false"
--cgroups_enable_cfs="false" --cgroups_hierarchy="/sys/fs/cgroup" --cgroups_limit_swap="false"
--cgroups_root="mesos" --container_disk_watch_interval="15secs" --containerizers="mesos" --credential="/tmp/Endpoint_SlaveEndpointTest_AuthorizedRequest_2_YCeNZg/credential"
--default_role="*" --disk_watch_interval="1mins" --docker="docker" --docker_kill_orphans="true"
--docker_registry="https://registry-1.docker.io" --docker_remove_delay="6hrs" --docker_socket="/var/run/docker.sock"
--docker_stop_timeout="0ns" --docker_store_dir="/tmp/mesos/store/docker" --docker_volume_checkpoint_dir="/var/run/mesos/isolators/docker/volume"
--enforce_container_disk_quota="false" --executor_registration_timeout="1mins" --executor_shutdown_grace_period="5secs"
--fetcher_cache_dir="/tmp/Endpoint_SlaveEndpointTest_AuthorizedRequest_2_YCeNZg/fetch" --fetcher_cache_size="2GB"
--frameworks_home="" --gc_delay="1weeks" --gc_disk_headroom="0.1" --hadoop_home="" --help="false"
--hostname_lookup="true" --http_authenticators="basic" --http_command_executor="false" --http_credentials="/tmp/Endpoint_SlaveEndpointTest_AuthorizedRequest_2_YCeNZg/http_credentials"
--http_heartbeat_interval="30secs" --initialize_driver_logging="true" --isolation="posix/cpu,posix/mem"
--launcher="posix" --launcher_dir="/mesos/mesos-1.3.0/_build/src" --logbufsecs="0" --logging_level="INFO"
--max_completed_executors_per_framework="150" --oversubscribed_resources_interval="15secs"
--perf_duration="10secs" --perf_interval="1mins" --qos_correction_interval_min="0ns" --quiet="false"
--recover="reconnect" --recovery_timeout="15mins" --registration_backoff_factor="10ms" --resources="cpus:2;gpus:0;mem:1024;disk:1024;ports:[31000-32000]"
--revocable_cpu_low_priority="true" --runtime_dir="/tmp/Endpoint_SlaveEndpointTest_AuthorizedRequest_2_YCeNZg"
--sandbox_directory="/mnt/mesos/sandbox" --strict="true" --switch_user="true" --systemd_enable_support="true"
--systemd_runtime_directory="/run/systemd/system" --version="false" --work_dir="/tmp/Endpoint_SlaveEndpointTest_AuthorizedRequest_2_PF5mv4"
I0309 22:02:01.613085 30436 credentials.hpp:86] Loading credential for authentication from
'/tmp/Endpoint_SlaveEndpointTest_AuthorizedRequest_2_YCeNZg/credential'
I0309 22:02:01.613267 30436 slave.cpp:358] Agent using credential for: test-principal
I0309 22:02:01.613296 30436 credentials.hpp:37] Loading credentials for authentication from
'/tmp/Endpoint_SlaveEndpointTest_AuthorizedRequest_2_YCeNZg/http_credentials'
I0309 22:02:01.613579 30436 http.cpp:964] Using default 'basic' HTTP authenticator for realm
'mesos-agent-readonly'
I0309 22:02:01.613765 30436 http.cpp:964] Using default 'basic' HTTP authenticator for realm
'mesos-agent-readwrite'
I0309 22:02:01.615115 30436 slave.cpp:545] Agent resources: cpus(*):2; mem(*):1024; disk(*):1024;
ports(*):[31000-32000]
I0309 22:02:01.615211 30436 slave.cpp:553] Agent attributes: [  ]
I0309 22:02:01.615234 30436 slave.cpp:558] Agent hostname: 0b31381d5d3b
I0309 22:02:01.615398 30449 status_update_manager.cpp:177] Pausing sending status updates
I0309 22:02:01.616876 30442 state.cpp:62] Recovering state from '/tmp/Endpoint_SlaveEndpointTest_AuthorizedRequest_2_PF5mv4/meta'
I0309 22:02:01.617288 30446 status_update_manager.cpp:203] Recovering status update manager
I0309 22:02:01.617517 30438 containerizer.cpp:600] Recovering containerizer
I0309 22:02:01.619055 30435 provisioner.cpp:410] Provisioner recovery complete
I0309 22:02:01.619453 30445 slave.cpp:5572] Finished recovery
I0309 22:02:01.620046 30445 slave.cpp:5754] Querying resource estimator for oversubscribable
resources
I0309 22:02:01.620349 30441 slave.cpp:5768] Received oversubscribable resources {} from the
resource estimator
I0309 22:02:01.623728 30447 process.cpp:3705] Handling HTTP event for process 'slave(709)'
with path: '/slave(709)/containers'
I0309 22:02:01.625206 30446 http.cpp:916] Authorizing principal 'test-principal' to GET the
'/containers' endpoint
I0309 22:02:01.630034 30447 slave.cpp:808] Agent terminating
[       OK ] Endpoint/SlaveEndpointTest.AuthorizedRequest/2 (34 ms)
[ RUN      ] Endpoint/SlaveEndpointTest.UnauthorizedRequest/0
I0309 22:02:01.641034 30415 containerizer.cpp:221] Using isolation: posix/cpu,posix/mem,filesystem/posix,network/cni
W0309 22:02:01.641516 30415 backend.cpp:76] Failed to create 'aufs' backend: AufsBackend requires
root privileges
W0309 22:02:01.641654 30415 backend.cpp:76] Failed to create 'bind' backend: BindBackend requires
root privileges
I0309 22:02:01.641700 30415 provisioner.cpp:249] Using default backend 'copy'
I0309 22:02:01.645545 30442 slave.cpp:215] Mesos agent started on (710)@172.17.0.2:58592
I0309 22:02:01.645800 30442 slave.cpp:216] Flags at startup: --acls="" --appc_simple_discovery_uri_prefix="http://"
--appc_store_dir="/tmp/mesos/store/appc" --authenticate_http_readonly="true" --authenticate_http_readwrite="true"
--authenticatee="crammd5" --authentication_backoff_factor="1secs" --authorizer="local" --cgroups_cpu_enable_pids_and_tids_count="false"
--cgroups_enable_cfs="false" --cgroups_hierarchy="/sys/fs/cgroup" --cgroups_limit_swap="false"
--cgroups_root="mesos" --container_disk_watch_interval="15secs" --containerizers="mesos" --credential="/tmp/Endpoint_SlaveEndpointTest_UnauthorizedRequest_0_LKXLf5/credential"
--default_role="*" --disk_watch_interval="1mins" --docker="docker" --docker_kill_orphans="true"
--docker_registry="https://registry-1.docker.io" --docker_remove_delay="6hrs" --docker_socket="/var/run/docker.sock"
--docker_stop_timeout="0ns" --docker_store_dir="/tmp/mesos/store/docker" --docker_volume_checkpoint_dir="/var/run/mesos/isolators/docker/volume"
--enforce_container_disk_quota="false" --executor_registration_timeout="1mins" --executor_shutdown_grace_period="5secs"
--fetcher_cache_dir="/tmp/Endpoint_SlaveEndpointTest_UnauthorizedRequest_0_LKXLf5/fetch" --fetcher_cache_size="2GB"
--frameworks_home="" --gc_delay="1weeks" --gc_disk_headroom="0.1" --hadoop_home="" --help="false"
--hostname_lookup="true" --http_authenticators="basic" --http_command_executor="false" --http_credentials="/tmp/Endpoint_SlaveEndpointTest_UnauthorizedRequest_0_LKXLf5/http_credentials"
--http_heartbeat_interval="30secs" --initialize_driver_logging="true" --isolation="posix/cpu,posix/mem"
--launcher="posix" --launcher_dir="/mesos/mesos-1.3.0/_build/src" --logbufsecs="0" --logging_level="INFO"
--max_completed_executors_per_framework="150" --oversubscribed_resources_interval="15secs"
--perf_duration="10secs" --perf_interval="1mins" --qos_correction_interval_min="0ns" --quiet="false"
--recover="reconnect" --recovery_timeout="15mins" --registration_backoff_factor="10ms" --resources="cpus:2;gpus:0;mem:1024;disk:1024;ports:[31000-32000]"
--revocable_cpu_low_priority="true" --runtime_dir="/tmp/Endpoint_SlaveEndpointTest_UnauthorizedRequest_0_LKXLf5"
--sandbox_directory="/mnt/mesos/sandbox" --strict="true" --switch_user="true" --systemd_enable_support="true"
--systemd_runtime_directory="/run/systemd/system" --version="false" --work_dir="/tmp/Endpoint_SlaveEndpointTest_UnauthorizedRequest_0_yXEUFS"
I0309 22:02:01.646337 30442 credentials.hpp:86] Loading credential for authentication from
'/tmp/Endpoint_SlaveEndpointTest_UnauthorizedRequest_0_LKXLf5/credential'
I0309 22:02:01.646541 30442 slave.cpp:358] Agent using credential for: test-principal
I0309 22:02:01.646570 30442 credentials.hpp:37] Loading credentials for authentication from
'/tmp/Endpoint_SlaveEndpointTest_UnauthorizedRequest_0_LKXLf5/http_credentials'
I0309 22:02:01.646829 30442 http.cpp:964] Using default 'basic' HTTP authenticator for realm
'mesos-agent-readonly'
I0309 22:02:01.646996 30442 http.cpp:964] Using default 'basic' HTTP authenticator for realm
'mesos-agent-readwrite'
I0309 22:02:01.648381 30442 slave.cpp:545] Agent resources: cpus(*):2; mem(*):1024; disk(*):1024;
ports(*):[31000-32000]
I0309 22:02:01.648474 30442 slave.cpp:553] Agent attributes: [  ]
I0309 22:02:01.648494 30442 slave.cpp:558] Agent hostname: 0b31381d5d3b
I0309 22:02:01.649036 30446 status_update_manager.cpp:177] Pausing sending status updates
I0309 22:02:01.650162 30446 state.cpp:62] Recovering state from '/tmp/Endpoint_SlaveEndpointTest_UnauthorizedRequest_0_yXEUFS/meta'
I0309 22:02:01.650442 30441 status_update_manager.cpp:203] Recovering status update manager
I0309 22:02:01.650719 30434 containerizer.cpp:600] Recovering containerizer
I0309 22:02:01.652463 30436 provisioner.cpp:410] Provisioner recovery complete
I0309 22:02:01.652997 30437 slave.cpp:5572] Finished recovery
I0309 22:02:01.653673 30437 slave.cpp:5754] Querying resource estimator for oversubscribable
resources
I0309 22:02:01.653964 30445 slave.cpp:5768] Received oversubscribable resources {} from the
resource estimator
I0309 22:02:01.657498 30442 process.cpp:3705] Handling HTTP event for process 'slave(710)'
with path: '/slave(710)/monitor/statistics'
I0309 22:02:01.659140 30445 http.cpp:916] Authorizing principal 'test-principal' to GET the
'/monitor/statistics' endpoint
I0309 22:02:01.661691 30444 slave.cpp:808] Agent terminating
[       OK ] Endpoint/SlaveEndpointTest.UnauthorizedRequest/0 (31 ms)
[ RUN      ] Endpoint/SlaveEndpointTest.UnauthorizedRequest/1
I0309 22:02:01.673720 30415 containerizer.cpp:221] Using isolation: posix/cpu,posix/mem,filesystem/posix,network/cni
W0309 22:02:01.674180 30415 backend.cpp:76] Failed to create 'aufs' backend: AufsBackend requires
root privileges
W0309 22:02:01.674281 30415 backend.cpp:76] Failed to create 'bind' backend: BindBackend requires
root privileges
I0309 22:02:01.674321 30415 provisioner.cpp:249] Using default backend 'copy'
I0309 22:02:01.677244 30438 slave.cpp:215] Mesos agent started on (711)@172.17.0.2:58592
I0309 22:02:01.677271 30438 slave.cpp:216] Flags at startup: --acls="" --appc_simple_discovery_uri_prefix="http://"
--appc_store_dir="/tmp/mesos/store/appc" --authenticate_http_readonly="true" --authenticate_http_readwrite="true"
--authenticatee="crammd5" --authentication_backoff_factor="1secs" --authorizer="local" --cgroups_cpu_enable_pids_and_tids_count="false"
--cgroups_enable_cfs="false" --cgroups_hierarchy="/sys/fs/cgroup" --cgroups_limit_swap="false"
--cgroups_root="mesos" --container_disk_watch_interval="15secs" --containerizers="mesos" --credential="/tmp/Endpoint_SlaveEndpointTest_UnauthorizedRequest_1_ZJQIQT/credential"
--default_role="*" --disk_watch_interval="1mins" --docker="docker" --docker_kill_orphans="true"
--docker_registry="https://registry-1.docker.io" --docker_remove_delay="6hrs" --docker_socket="/var/run/docker.sock"
--docker_stop_timeout="0ns" --docker_store_dir="/tmp/mesos/store/docker" --docker_volume_checkpoint_dir="/var/run/mesos/isolators/docker/volume"
--enforce_container_disk_quota="false" --executor_registration_timeout="1mins" --executor_shutdown_grace_period="5secs"
--fetcher_cache_dir="/tmp/Endpoint_SlaveEndpointTest_UnauthorizedRequest_1_ZJQIQT/fetch" --fetcher_cache_size="2GB"
--frameworks_home="" --gc_delay="1weeks" --gc_disk_headroom="0.1" --hadoop_home="" --help="false"
--hostname_lookup="true" --http_authenticators="basic" --http_command_executor="false" --http_credentials="/tmp/Endpoint_SlaveEndpointTest_UnauthorizedRequest_1_ZJQIQT/http_credentials"
--http_heartbeat_interval="30secs" --initialize_driver_logging="true" --isolation="posix/cpu,posix/mem"
--launcher="posix" --launcher_dir="/mesos/mesos-1.3.0/_build/src" --logbufsecs="0" --logging_level="INFO"
--max_completed_executors_per_framework="150" --oversubscribed_resources_interval="15secs"
--perf_duration="10secs" --perf_interval="1mins" --qos_correction_interval_min="0ns" --quiet="false"
--recover="reconnect" --recovery_timeout="15mins" --registration_backoff_factor="10ms" --resources="cpus:2;gpus:0;mem:1024;disk:1024;ports:[31000-32000]"
--revocable_cpu_low_priority="true" --runtime_dir="/tmp/Endpoint_SlaveEndpointTest_UnauthorizedRequest_1_ZJQIQT"
--sandbox_directory="/mnt/mesos/sandbox" --strict="true" --switch_user="true" --systemd_enable_support="true"
--systemd_runtime_directory="/run/systemd/system" --version="false" --work_dir="/tmp/Endpoint_SlaveEndpointTest_UnauthorizedRequest_1_ym8EbH"
I0309 22:02:01.677999 30438 credentials.hpp:86] Loading credential for authentication from
'/tmp/Endpoint_SlaveEndpointTest_UnauthorizedRequest_1_ZJQIQT/credential'
I0309 22:02:01.678185 30438 slave.cpp:358] Agent using credential for: test-principal
I0309 22:02:01.678212 30438 credentials.hpp:37] Loading credentials for authentication from
'/tmp/Endpoint_SlaveEndpointTest_UnauthorizedRequest_1_ZJQIQT/http_credentials'
I0309 22:02:01.678516 30438 http.cpp:964] Using default 'basic' HTTP authenticator for realm
'mesos-agent-readonly'
I0309 22:02:01.678647 30438 http.cpp:964] Using default 'basic' HTTP authenticator for realm
'mesos-agent-readwrite'
I0309 22:02:01.680239 30438 slave.cpp:545] Agent resources: cpus(*):2; mem(*):1024; disk(*):1024;
ports(*):[31000-32000]
I0309 22:02:01.680346 30438 slave.cpp:553] Agent attributes: [  ]
I0309 22:02:01.680366 30438 slave.cpp:558] Agent hostname: 0b31381d5d3b
I0309 22:02:01.680554 30437 status_update_manager.cpp:177] Pausing sending status updates
I0309 22:02:01.682353 30444 state.cpp:62] Recovering state from '/tmp/Endpoint_SlaveEndpointTest_UnauthorizedRequest_1_ym8EbH/meta'
I0309 22:02:01.682890 30434 status_update_manager.cpp:203] Recovering status update manager
I0309 22:02:01.683253 30440 containerizer.cpp:600] Recovering containerizer
I0309 22:02:01.684862 30448 provisioner.cpp:410] Provisioner recovery complete
I0309 22:02:01.685452 30442 slave.cpp:5572] Finished recovery
I0309 22:02:01.686074 30442 slave.cpp:5754] Querying resource estimator for oversubscribable
resources
I0309 22:02:01.686411 30443 slave.cpp:5768] Received oversubscribable resources {} from the
resource estimator
I0309 22:02:01.689047 30439 process.cpp:3705] Handling HTTP event for process 'slave(711)'
with path: '/slave(711)/monitor/statistics.json'
I0309 22:02:01.690623 30441 http.cpp:916] Authorizing principal 'test-principal' to GET the
'/monitor/statistics.json' endpoint
I0309 22:02:01.693285 30444 slave.cpp:808] Agent terminating
[       OK ] Endpoint/SlaveEndpointTest.UnauthorizedRequest/1 (30 ms)
[ RUN      ] Endpoint/SlaveEndpointTest.UnauthorizedRequest/2
I0309 22:02:01.703634 30415 containerizer.cpp:221] Using isolation: posix/cpu,posix/mem,filesystem/posix,network/cni
W0309 22:02:01.704282 30415 backend.cpp:76] Failed to create 'aufs' backend: AufsBackend requires
root privileges
W0309 22:02:01.704406 30415 backend.cpp:76] Failed to create 'bind' backend: BindBackend requires
root privileges
I0309 22:02:01.704459 30415 provisioner.cpp:249] Using default backend 'copy'
I0309 22:02:01.707325 30440 slave.cpp:215] Mesos agent started on (712)@172.17.0.2:58592
I0309 22:02:01.707379 30440 slave.cpp:216] Flags at startup: --acls="" --appc_simple_discovery_uri_prefix="http://"
--appc_store_dir="/tmp/mesos/store/appc" --authenticate_http_readonly="true" --authenticate_http_readwrite="true"
--authenticatee="crammd5" --authentication_backoff_factor="1secs" --authorizer="local" --cgroups_cpu_enable_pids_and_tids_count="false"
--cgroups_enable_cfs="false" --cgroups_hierarchy="/sys/fs/cgroup" --cgroups_limit_swap="false"
--cgroups_root="mesos" --container_disk_watch_interval="15secs" --containerizers="mesos" --credential="/tmp/Endpoint_SlaveEndpointTest_UnauthorizedRequest_2_PDyELI/credential"
--default_role="*" --disk_watch_interval="1mins" --docker="docker" --docker_kill_orphans="true"
--docker_registry="https://registry-1.docker.io" --docker_remove_delay="6hrs" --docker_socket="/var/run/docker.sock"
--docker_stop_timeout="0ns" --docker_store_dir="/tmp/mesos/store/docker" --docker_volume_checkpoint_dir="/var/run/mesos/isolators/docker/volume"
--enforce_container_disk_quota="false" --executor_registration_timeout="1mins" --executor_shutdown_grace_period="5secs"
--fetcher_cache_dir="/tmp/Endpoint_SlaveEndpointTest_UnauthorizedRequest_2_PDyELI/fetch" --fetcher_cache_size="2GB"
--frameworks_home="" --gc_delay="1weeks" --gc_disk_headroom="0.1" --hadoop_home="" --help="false"
--hostname_lookup="true" --http_authenticators="basic" --http_command_executor="false" --http_credentials="/tmp/Endpoint_SlaveEndpointTest_UnauthorizedRequest_2_PDyELI/http_credentials"
--http_heartbeat_interval="30secs" --initialize_driver_logging="true" --isolation="posix/cpu,posix/mem"
--launcher="posix" --launcher_dir="/mesos/mesos-1.3.0/_build/src" --logbufsecs="0" --logging_level="INFO"
--max_completed_executors_per_framework="150" --oversubscribed_resources_interval="15secs"
--perf_duration="10secs" --perf_interval="1mins" --qos_correction_interval_min="0ns" --quiet="false"
--recover="reconnect" --recovery_timeout="15mins" --registration_backoff_factor="10ms" --resources="cpus:2;gpus:0;mem:1024;disk:1024;ports:[31000-32000]"
--revocable_cpu_low_priority="true" --runtime_dir="/tmp/Endpoint_SlaveEndpointTest_UnauthorizedRequest_2_PDyELI"
--sandbox_directory="/mnt/mesos/sandbox" --strict="true" --switch_user="true" --systemd_enable_support="true"
--systemd_runtime_directory="/run/systemd/system" --version="false" --work_dir="/tmp/Endpoint_SlaveEndpointTest_UnauthorizedRequest_2_e2eJ1v"
I0309 22:02:01.708048 30440 credentials.hpp:86] Loading credential for authentication from
'/tmp/Endpoint_SlaveEndpointTest_UnauthorizedRequest_2_PDyELI/credential'
I0309 22:02:01.708281 30440 slave.cpp:358] Agent using credential for: test-principal
I0309 22:02:01.708315 30440 credentials.hpp:37] Loading credentials for authentication from
'/tmp/Endpoint_SlaveEndpointTest_UnauthorizedRequest_2_PDyELI/http_credentials'
I0309 22:02:01.708643 30440 http.cpp:964] Using default 'basic' HTTP authenticator for realm
'mesos-agent-readonly'
I0309 22:02:01.708818 30440 http.cpp:964] Using default 'basic' HTTP authenticator for realm
'mesos-agent-readwrite'
I0309 22:02:01.710379 30440 slave.cpp:545] Agent resources: cpus(*):2; mem(*):1024; disk(*):1024;
ports(*):[31000-32000]
I0309 22:02:01.710472 30440 slave.cpp:553] Agent attributes: [  ]
I0309 22:02:01.710489 30440 slave.cpp:558] Agent hostname: 0b31381d5d3b
I0309 22:02:01.710639 30446 status_update_manager.cpp:177] Pausing sending status updates
I0309 22:02:01.712178 30443 state.cpp:62] Recovering state from '/tmp/Endpoint_SlaveEndpointTest_UnauthorizedRequest_2_e2eJ1v/meta'
I0309 22:02:01.712543 30445 status_update_manager.cpp:203] Recovering status update manager
I0309 22:02:01.712780 30437 containerizer.cpp:600] Recovering containerizer
I0309 22:02:01.714140 30447 provisioner.cpp:410] Provisioner recovery complete
I0309 22:02:01.714606 30443 slave.cpp:5572] Finished recovery
I0309 22:02:01.715200 30443 slave.cpp:5754] Querying resource estimator for oversubscribable
resources
I0309 22:02:01.715459 30441 slave.cpp:5768] Received oversubscribable resources {} from the
resource estimator
I0309 22:02:01.717867 30448 process.cpp:3705] Handling HTTP event for process 'slave(712)'
with path: '/slave(712)/containers'
I0309 22:02:01.719391 30439 http.cpp:916] Authorizing principal 'test-principal' to GET the
'/containers' endpoint
I0309 22:02:01.722053 30415 slave.cpp:808] Agent terminating
[       OK ] Endpoint/SlaveEndpointTest.UnauthorizedRequest/2 (29 ms)
[ RUN      ] Endpoint/SlaveEndpointTest.NoAuthorizer/0
I0309 22:02:01.733750 30415 containerizer.cpp:221] Using isolation: posix/cpu,posix/mem,filesystem/posix,network/cni
W0309 22:02:01.734346 30415 backend.cpp:76] Failed to create 'aufs' backend: AufsBackend requires
root privileges
W0309 22:02:01.734467 30415 backend.cpp:76] Failed to create 'bind' backend: BindBackend requires
root privileges
I0309 22:02:01.734518 30415 provisioner.cpp:249] Using default backend 'copy'
I0309 22:02:01.736003 30415 cluster.cpp:446] Creating default 'local' authorizer
I0309 22:02:01.737527 30442 slave.cpp:215] Mesos agent started on (713)@172.17.0.2:58592
I0309 22:02:01.737551 30442 slave.cpp:216] Flags at startup: --acls="" --appc_simple_discovery_uri_prefix="http://"
--appc_store_dir="/tmp/mesos/store/appc" --authenticate_http_readonly="true" --authenticate_http_readwrite="true"
--authenticatee="crammd5" --authentication_backoff_factor="1secs" --authorizer="local" --cgroups_cpu_enable_pids_and_tids_count="false"
--cgroups_enable_cfs="false" --cgroups_hierarchy="/sys/fs/cgroup" --cgroups_limit_swap="false"
--cgroups_root="mesos" --container_disk_watch_interval="15secs" --containerizers="mesos" --credential="/tmp/Endpoint_SlaveEndpointTest_NoAuthorizer_0_90FHZx/credential"
--default_role="*" --disk_watch_interval="1mins" --docker="docker" --docker_kill_orphans="true"
--docker_registry="https://registry-1.docker.io" --docker_remove_delay="6hrs" --docker_socket="/var/run/docker.sock"
--docker_stop_timeout="0ns" --docker_store_dir="/tmp/mesos/store/docker" --docker_volume_checkpoint_dir="/var/run/mesos/isolators/docker/volume"
--enforce_container_disk_quota="false" --executor_registration_timeout="1mins" --executor_shutdown_grace_period="5secs"
--fetcher_cache_dir="/tmp/Endpoint_SlaveEndpointTest_NoAuthorizer_0_90FHZx/fetch" --fetcher_cache_size="2GB"
--frameworks_home="" --gc_delay="1weeks" --gc_disk_headroom="0.1" --hadoop_home="" --help="false"
--hostname_lookup="true" --http_authenticators="basic" --http_command_executor="false" --http_credentials="/tmp/Endpoint_SlaveEndpointTest_NoAuthorizer_0_90FHZx/http_credentials"
--http_heartbeat_interval="30secs" --initialize_driver_logging="true" --isolation="posix/cpu,posix/mem"
--launcher="posix" --launcher_dir="/mesos/mesos-1.3.0/_build/src" --logbufsecs="0" --logging_level="INFO"
--max_completed_executors_per_framework="150" --oversubscribed_resources_interval="15secs"
--perf_duration="10secs" --perf_interval="1mins" --qos_correction_interval_min="0ns" --quiet="false"
--recover="reconnect" --recovery_timeout="15mins" --registration_backoff_factor="10ms" --resources="cpus:2;gpus:0;mem:1024;disk:1024;ports:[31000-32000]"
--revocable_cpu_low_priority="true" --runtime_dir="/tmp/Endpoint_SlaveEndpointTest_NoAuthorizer_0_90FHZx"
--sandbox_directory="/mnt/mesos/sandbox" --strict="true" --switch_user="true" --systemd_enable_support="true"
--systemd_runtime_directory="/run/systemd/system" --version="false" --work_dir="/tmp/Endpoint_SlaveEndpointTest_NoAuthorizer_0_kZoXal"
I0309 22:02:01.738119 30442 credentials.hpp:86] Loading credential for authentication from
'/tmp/Endpoint_SlaveEndpointTest_NoAuthorizer_0_90FHZx/credential'
I0309 22:02:01.738258 30442 slave.cpp:358] Agent using credential for: test-principal
I0309 22:02:01.738279 30442 credentials.hpp:37] Loading credentials for authentication from
'/tmp/Endpoint_SlaveEndpointTest_NoAuthorizer_0_90FHZx/http_credentials'
I0309 22:02:01.738487 30442 http.cpp:964] Using default 'basic' HTTP authenticator for realm
'mesos-agent-readonly'
I0309 22:02:01.738610 30442 http.cpp:964] Using default 'basic' HTTP authenticator for realm
'mesos-agent-readwrite'
I0309 22:02:01.739785 30442 slave.cpp:545] Agent resources: cpus(*):2; mem(*):1024; disk(*):1024;
ports(*):[31000-32000]
I0309 22:02:01.739864 30442 slave.cpp:553] Agent attributes: [  ]
I0309 22:02:01.739886 30442 slave.cpp:558] Agent hostname: 0b31381d5d3b
I0309 22:02:01.740063 30448 status_update_manager.cpp:177] Pausing sending status updates
I0309 22:02:01.741552 30436 state.cpp:62] Recovering state from '/tmp/Endpoint_SlaveEndpointTest_NoAuthorizer_0_kZoXal/meta'
I0309 22:02:01.741978 30434 status_update_manager.cpp:203] Recovering status update manager
I0309 22:02:01.742256 30447 containerizer.cpp:600] Recovering containerizer
I0309 22:02:01.743993 30442 provisioner.cpp:410] Provisioner recovery complete
I0309 22:02:01.744451 30436 slave.cpp:5572] Finished recovery
I0309 22:02:01.745282 30436 slave.cpp:5754] Querying resource estimator for oversubscribable
resources
I0309 22:02:01.745764 30436 slave.cpp:5768] Received oversubscribable resources {} from the
resource estimator
I0309 22:02:01.748605 30448 process.cpp:3705] Handling HTTP event for process 'slave(713)'
with path: '/slave(713)/monitor/statistics'
I0309 22:02:01.750619 30448 http.cpp:916] Authorizing principal 'test-principal' to GET the
'/monitor/statistics' endpoint
I0309 22:02:01.755244 30415 slave.cpp:808] Agent terminating
[       OK ] Endpoint/SlaveEndpointTest.NoAuthorizer/0 (33 ms)
[ RUN      ] Endpoint/SlaveEndpointTest.NoAuthorizer/1
I0309 22:02:01.767252 30415 containerizer.cpp:221] Using isolation: posix/cpu,posix/mem,filesystem/posix,network/cni
W0309 22:02:01.767745 30415 backend.cpp:76] Failed to create 'aufs' backend: AufsBackend requires
root privileges
W0309 22:02:01.767855 30415 backend.cpp:76] Failed to create 'bind' backend: BindBackend requires
root privileges
I0309 22:02:01.767902 30415 provisioner.cpp:249] Using default backend 'copy'
I0309 22:02:01.769387 30415 cluster.cpp:446] Creating default 'local' authorizer
I0309 22:02:01.770987 30436 slave.cpp:215] Mesos agent started on (714)@172.17.0.2:58592
I0309 22:02:01.771014 30436 slave.cpp:216] Flags at startup: --acls="" --appc_simple_discovery_uri_prefix="http://"
--appc_store_dir="/tmp/mesos/store/appc" --authenticate_http_readonly="true" --authenticate_http_readwrite="true"
--authenticatee="crammd5" --authentication_backoff_factor="1secs" --authorizer="local" --cgroups_cpu_enable_pids_and_tids_count="false"
--cgroups_enable_cfs="false" --cgroups_hierarchy="/sys/fs/cgroup" --cgroups_limit_swap="false"
--cgroups_root="mesos" --container_disk_watch_interval="15secs" --containerizers="mesos" --credential="/tmp/Endpoint_SlaveEndpointTest_NoAuthorizer_1_BHRdzn/credential"
--default_role="*" --disk_watch_interval="1mins" --docker="docker" --docker_kill_orphans="true"
--docker_registry="https://registry-1.docker.io" --docker_remove_delay="6hrs" --docker_socket="/var/run/docker.sock"
--docker_stop_timeout="0ns" --docker_store_dir="/tmp/mesos/store/docker" --docker_volume_checkpoint_dir="/var/run/mesos/isolators/docker/volume"
--enforce_container_disk_quota="false" --executor_registration_timeout="1mins" --executor_shutdown_grace_period="5secs"
--fetcher_cache_dir="/tmp/Endpoint_SlaveEndpointTest_NoAuthorizer_1_BHRdzn/fetch" --fetcher_cache_size="2GB"
--frameworks_home="" --gc_delay="1weeks" --gc_disk_headroom="0.1" --hadoop_home="" --help="false"
--hostname_lookup="true" --http_authenticators="basic" --http_command_executor="false" --http_credentials="/tmp/Endpoint_SlaveEndpointTest_NoAuthorizer_1_BHRdzn/http_credentials"
--http_heartbeat_interval="30secs" --initialize_driver_logging="true" --isolation="posix/cpu,posix/mem"
--launcher="posix" --launcher_dir="/mesos/mesos-1.3.0/_build/src" --logbufsecs="0" --logging_level="INFO"
--max_completed_executors_per_framework="150" --oversubscribed_resources_interval="15secs"
--perf_duration="10secs" --perf_interval="1mins" --qos_correction_interval_min="0ns" --quiet="false"
--recover="reconnect" --recovery_timeout="15mins" --registration_backoff_factor="10ms" --resources="cpus:2;gpus:0;mem:1024;disk:1024;ports:[31000-32000]"
--revocable_cpu_low_priority="true" --runtime_dir="/tmp/Endpoint_SlaveEndpointTest_NoAuthorizer_1_BHRdzn"
--sandbox_directory="/mnt/mesos/sandbox" --strict="true" --switch_user="true" --systemd_enable_support="true"
--systemd_runtime_directory="/run/systemd/system" --version="false" --work_dir="/tmp/Endpoint_SlaveEndpointTest_NoAuthorizer_1_IOyWEa"
I0309 22:02:01.771714 30436 credentials.hpp:86] Loading credential for authentication from
'/tmp/Endpoint_SlaveEndpointTest_NoAuthorizer_1_BHRdzn/credential'
I0309 22:02:01.771872 30436 slave.cpp:358] Agent using credential for: test-principal
I0309 22:02:01.771888 30436 credentials.hpp:37] Loading credentials for authentication from
'/tmp/Endpoint_SlaveEndpointTest_NoAuthorizer_1_BHRdzn/http_credentials'
I0309 22:02:01.772188 30436 http.cpp:964] Using default 'basic' HTTP authenticator for realm
'mesos-agent-readonly'
I0309 22:02:01.772377 30436 http.cpp:964] Using default 'basic' HTTP authenticator for realm
'mesos-agent-readwrite'
I0309 22:02:01.774252 30436 slave.cpp:545] Agent resources: cpus(*):2; mem(*):1024; disk(*):1024;
ports(*):[31000-32000]
I0309 22:02:01.774379 30436 slave.cpp:553] Agent attributes: [  ]
I0309 22:02:01.774412 30436 slave.cpp:558] Agent hostname: 0b31381d5d3b
I0309 22:02:01.774615 30449 status_update_manager.cpp:177] Pausing sending status updates
I0309 22:02:01.776176 30439 state.cpp:62] Recovering state from '/tmp/Endpoint_SlaveEndpointTest_NoAuthorizer_1_IOyWEa/meta'
I0309 22:02:01.776697 30440 status_update_manager.cpp:203] Recovering status update manager
I0309 22:02:01.776898 30440 containerizer.cpp:600] Recovering containerizer
I0309 22:02:01.778815 30436 provisioner.cpp:410] Provisioner recovery complete
I0309 22:02:01.779295 30436 slave.cpp:5572] Finished recovery
I0309 22:02:01.780072 30436 slave.cpp:5754] Querying resource estimator for oversubscribable
resources
I0309 22:02:01.780434 30448 slave.cpp:5768] Received oversubscribable resources {} from the
resource estimator
I0309 22:02:01.783295 30449 process.cpp:3705] Handling HTTP event for process 'slave(714)'
with path: '/slave(714)/monitor/statistics.json'
I0309 22:02:01.785507 30434 http.cpp:916] Authorizing principal 'test-principal' to GET the
'/monitor/statistics.json' endpoint
I0309 22:02:01.790163 30442 slave.cpp:808] Agent terminating
[       OK ] Endpoint/SlaveEndpointTest.NoAuthorizer/1 (33 ms)
[ RUN      ] Endpoint/SlaveEndpointTest.NoAuthorizer/2
I0309 22:02:01.801861 30415 containerizer.cpp:221] Using isolation: posix/cpu,posix/mem,filesystem/posix,network/cni
W0309 22:02:01.802372 30415 backend.cpp:76] Failed to create 'aufs' backend: AufsBackend requires
root privileges
W0309 22:02:01.802466 30415 backend.cpp:76] Failed to create 'bind' backend: BindBackend requires
root privileges
I0309 22:02:01.802505 30415 provisioner.cpp:249] Using default backend 'copy'
I0309 22:02:01.803850 30415 cluster.cpp:446] Creating default 'local' authorizer
I0309 22:02:01.805336 30438 slave.cpp:215] Mesos agent started on (715)@172.17.0.2:58592
I0309 22:02:01.805361 30438 slave.cpp:216] Flags at startup: --acls="" --appc_simple_discovery_uri_prefix="http://"
--appc_store_dir="/tmp/mesos/store/appc" --authenticate_http_readonly="true" --authenticate_http_readwrite="true"
--authenticatee="crammd5" --authentication_backoff_factor="1secs" --authorizer="local" --cgroups_cpu_enable_pids_and_tids_count="false"
--cgroups_enable_cfs="false" --cgroups_hierarchy="/sys/fs/cgroup" --cgroups_limit_swap="false"
--cgroups_root="mesos" --container_disk_watch_interval="15secs" --containerizers="mesos" --credential="/tmp/Endpoint_SlaveEndpointTest_NoAuthorizer_2_gr54ud/credential"
--default_role="*" --disk_watch_interval="1mins" --docker="docker" --docker_kill_orphans="true"
--docker_registry="https://registry-1.docker.io" --docker_remove_delay="6hrs" --docker_socket="/var/run/docker.sock"
--docker_stop_timeout="0ns" --docker_store_dir="/tmp/mesos/store/docker" --docker_volume_checkpoint_dir="/var/run/mesos/isolators/docker/volume"
--enforce_container_disk_quota="false" --executor_registration_timeout="1mins" --executor_shutdown_grace_period="5secs"
--fetcher_cache_dir="/tmp/Endpoint_SlaveEndpointTest_NoAuthorizer_2_gr54ud/fetch" --fetcher_cache_size="2GB"
--frameworks_home="" --gc_delay="1weeks" --gc_disk_headroom="0.1" --hadoop_home="" --help="false"
--hostname_lookup="true" --http_authenticators="basic" --http_command_executor="false" --http_credentials="/tmp/Endpoint_SlaveEndpointTest_NoAuthorizer_2_gr54ud/http_credentials"
--http_heartbeat_interval="30secs" --initialize_driver_logging="true" --isolation="posix/cpu,posix/mem"
--launcher="posix" --launcher_dir="/mesos/mesos-1.3.0/_build/src" --logbufsecs="0" --logging_level="INFO"
--max_completed_executors_per_framework="150" --oversubscribed_resources_interval="15secs"
--perf_duration="10secs" --perf_interval="1mins" --qos_correction_interval_min="0ns" --quiet="false"
--recover="reconnect" --recovery_timeout="15mins" --registration_backoff_factor="10ms" --resources="cpus:2;gpus:0;mem:1024;disk:1024;ports:[31000-32000]"
--revocable_cpu_low_priority="true" --runtime_dir="/tmp/Endpoint_SlaveEndpointTest_NoAuthorizer_2_gr54ud"
--sandbox_directory="/mnt/mesos/sandbox" --strict="true" --switch_user="true" --systemd_enable_support="true"
--systemd_runtime_directory="/run/systemd/system" --version="false" --work_dir="/tmp/Endpoint_SlaveEndpointTest_NoAuthorizer_2_RVKev0"
I0309 22:02:01.805891 30438 credentials.hpp:86] Loading credential for authentication from
'/tmp/Endpoint_SlaveEndpointTest_NoAuthorizer_2_gr54ud/credential'
I0309 22:02:01.806120 30438 slave.cpp:358] Agent using credential for: test-principal
I0309 22:02:01.806190 30438 credentials.hpp:37] Loading credentials for authentication from
'/tmp/Endpoint_SlaveEndpointTest_NoAuthorizer_2_gr54ud/http_credentials'
I0309 22:02:01.806426 30438 http.cpp:964] Using default 'basic' HTTP authenticator for realm
'mesos-agent-readonly'
I0309 22:02:01.806558 30438 http.cpp:964] Using default 'basic' HTTP authenticator for realm
'mesos-agent-readwrite'
I0309 22:02:01.807647 30438 slave.cpp:545] Agent resources: cpus(*):2; mem(*):1024; disk(*):1024;
ports(*):[31000-32000]
I0309 22:02:01.807723 30438 slave.cpp:553] Agent attributes: [  ]
I0309 22:02:01.807734 30438 slave.cpp:558] Agent hostname: 0b31381d5d3b
I0309 22:02:01.807920 30446 status_update_manager.cpp:177] Pausing sending status updates
I0309 22:02:01.809343 30441 state.cpp:62] Recovering state from '/tmp/Endpoint_SlaveEndpointTest_NoAuthorizer_2_RVKev0/meta'
I0309 22:02:01.809685 30443 status_update_manager.cpp:203] Recovering status update manager
I0309 22:02:01.810073 30442 containerizer.cpp:600] Recovering containerizer
I0309 22:02:01.811619 30435 provisioner.cpp:410] Provisioner recovery complete
I0309 22:02:01.812000 30444 slave.cpp:5572] Finished recovery
I0309 22:02:01.812697 30444 slave.cpp:5754] Querying resource estimator for oversubscribable
resources
I0309 22:02:01.813002 30435 slave.cpp:5768] Received oversubscribable resources {} from the
resource estimator
I0309 22:02:01.816174 30437 process.cpp:3705] Handling HTTP event for process 'slave(715)'
with path: '/slave(715)/containers'
I0309 22:02:01.817947 30449 http.cpp:916] Authorizing principal 'test-principal' to GET the
'/containers' endpoint
I0309 22:02:01.822094 30439 slave.cpp:808] Agent terminating
[       OK ] Endpoint/SlaveEndpointTest.NoAuthorizer/2 (31 ms)
[----------] 9 tests from Endpoint/SlaveEndpointTest (290 ms total)

[----------] Global test environment tear-down
[==========] 1516 tests from 169 test cases ran. (510580 ms total)
[  PASSED  ] 1515 tests.
[  FAILED  ] 1 test, listed below:
[  FAILED  ] ReconciliationTest.TaskStateMismatch

 1 FAILED TEST
  YOU HAVE 12 DISABLED TESTS

make[4]: *** [check-local] Error 1
make[4]: Leaving directory `/mesos/mesos-1.3.0/_build/src'
make[3]: *** [check-am] Error 2
make[3]: Leaving directory `/mesos/mesos-1.3.0/_build/src'
make[2]: *** [check] Error 2
make[2]: Leaving directory `/mesos/mesos-1.3.0/_build/src'
make[1]: *** [check-recursive] Error 1
make[1]: Leaving directory `/mesos/mesos-1.3.0/_build'
make: *** [distcheck] Error 1
+ docker rmi mesos-1489093883-8352
Untagged: mesos-1489093883-8352:latest
Deleted: sha256:8bec347d08548b0204df07a6fe2765e21df10fad4818dbd2ec7a4b9f3a05f7b8
Deleted: sha256:3f6a9c7c5dbb7fcbecb4407eaee7d6116d0681f92f362d7a2ae2e95b18fbd663
Deleted: sha256:6de49239bf76998bbd073728d4ba8db8040a6a7174824123baeb111297c02b15
Deleted: sha256:45dd0887cfda4cf0ad679cbd5d1e81d229a7d574bca5777540c476a05ba0732c
Deleted: sha256:655a04b1ef75de12284b394cc00eb2bf2d4b3eb3fbc0090d070698ceba245b19
Deleted: sha256:e7aef911c234ea27d48138735bcd35b5ccaae92996b46d41f79710c7f55a070d
Deleted: sha256:4d833cc9ece2bc9cf02a2a7cf4e2c2afe2444da866e1fc3641c1c8ec909ad8d4
Deleted: sha256:3a023d70f596d5e3bb8ee4281dc17a17b240c15a6082af7456cd40ac320f2887
Deleted: sha256:c6840b94e8d3b67ec49c82e23e17811d92dd7069b62e8e0724c69d04f437b678
Deleted: sha256:b3d0633b0eec2c94dafec84a8a8bb6214c423cabf36ebc19dd70911638d75c98
Deleted: sha256:7d084851e7f49edd44fce96fa441d9716aa5769af47513582f7ea44daa4c7c71
Deleted: sha256:d92c36080f5a085bf9dfb678260dfd78fae9463be3f92b62c196bd013c6fdb4a
Deleted: sha256:dc6862dbdd78641971563b610a6322cfe331d7791c94878af33b347ff7059c80
Deleted: sha256:3033cec3c32a72dd74cdae0e6360142d5fac1730e7f2c1c81537bd1dc3e2b23c
Deleted: sha256:3ad8d39da58294f62f5b20bd0ef09c1b258721ea9ce173ca27b6a3afa9ee8d4c
Deleted: sha256:50661465dd83576613680cf0a4e3613b37fae81bb650b403fb5330e2f72aa896
Deleted: sha256:31c1f23142a91c9bffa6bdc0186d231bc34bf7526c133b4967a15dcd03ab2361
Deleted: sha256:f265c72122b0a435bf75aea4a40ba396d3661043b5e22b75da80f190113f928f
Deleted: sha256:b86bc195d22009d8389474bacc5e6e26406e4369e241c839d12bdcfcfe24ff07
Deleted: sha256:d497cc1a620db14a34e8b2f1e154cb00f5f98ce420abe98dcb5f5e7862a48a8f
Deleted: sha256:08667bbec07c8f0c71f2d5010fcf219e3c26782f23da57d4103d84641ed199dc
Deleted: sha256:6c3aed28480a8da007c4bae40e10e2c096bbc3c0d3bff8f2240ba276b883b343
Deleted: sha256:9baec2fe5ae3ade29ae1c44a71070ceacedf049ef102d4fcd2d6b8d94fac6ed1
Deleted: sha256:80e4fb3a66f03abededfb78f94480250a1f43eda03f41ff4a0ca3da2186ef570
Build step 'Execute shell' marked build as failure

Mime
View raw message