mesos-builds mailing list archives

Site index · List index
Message view « Date » · « Thread »
Top « Date » · « Thread »
From Apache Jenkins Server <jenk...@builds.apache.org>
Subject Build failed in Jenkins: Mesos-Buildbot » autotools,gcc,--verbose --enable-libevent --enable-ssl,GLOG_v=1 MESOS_VERBOSE=1,ubuntu:14.04,(docker||Hadoop)&&(!ubuntu-us1)&&(!ubuntu-eu2) #3433
Date Wed, 29 Mar 2017 23:26:09 GMT
See <https://builds.apache.org/job/Mesos-Buildbot/BUILDTOOL=autotools,COMPILER=gcc,CONFIGURATION=--verbose%20--enable-libevent%20--enable-ssl,ENVIRONMENT=GLOG_v=1%20MESOS_VERBOSE=1,OS=ubuntu%3A14.04,label_exp=(docker%7C%7CHadoop)&&(!ubuntu-us1)&&(!ubuntu-eu2)/3433/display/redirect?page=changes>

Changes:

[yujie.jay] Added UNKNOWN DiskInfo.Source type.

[yujie.jay] Added ResourceProviderID.

------------------------------------------
[...truncated 27.19 MB...]
I0329 23:26:01.777999 16802 slave.cpp:505] Agent hostname: 5a2f59a29eef
I0329 23:26:01.778151 16798 status_update_manager.cpp:177] Pausing sending status updates
I0329 23:26:01.779650 16793 state.cpp:62] Recovering state from '/tmp/Endpoint_SlaveEndpointTest_AuthorizedRequest_2_hR1KVY/meta'
I0329 23:26:01.780112 16792 status_update_manager.cpp:203] Recovering status update manager
I0329 23:26:01.780375 16788 containerizer.cpp:608] Recovering containerizer
I0329 23:26:01.782135 16798 provisioner.cpp:410] Provisioner recovery complete
I0329 23:26:01.782637 16796 slave.cpp:5927] Finished recovery
I0329 23:26:01.783241 16796 slave.cpp:6109] Querying resource estimator for oversubscribable
resources
I0329 23:26:01.783587 16789 slave.cpp:6123] Received oversubscribable resources {} from the
resource estimator
I0329 23:26:01.785958 16803 process.cpp:3705] Handling HTTP event for process 'slave(724)'
with path: '/slave(724)/containers'
I0329 23:26:01.788188 16798 http.cpp:936] Authorizing principal 'test-principal' to GET the
'/containers' endpoint
I0329 23:26:01.792484 16803 slave.cpp:754] Agent terminating
[       OK ] Endpoint/SlaveEndpointTest.AuthorizedRequest/2 (32 ms)
[ RUN      ] Endpoint/SlaveEndpointTest.UnauthorizedRequest/0
I0329 23:26:01.803112 32758 containerizer.cpp:221] Using isolation: posix/cpu,posix/mem,filesystem/posix,network/cni
W0329 23:26:01.803526 32758 backend.cpp:76] Failed to create 'aufs' backend: AufsBackend requires
root privileges
W0329 23:26:01.803609 32758 backend.cpp:76] Failed to create 'bind' backend: BindBackend requires
root privileges
I0329 23:26:01.803637 32758 provisioner.cpp:249] Using default backend 'copy'
I0329 23:26:01.806489 16797 slave.cpp:226] Mesos agent started on (725)@172.17.0.2:33829
I0329 23:26:01.806510 16797 slave.cpp:227] Flags at startup: --acls="" --appc_simple_discovery_uri_prefix="http://"
--appc_store_dir="/tmp/mesos/store/appc" --authenticate_http_executors="true" --authenticate_http_readonly="true"
--authenticate_http_readwrite="true" --authenticatee="crammd5" --authentication_backoff_factor="1secs"
--authorizer="local" --cgroups_cpu_enable_pids_and_tids_count="false" --cgroups_enable_cfs="false"
--cgroups_hierarchy="/sys/fs/cgroup" --cgroups_limit_swap="false" --cgroups_root="mesos" --container_disk_watch_interval="15secs"
--containerizers="mesos" --credential="/tmp/Endpoint_SlaveEndpointTest_UnauthorizedRequest_0_ti5XrJ/credential"
--default_role="*" --disk_watch_interval="1mins" --docker="docker" --docker_kill_orphans="true"
--docker_registry="https://registry-1.docker.io" --docker_remove_delay="6hrs" --docker_socket="/var/run/docker.sock"
--docker_stop_timeout="0ns" --docker_store_dir="/tmp/mesos/store/docker" --docker_volume_checkpoint_dir="/var/run/mesos/isolators/docker/volume"
--enforce_container_disk_quota="false" --executor_registration_timeout="1mins" --executor_secret_key="secret_key"
--executor_shutdown_grace_period="5secs" --fetcher_cache_dir="/tmp/Endpoint_SlaveEndpointTest_UnauthorizedRequest_0_ti5XrJ/fetch"
--fetcher_cache_size="2GB" --frameworks_home="" --gc_delay="1weeks" --gc_disk_headroom="0.1"
--hadoop_home="" --help="false" --hostname_lookup="true" --http_command_executor="false" --http_credentials="/tmp/Endpoint_SlaveEndpointTest_UnauthorizedRequest_0_ti5XrJ/http_credentials"
--http_heartbeat_interval="30secs" --initialize_driver_logging="true" --isolation="posix/cpu,posix/mem"
--launcher="posix" --launcher_dir="/mesos/mesos-1.3.0/_build/src" --logbufsecs="0" --logging_level="INFO"
--max_completed_executors_per_framework="150" --oversubscribed_resources_interval="15secs"
--perf_duration="10secs" --perf_interval="1mins" --qos_correction_interval_min="0ns" --quiet="false"
--recover="reconnect" --recovery_timeout="15mins" --registration_backoff_factor="10ms" --resources="cpus:2;gpus:0;mem:1024;disk:1024;ports:[31000-32000]"
--revocable_cpu_low_priority="true" --runtime_dir="/tmp/Endpoint_SlaveEndpointTest_UnauthorizedRequest_0_ti5XrJ"
--sandbox_directory="/mnt/mesos/sandbox" --strict="true" --switch_user="true" --systemd_enable_support="true"
--systemd_runtime_directory="/run/systemd/system" --version="false" --work_dir="/tmp/Endpoint_SlaveEndpointTest_UnauthorizedRequest_0_ZgAo7z"
I0329 23:26:01.807199 16797 credentials.hpp:86] Loading credential for authentication from
'/tmp/Endpoint_SlaveEndpointTest_UnauthorizedRequest_0_ti5XrJ/credential'
I0329 23:26:01.807374 16797 slave.cpp:259] Agent using credential for: test-principal
I0329 23:26:01.807401 16797 credentials.hpp:37] Loading credentials for authentication from
'/tmp/Endpoint_SlaveEndpointTest_UnauthorizedRequest_0_ti5XrJ/http_credentials'
I0329 23:26:01.807713 16797 http.cpp:975] Creating default 'basic' HTTP authenticator for
realm 'mesos-agent-executor'
I0329 23:26:01.807848 16797 http.cpp:996] Creating default 'jwt' HTTP authenticator for realm
'mesos-agent-executor'
I0329 23:26:01.808162 16797 http.cpp:975] Creating default 'basic' HTTP authenticator for
realm 'mesos-agent-readonly'
I0329 23:26:01.808290 16797 http.cpp:996] Creating default 'jwt' HTTP authenticator for realm
'mesos-agent-readonly'
I0329 23:26:01.808606 16797 http.cpp:975] Creating default 'basic' HTTP authenticator for
realm 'mesos-agent-readwrite'
I0329 23:26:01.808746 16797 http.cpp:996] Creating default 'jwt' HTTP authenticator for realm
'mesos-agent-readwrite'
I0329 23:26:01.810178 16797 slave.cpp:492] Agent resources: cpus(*):2; mem(*):1024; disk(*):1024;
ports(*):[31000-32000]
I0329 23:26:01.810271 16797 slave.cpp:500] Agent attributes: [  ]
I0329 23:26:01.810288 16797 slave.cpp:505] Agent hostname: 5a2f59a29eef
I0329 23:26:01.810442 16791 status_update_manager.cpp:177] Pausing sending status updates
I0329 23:26:01.811879 16801 state.cpp:62] Recovering state from '/tmp/Endpoint_SlaveEndpointTest_UnauthorizedRequest_0_ZgAo7z/meta'
I0329 23:26:01.812232 16794 status_update_manager.cpp:203] Recovering status update manager
I0329 23:26:01.812454 16802 containerizer.cpp:608] Recovering containerizer
I0329 23:26:01.813838 16790 provisioner.cpp:410] Provisioner recovery complete
I0329 23:26:01.814199 16802 slave.cpp:5927] Finished recovery
I0329 23:26:01.814724 16802 slave.cpp:6109] Querying resource estimator for oversubscribable
resources
I0329 23:26:01.814967 16790 slave.cpp:6123] Received oversubscribable resources {} from the
resource estimator
I0329 23:26:01.817114 16792 process.cpp:3705] Handling HTTP event for process 'slave(725)'
with path: '/slave(725)/monitor/statistics'
I0329 23:26:01.818780 16798 http.cpp:936] Authorizing principal 'test-principal' to GET the
'/monitor/statistics' endpoint
I0329 23:26:01.820973 16793 slave.cpp:754] Agent terminating
[       OK ] Endpoint/SlaveEndpointTest.UnauthorizedRequest/0 (27 ms)
[ RUN      ] Endpoint/SlaveEndpointTest.UnauthorizedRequest/1
I0329 23:26:01.831393 32758 containerizer.cpp:221] Using isolation: posix/cpu,posix/mem,filesystem/posix,network/cni
W0329 23:26:01.831967 32758 backend.cpp:76] Failed to create 'aufs' backend: AufsBackend requires
root privileges
W0329 23:26:01.832075 32758 backend.cpp:76] Failed to create 'bind' backend: BindBackend requires
root privileges
I0329 23:26:01.832113 32758 provisioner.cpp:249] Using default backend 'copy'
I0329 23:26:01.835352 16789 slave.cpp:226] Mesos agent started on (726)@172.17.0.2:33829
I0329 23:26:01.835383 16789 slave.cpp:227] Flags at startup: --acls="" --appc_simple_discovery_uri_prefix="http://"
--appc_store_dir="/tmp/mesos/store/appc" --authenticate_http_executors="true" --authenticate_http_readonly="true"
--authenticate_http_readwrite="true" --authenticatee="crammd5" --authentication_backoff_factor="1secs"
--authorizer="local" --cgroups_cpu_enable_pids_and_tids_count="false" --cgroups_enable_cfs="false"
--cgroups_hierarchy="/sys/fs/cgroup" --cgroups_limit_swap="false" --cgroups_root="mesos" --container_disk_watch_interval="15secs"
--containerizers="mesos" --credential="/tmp/Endpoint_SlaveEndpointTest_UnauthorizedRequest_1_1KYF1k/credential"
--default_role="*" --disk_watch_interval="1mins" --docker="docker" --docker_kill_orphans="true"
--docker_registry="https://registry-1.docker.io" --docker_remove_delay="6hrs" --docker_socket="/var/run/docker.sock"
--docker_stop_timeout="0ns" --docker_store_dir="/tmp/mesos/store/docker" --docker_volume_checkpoint_dir="/var/run/mesos/isolators/docker/volume"
--enforce_container_disk_quota="false" --executor_registration_timeout="1mins" --executor_secret_key="secret_key"
--executor_shutdown_grace_period="5secs" --fetcher_cache_dir="/tmp/Endpoint_SlaveEndpointTest_UnauthorizedRequest_1_1KYF1k/fetch"
--fetcher_cache_size="2GB" --frameworks_home="" --gc_delay="1weeks" --gc_disk_headroom="0.1"
--hadoop_home="" --help="false" --hostname_lookup="true" --http_command_executor="false" --http_credentials="/tmp/Endpoint_SlaveEndpointTest_UnauthorizedRequest_1_1KYF1k/http_credentials"
--http_heartbeat_interval="30secs" --initialize_driver_logging="true" --isolation="posix/cpu,posix/mem"
--launcher="posix" --launcher_dir="/mesos/mesos-1.3.0/_build/src" --logbufsecs="0" --logging_level="INFO"
--max_completed_executors_per_framework="150" --oversubscribed_resources_interval="15secs"
--perf_duration="10secs" --perf_interval="1mins" --qos_correction_interval_min="0ns" --quiet="false"
--recover="reconnect" --recovery_timeout="15mins" --registration_backoff_factor="10ms" --resources="cpus:2;gpus:0;mem:1024;disk:1024;ports:[31000-32000]"
--revocable_cpu_low_priority="true" --runtime_dir="/tmp/Endpoint_SlaveEndpointTest_UnauthorizedRequest_1_1KYF1k"
--sandbox_directory="/mnt/mesos/sandbox" --strict="true" --switch_user="true" --systemd_enable_support="true"
--systemd_runtime_directory="/run/systemd/system" --version="false" --work_dir="/tmp/Endpoint_SlaveEndpointTest_UnauthorizedRequest_1_n6bACb"
I0329 23:26:01.835954 16789 credentials.hpp:86] Loading credential for authentication from
'/tmp/Endpoint_SlaveEndpointTest_UnauthorizedRequest_1_1KYF1k/credential'
I0329 23:26:01.836138 16789 slave.cpp:259] Agent using credential for: test-principal
I0329 23:26:01.836159 16789 credentials.hpp:37] Loading credentials for authentication from
'/tmp/Endpoint_SlaveEndpointTest_UnauthorizedRequest_1_1KYF1k/http_credentials'
I0329 23:26:01.836398 16789 http.cpp:975] Creating default 'basic' HTTP authenticator for
realm 'mesos-agent-executor'
I0329 23:26:01.836513 16789 http.cpp:996] Creating default 'jwt' HTTP authenticator for realm
'mesos-agent-executor'
I0329 23:26:01.836964 16789 http.cpp:975] Creating default 'basic' HTTP authenticator for
realm 'mesos-agent-readonly'
I0329 23:26:01.837054 16789 http.cpp:996] Creating default 'jwt' HTTP authenticator for realm
'mesos-agent-readonly'
I0329 23:26:01.837306 16789 http.cpp:975] Creating default 'basic' HTTP authenticator for
realm 'mesos-agent-readwrite'
I0329 23:26:01.837430 16789 http.cpp:996] Creating default 'jwt' HTTP authenticator for realm
'mesos-agent-readwrite'
I0329 23:26:01.838924 16789 slave.cpp:492] Agent resources: cpus(*):2; mem(*):1024; disk(*):1024;
ports(*):[31000-32000]
I0329 23:26:01.839007 16789 slave.cpp:500] Agent attributes: [  ]
I0329 23:26:01.839027 16789 slave.cpp:505] Agent hostname: 5a2f59a29eef
I0329 23:26:01.839191 16793 status_update_manager.cpp:177] Pausing sending status updates
I0329 23:26:01.840636 16796 state.cpp:62] Recovering state from '/tmp/Endpoint_SlaveEndpointTest_UnauthorizedRequest_1_n6bACb/meta'
I0329 23:26:01.841035 16800 status_update_manager.cpp:203] Recovering status update manager
I0329 23:26:01.841294 16801 containerizer.cpp:608] Recovering containerizer
I0329 23:26:01.843111 16788 provisioner.cpp:410] Provisioner recovery complete
I0329 23:26:01.843616 16801 slave.cpp:5927] Finished recovery
I0329 23:26:01.844375 16801 slave.cpp:6109] Querying resource estimator for oversubscribable
resources
I0329 23:26:01.844698 16803 slave.cpp:6123] Received oversubscribable resources {} from the
resource estimator
I0329 23:26:01.846978 16796 process.cpp:3705] Handling HTTP event for process 'slave(726)'
with path: '/slave(726)/monitor/statistics.json'
I0329 23:26:01.848912 16794 http.cpp:936] Authorizing principal 'test-principal' to GET the
'/monitor/statistics.json' endpoint
I0329 23:26:01.852157 16796 slave.cpp:754] Agent terminating
[       OK ] Endpoint/SlaveEndpointTest.UnauthorizedRequest/1 (32 ms)
[ RUN      ] Endpoint/SlaveEndpointTest.UnauthorizedRequest/2
I0329 23:26:01.863948 32758 containerizer.cpp:221] Using isolation: posix/cpu,posix/mem,filesystem/posix,network/cni
W0329 23:26:01.864490 32758 backend.cpp:76] Failed to create 'aufs' backend: AufsBackend requires
root privileges
W0329 23:26:01.864606 32758 backend.cpp:76] Failed to create 'bind' backend: BindBackend requires
root privileges
I0329 23:26:01.864653 32758 provisioner.cpp:249] Using default backend 'copy'
I0329 23:26:01.868005 16789 slave.cpp:226] Mesos agent started on (727)@172.17.0.2:33829
I0329 23:26:01.868031 16789 slave.cpp:227] Flags at startup: --acls="" --appc_simple_discovery_uri_prefix="http://"
--appc_store_dir="/tmp/mesos/store/appc" --authenticate_http_executors="true" --authenticate_http_readonly="true"
--authenticate_http_readwrite="true" --authenticatee="crammd5" --authentication_backoff_factor="1secs"
--authorizer="local" --cgroups_cpu_enable_pids_and_tids_count="false" --cgroups_enable_cfs="false"
--cgroups_hierarchy="/sys/fs/cgroup" --cgroups_limit_swap="false" --cgroups_root="mesos" --container_disk_watch_interval="15secs"
--containerizers="mesos" --credential="/tmp/Endpoint_SlaveEndpointTest_UnauthorizedRequest_2_Xro6VW/credential"
--default_role="*" --disk_watch_interval="1mins" --docker="docker" --docker_kill_orphans="true"
--docker_registry="https://registry-1.docker.io" --docker_remove_delay="6hrs" --docker_socket="/var/run/docker.sock"
--docker_stop_timeout="0ns" --docker_store_dir="/tmp/mesos/store/docker" --docker_volume_checkpoint_dir="/var/run/mesos/isolators/docker/volume"
--enforce_container_disk_quota="false" --executor_registration_timeout="1mins" --executor_secret_key="secret_key"
--executor_shutdown_grace_period="5secs" --fetcher_cache_dir="/tmp/Endpoint_SlaveEndpointTest_UnauthorizedRequest_2_Xro6VW/fetch"
--fetcher_cache_size="2GB" --frameworks_home="" --gc_delay="1weeks" --gc_disk_headroom="0.1"
--hadoop_home="" --help="false" --hostname_lookup="true" --http_command_executor="false" --http_credentials="/tmp/Endpoint_SlaveEndpointTest_UnauthorizedRequest_2_Xro6VW/http_credentials"
--http_heartbeat_interval="30secs" --initialize_driver_logging="true" --isolation="posix/cpu,posix/mem"
--launcher="posix" --launcher_dir="/mesos/mesos-1.3.0/_build/src" --logbufsecs="0" --logging_level="INFO"
--max_completed_executors_per_framework="150" --oversubscribed_resources_interval="15secs"
--perf_duration="10secs" --perf_interval="1mins" --qos_correction_interval_min="0ns" --quiet="false"
--recover="reconnect" --recovery_timeout="15mins" --registration_backoff_factor="10ms" --resources="cpus:2;gpus:0;mem:1024;disk:1024;ports:[31000-32000]"
--revocable_cpu_low_priority="true" --runtime_dir="/tmp/Endpoint_SlaveEndpointTest_UnauthorizedRequest_2_Xro6VW"
--sandbox_directory="/mnt/mesos/sandbox" --strict="true" --switch_user="true" --systemd_enable_support="true"
--systemd_runtime_directory="/run/systemd/system" --version="false" --work_dir="/tmp/Endpoint_SlaveEndpointTest_UnauthorizedRequest_2_pMwHrN"
I0329 23:26:01.868612 16789 credentials.hpp:86] Loading credential for authentication from
'/tmp/Endpoint_SlaveEndpointTest_UnauthorizedRequest_2_Xro6VW/credential'
I0329 23:26:01.868768 16789 slave.cpp:259] Agent using credential for: test-principal
I0329 23:26:01.868793 16789 credentials.hpp:37] Loading credentials for authentication from
'/tmp/Endpoint_SlaveEndpointTest_UnauthorizedRequest_2_Xro6VW/http_credentials'
I0329 23:26:01.869057 16789 http.cpp:975] Creating default 'basic' HTTP authenticator for
realm 'mesos-agent-executor'
I0329 23:26:01.869184 16789 http.cpp:996] Creating default 'jwt' HTTP authenticator for realm
'mesos-agent-executor'
I0329 23:26:01.869415 16789 http.cpp:975] Creating default 'basic' HTTP authenticator for
realm 'mesos-agent-readonly'
I0329 23:26:01.869557 16789 http.cpp:996] Creating default 'jwt' HTTP authenticator for realm
'mesos-agent-readonly'
I0329 23:26:01.869887 16789 http.cpp:975] Creating default 'basic' HTTP authenticator for
realm 'mesos-agent-readwrite'
I0329 23:26:01.870036 16789 http.cpp:996] Creating default 'jwt' HTTP authenticator for realm
'mesos-agent-readwrite'
I0329 23:26:01.871418 16789 slave.cpp:492] Agent resources: cpus(*):2; mem(*):1024; disk(*):1024;
ports(*):[31000-32000]
I0329 23:26:01.871505 16789 slave.cpp:500] Agent attributes: [  ]
I0329 23:26:01.871518 16789 slave.cpp:505] Agent hostname: 5a2f59a29eef
I0329 23:26:01.871687 16796 status_update_manager.cpp:177] Pausing sending status updates
I0329 23:26:01.872982 16791 state.cpp:62] Recovering state from '/tmp/Endpoint_SlaveEndpointTest_UnauthorizedRequest_2_pMwHrN/meta'
I0329 23:26:01.873456 16792 status_update_manager.cpp:203] Recovering status update manager
I0329 23:26:01.873637 16803 containerizer.cpp:608] Recovering containerizer
I0329 23:26:01.875037 16800 provisioner.cpp:410] Provisioner recovery complete
I0329 23:26:01.875407 16790 slave.cpp:5927] Finished recovery
I0329 23:26:01.875957 16790 slave.cpp:6109] Querying resource estimator for oversubscribable
resources
I0329 23:26:01.876248 16790 slave.cpp:6123] Received oversubscribable resources {} from the
resource estimator
I0329 23:26:01.878685 16797 process.cpp:3705] Handling HTTP event for process 'slave(727)'
with path: '/slave(727)/containers'
I0329 23:26:01.880698 16798 http.cpp:936] Authorizing principal 'test-principal' to GET the
'/containers' endpoint
I0329 23:26:01.883047 16792 slave.cpp:754] Agent terminating
[       OK ] Endpoint/SlaveEndpointTest.UnauthorizedRequest/2 (30 ms)
[ RUN      ] Endpoint/SlaveEndpointTest.NoAuthorizer/0
I0329 23:26:01.893072 32758 containerizer.cpp:221] Using isolation: posix/cpu,posix/mem,filesystem/posix,network/cni
W0329 23:26:01.893540 32758 backend.cpp:76] Failed to create 'aufs' backend: AufsBackend requires
root privileges
W0329 23:26:01.893635 32758 backend.cpp:76] Failed to create 'bind' backend: BindBackend requires
root privileges
I0329 23:26:01.893672 32758 provisioner.cpp:249] Using default backend 'copy'
I0329 23:26:01.895397 32758 cluster.cpp:446] Creating default 'local' authorizer
I0329 23:26:01.897158 16796 slave.cpp:226] Mesos agent started on (728)@172.17.0.2:33829
I0329 23:26:01.897179 16796 slave.cpp:227] Flags at startup: --acls="" --appc_simple_discovery_uri_prefix="http://"
--appc_store_dir="/tmp/mesos/store/appc" --authenticate_http_executors="true" --authenticate_http_readonly="true"
--authenticate_http_readwrite="true" --authenticatee="crammd5" --authentication_backoff_factor="1secs"
--authorizer="local" --cgroups_cpu_enable_pids_and_tids_count="false" --cgroups_enable_cfs="false"
--cgroups_hierarchy="/sys/fs/cgroup" --cgroups_limit_swap="false" --cgroups_root="mesos" --container_disk_watch_interval="15secs"
--containerizers="mesos" --credential="/tmp/Endpoint_SlaveEndpointTest_NoAuthorizer_0_9VL39y/credential"
--default_role="*" --disk_watch_interval="1mins" --docker="docker" --docker_kill_orphans="true"
--docker_registry="https://registry-1.docker.io" --docker_remove_delay="6hrs" --docker_socket="/var/run/docker.sock"
--docker_stop_timeout="0ns" --docker_store_dir="/tmp/mesos/store/docker" --docker_volume_checkpoint_dir="/var/run/mesos/isolators/docker/volume"
--enforce_container_disk_quota="false" --executor_registration_timeout="1mins" --executor_secret_key="secret_key"
--executor_shutdown_grace_period="5secs" --fetcher_cache_dir="/tmp/Endpoint_SlaveEndpointTest_NoAuthorizer_0_9VL39y/fetch"
--fetcher_cache_size="2GB" --frameworks_home="" --gc_delay="1weeks" --gc_disk_headroom="0.1"
--hadoop_home="" --help="false" --hostname_lookup="true" --http_command_executor="false" --http_credentials="/tmp/Endpoint_SlaveEndpointTest_NoAuthorizer_0_9VL39y/http_credentials"
--http_heartbeat_interval="30secs" --initialize_driver_logging="true" --isolation="posix/cpu,posix/mem"
--launcher="posix" --launcher_dir="/mesos/mesos-1.3.0/_build/src" --logbufsecs="0" --logging_level="INFO"
--max_completed_executors_per_framework="150" --oversubscribed_resources_interval="15secs"
--perf_duration="10secs" --perf_interval="1mins" --qos_correction_interval_min="0ns" --quiet="false"
--recover="reconnect" --recovery_timeout="15mins" --registration_backoff_factor="10ms" --resources="cpus:2;gpus:0;mem:1024;disk:1024;ports:[31000-32000]"
--revocable_cpu_low_priority="true" --runtime_dir="/tmp/Endpoint_SlaveEndpointTest_NoAuthorizer_0_9VL39y"
--sandbox_directory="/mnt/mesos/sandbox" --strict="true" --switch_user="true" --systemd_enable_support="true"
--systemd_runtime_directory="/run/systemd/system" --version="false" --work_dir="/tmp/Endpoint_SlaveEndpointTest_NoAuthorizer_0_1A2SAp"
I0329 23:26:01.897698 16796 credentials.hpp:86] Loading credential for authentication from
'/tmp/Endpoint_SlaveEndpointTest_NoAuthorizer_0_9VL39y/credential'
I0329 23:26:01.897928 16796 slave.cpp:259] Agent using credential for: test-principal
I0329 23:26:01.897949 16796 credentials.hpp:37] Loading credentials for authentication from
'/tmp/Endpoint_SlaveEndpointTest_NoAuthorizer_0_9VL39y/http_credentials'
I0329 23:26:01.898186 16796 http.cpp:975] Creating default 'basic' HTTP authenticator for
realm 'mesos-agent-executor'
I0329 23:26:01.898316 16796 http.cpp:996] Creating default 'jwt' HTTP authenticator for realm
'mesos-agent-executor'
I0329 23:26:01.898567 16796 http.cpp:975] Creating default 'basic' HTTP authenticator for
realm 'mesos-agent-readonly'
I0329 23:26:01.898742 16796 http.cpp:996] Creating default 'jwt' HTTP authenticator for realm
'mesos-agent-readonly'
I0329 23:26:01.899039 16796 http.cpp:975] Creating default 'basic' HTTP authenticator for
realm 'mesos-agent-readwrite'
I0329 23:26:01.899153 16796 http.cpp:996] Creating default 'jwt' HTTP authenticator for realm
'mesos-agent-readwrite'
I0329 23:26:01.900630 16796 slave.cpp:492] Agent resources: cpus(*):2; mem(*):1024; disk(*):1024;
ports(*):[31000-32000]
I0329 23:26:01.900712 16796 slave.cpp:500] Agent attributes: [  ]
I0329 23:26:01.900734 16796 slave.cpp:505] Agent hostname: 5a2f59a29eef
I0329 23:26:01.900902 16797 status_update_manager.cpp:177] Pausing sending status updates
I0329 23:26:01.902348 16798 state.cpp:62] Recovering state from '/tmp/Endpoint_SlaveEndpointTest_NoAuthorizer_0_1A2SAp/meta'
I0329 23:26:01.902812 16793 status_update_manager.cpp:203] Recovering status update manager
I0329 23:26:01.903059 16802 containerizer.cpp:608] Recovering containerizer
I0329 23:26:01.904726 16797 provisioner.cpp:410] Provisioner recovery complete
I0329 23:26:01.905159 16793 slave.cpp:5927] Finished recovery
I0329 23:26:01.905655 16793 slave.cpp:6109] Querying resource estimator for oversubscribable
resources
I0329 23:26:01.905966 16794 slave.cpp:6123] Received oversubscribable resources {} from the
resource estimator
I0329 23:26:01.908399 16802 process.cpp:3705] Handling HTTP event for process 'slave(728)'
with path: '/slave(728)/monitor/statistics'
I0329 23:26:01.910380 16791 http.cpp:936] Authorizing principal 'test-principal' to GET the
'/monitor/statistics' endpoint
I0329 23:26:01.914089 16802 slave.cpp:754] Agent terminating
[       OK ] Endpoint/SlaveEndpointTest.NoAuthorizer/0 (32 ms)
[ RUN      ] Endpoint/SlaveEndpointTest.NoAuthorizer/1
I0329 23:26:01.926126 32758 containerizer.cpp:221] Using isolation: posix/cpu,posix/mem,filesystem/posix,network/cni
W0329 23:26:01.926570 32758 backend.cpp:76] Failed to create 'aufs' backend: AufsBackend requires
root privileges
W0329 23:26:01.926667 32758 backend.cpp:76] Failed to create 'bind' backend: BindBackend requires
root privileges
I0329 23:26:01.926704 32758 provisioner.cpp:249] Using default backend 'copy'
I0329 23:26:01.928002 32758 cluster.cpp:446] Creating default 'local' authorizer
I0329 23:26:01.929600 16801 slave.cpp:226] Mesos agent started on (729)@172.17.0.2:33829
I0329 23:26:01.929641 16801 slave.cpp:227] Flags at startup: --acls="" --appc_simple_discovery_uri_prefix="http://"
--appc_store_dir="/tmp/mesos/store/appc" --authenticate_http_executors="true" --authenticate_http_readonly="true"
--authenticate_http_readwrite="true" --authenticatee="crammd5" --authentication_backoff_factor="1secs"
--authorizer="local" --cgroups_cpu_enable_pids_and_tids_count="false" --cgroups_enable_cfs="false"
--cgroups_hierarchy="/sys/fs/cgroup" --cgroups_limit_swap="false" --cgroups_root="mesos" --container_disk_watch_interval="15secs"
--containerizers="mesos" --credential="/tmp/Endpoint_SlaveEndpointTest_NoAuthorizer_1_nuPvIb/credential"
--default_role="*" --disk_watch_interval="1mins" --docker="docker" --docker_kill_orphans="true"
--docker_registry="https://registry-1.docker.io" --docker_remove_delay="6hrs" --docker_socket="/var/run/docker.sock"
--docker_stop_timeout="0ns" --docker_store_dir="/tmp/mesos/store/docker" --docker_volume_checkpoint_dir="/var/run/mesos/isolators/docker/volume"
--enforce_container_disk_quota="false" --executor_registration_timeout="1mins" --executor_secret_key="secret_key"
--executor_shutdown_grace_period="5secs" --fetcher_cache_dir="/tmp/Endpoint_SlaveEndpointTest_NoAuthorizer_1_nuPvIb/fetch"
--fetcher_cache_size="2GB" --frameworks_home="" --gc_delay="1weeks" --gc_disk_headroom="0.1"
--hadoop_home="" --help="false" --hostname_lookup="true" --http_command_executor="false" --http_credentials="/tmp/Endpoint_SlaveEndpointTest_NoAuthorizer_1_nuPvIb/http_credentials"
--http_heartbeat_interval="30secs" --initialize_driver_logging="true" --isolation="posix/cpu,posix/mem"
--launcher="posix" --launcher_dir="/mesos/mesos-1.3.0/_build/src" --logbufsecs="0" --logging_level="INFO"
--max_completed_executors_per_framework="150" --oversubscribed_resources_interval="15secs"
--perf_duration="10secs" --perf_interval="1mins" --qos_correction_interval_min="0ns" --quiet="false"
--recover="reconnect" --recovery_timeout="15mins" --registration_backoff_factor="10ms" --resources="cpus:2;gpus:0;mem:1024;disk:1024;ports:[31000-32000]"
--revocable_cpu_low_priority="true" --runtime_dir="/tmp/Endpoint_SlaveEndpointTest_NoAuthorizer_1_nuPvIb"
--sandbox_directory="/mnt/mesos/sandbox" --strict="true" --switch_user="true" --systemd_enable_support="true"
--systemd_runtime_directory="/run/systemd/system" --version="false" --work_dir="/tmp/Endpoint_SlaveEndpointTest_NoAuthorizer_1_LcF531"
I0329 23:26:01.930239 16801 credentials.hpp:86] Loading credential for authentication from
'/tmp/Endpoint_SlaveEndpointTest_NoAuthorizer_1_nuPvIb/credential'
I0329 23:26:01.930362 16801 slave.cpp:259] Agent using credential for: test-principal
I0329 23:26:01.930383 16801 credentials.hpp:37] Loading credentials for authentication from
'/tmp/Endpoint_SlaveEndpointTest_NoAuthorizer_1_nuPvIb/http_credentials'
I0329 23:26:01.930634 16801 http.cpp:975] Creating default 'basic' HTTP authenticator for
realm 'mesos-agent-executor'
I0329 23:26:01.930738 16801 http.cpp:996] Creating default 'jwt' HTTP authenticator for realm
'mesos-agent-executor'
I0329 23:26:01.931095 16801 http.cpp:975] Creating default 'basic' HTTP authenticator for
realm 'mesos-agent-readonly'
I0329 23:26:01.931251 16801 http.cpp:996] Creating default 'jwt' HTTP authenticator for realm
'mesos-agent-readonly'
I0329 23:26:01.931474 16801 http.cpp:975] Creating default 'basic' HTTP authenticator for
realm 'mesos-agent-readwrite'
I0329 23:26:01.931605 16801 http.cpp:996] Creating default 'jwt' HTTP authenticator for realm
'mesos-agent-readwrite'
I0329 23:26:01.932937 16801 slave.cpp:492] Agent resources: cpus(*):2; mem(*):1024; disk(*):1024;
ports(*):[31000-32000]
I0329 23:26:01.933027 16801 slave.cpp:500] Agent attributes: [  ]
I0329 23:26:01.933048 16801 slave.cpp:505] Agent hostname: 5a2f59a29eef
I0329 23:26:01.933259 16796 status_update_manager.cpp:177] Pausing sending status updates
I0329 23:26:01.934554 16788 state.cpp:62] Recovering state from '/tmp/Endpoint_SlaveEndpointTest_NoAuthorizer_1_LcF531/meta'
I0329 23:26:01.934911 16793 status_update_manager.cpp:203] Recovering status update manager
I0329 23:26:01.935098 16796 containerizer.cpp:608] Recovering containerizer
I0329 23:26:01.936470 16793 provisioner.cpp:410] Provisioner recovery complete
I0329 23:26:01.936777 16800 slave.cpp:5927] Finished recovery
I0329 23:26:01.937386 16800 slave.cpp:6109] Querying resource estimator for oversubscribable
resources
I0329 23:26:01.937862 16803 slave.cpp:6123] Received oversubscribable resources {} from the
resource estimator
I0329 23:26:01.940518 16793 process.cpp:3705] Handling HTTP event for process 'slave(729)'
with path: '/slave(729)/monitor/statistics.json'
I0329 23:26:01.942339 16792 http.cpp:936] Authorizing principal 'test-principal' to GET the
'/monitor/statistics.json' endpoint
I0329 23:26:01.946188 16798 slave.cpp:754] Agent terminating
[       OK ] Endpoint/SlaveEndpointTest.NoAuthorizer/1 (31 ms)
[ RUN      ] Endpoint/SlaveEndpointTest.NoAuthorizer/2
I0329 23:26:01.956194 32758 containerizer.cpp:221] Using isolation: posix/cpu,posix/mem,filesystem/posix,network/cni
W0329 23:26:01.956639 32758 backend.cpp:76] Failed to create 'aufs' backend: AufsBackend requires
root privileges
W0329 23:26:01.956734 32758 backend.cpp:76] Failed to create 'bind' backend: BindBackend requires
root privileges
I0329 23:26:01.956790 32758 provisioner.cpp:249] Using default backend 'copy'
I0329 23:26:01.958150 32758 cluster.cpp:446] Creating default 'local' authorizer
I0329 23:26:01.959648 16796 slave.cpp:226] Mesos agent started on (730)@172.17.0.2:33829
I0329 23:26:01.959673 16796 slave.cpp:227] Flags at startup: --acls="" --appc_simple_discovery_uri_prefix="http://"
--appc_store_dir="/tmp/mesos/store/appc" --authenticate_http_executors="true" --authenticate_http_readonly="true"
--authenticate_http_readwrite="true" --authenticatee="crammd5" --authentication_backoff_factor="1secs"
--authorizer="local" --cgroups_cpu_enable_pids_and_tids_count="false" --cgroups_enable_cfs="false"
--cgroups_hierarchy="/sys/fs/cgroup" --cgroups_limit_swap="false" --cgroups_root="mesos" --container_disk_watch_interval="15secs"
--containerizers="mesos" --credential="/tmp/Endpoint_SlaveEndpointTest_NoAuthorizer_2_9hweBO/credential"
--default_role="*" --disk_watch_interval="1mins" --docker="docker" --docker_kill_orphans="true"
--docker_registry="https://registry-1.docker.io" --docker_remove_delay="6hrs" --docker_socket="/var/run/docker.sock"
--docker_stop_timeout="0ns" --docker_store_dir="/tmp/mesos/store/docker" --docker_volume_checkpoint_dir="/var/run/mesos/isolators/docker/volume"
--enforce_container_disk_quota="false" --executor_registration_timeout="1mins" --executor_secret_key="secret_key"
--executor_shutdown_grace_period="5secs" --fetcher_cache_dir="/tmp/Endpoint_SlaveEndpointTest_NoAuthorizer_2_9hweBO/fetch"
--fetcher_cache_size="2GB" --frameworks_home="" --gc_delay="1weeks" --gc_disk_headroom="0.1"
--hadoop_home="" --help="false" --hostname_lookup="true" --http_command_executor="false" --http_credentials="/tmp/Endpoint_SlaveEndpointTest_NoAuthorizer_2_9hweBO/http_credentials"
--http_heartbeat_interval="30secs" --initialize_driver_logging="true" --isolation="posix/cpu,posix/mem"
--launcher="posix" --launcher_dir="/mesos/mesos-1.3.0/_build/src" --logbufsecs="0" --logging_level="INFO"
--max_completed_executors_per_framework="150" --oversubscribed_resources_interval="15secs"
--perf_duration="10secs" --perf_interval="1mins" --qos_correction_interval_min="0ns" --quiet="false"
--recover="reconnect" --recovery_timeout="15mins" --registration_backoff_factor="10ms" --resources="cpus:2;gpus:0;mem:1024;disk:1024;ports:[31000-32000]"
--revocable_cpu_low_priority="true" --runtime_dir="/tmp/Endpoint_SlaveEndpointTest_NoAuthorizer_2_9hweBO"
--sandbox_directory="/mnt/mesos/sandbox" --strict="true" --switch_user="true" --systemd_enable_support="true"
--systemd_runtime_directory="/run/systemd/system" --version="false" --work_dir="/tmp/Endpoint_SlaveEndpointTest_NoAuthorizer_2_BH9MRE"
I0329 23:26:01.960183 16796 credentials.hpp:86] Loading credential for authentication from
'/tmp/Endpoint_SlaveEndpointTest_NoAuthorizer_2_9hweBO/credential'
I0329 23:26:01.960309 16796 slave.cpp:259] Agent using credential for: test-principal
I0329 23:26:01.960330 16796 credentials.hpp:37] Loading credentials for authentication from
'/tmp/Endpoint_SlaveEndpointTest_NoAuthorizer_2_9hweBO/http_credentials'
I0329 23:26:01.960552 16796 http.cpp:975] Creating default 'basic' HTTP authenticator for
realm 'mesos-agent-executor'
I0329 23:26:01.960652 16796 http.cpp:996] Creating default 'jwt' HTTP authenticator for realm
'mesos-agent-executor'
I0329 23:26:01.960934 16796 http.cpp:975] Creating default 'basic' HTTP authenticator for
realm 'mesos-agent-readonly'
I0329 23:26:01.961045 16796 http.cpp:996] Creating default 'jwt' HTTP authenticator for realm
'mesos-agent-readonly'
I0329 23:26:01.961350 16796 http.cpp:975] Creating default 'basic' HTTP authenticator for
realm 'mesos-agent-readwrite'
I0329 23:26:01.961474 16796 http.cpp:996] Creating default 'jwt' HTTP authenticator for realm
'mesos-agent-readwrite'
I0329 23:26:01.962920 16796 slave.cpp:492] Agent resources: cpus(*):2; mem(*):1024; disk(*):1024;
ports(*):[31000-32000]
I0329 23:26:01.963027 16796 slave.cpp:500] Agent attributes: [  ]
I0329 23:26:01.963044 16796 slave.cpp:505] Agent hostname: 5a2f59a29eef
I0329 23:26:01.963219 16803 status_update_manager.cpp:177] Pausing sending status updates
I0329 23:26:01.964398 16794 state.cpp:62] Recovering state from '/tmp/Endpoint_SlaveEndpointTest_NoAuthorizer_2_BH9MRE/meta'
I0329 23:26:01.964680 16792 status_update_manager.cpp:203] Recovering status update manager
I0329 23:26:01.964943 16802 containerizer.cpp:608] Recovering containerizer
I0329 23:26:01.966172 16790 provisioner.cpp:410] Provisioner recovery complete
I0329 23:26:01.966547 16799 slave.cpp:5927] Finished recovery
I0329 23:26:01.967036 16799 slave.cpp:6109] Querying resource estimator for oversubscribable
resources
I0329 23:26:01.967280 16798 slave.cpp:6123] Received oversubscribable resources {} from the
resource estimator
I0329 23:26:01.969909 16790 process.cpp:3705] Handling HTTP event for process 'slave(730)'
with path: '/slave(730)/containers'
I0329 23:26:01.971916 16796 http.cpp:936] Authorizing principal 'test-principal' to GET the
'/containers' endpoint
I0329 23:26:01.976335 16803 slave.cpp:754] Agent terminating
[       OK ] Endpoint/SlaveEndpointTest.NoAuthorizer/2 (29 ms)
[----------] 9 tests from Endpoint/SlaveEndpointTest (280 ms total)

[----------] Global test environment tear-down
[==========] 1538 tests from 174 test cases ran. (474884 ms total)
[  PASSED  ] 1537 tests.
[  FAILED  ] 1 test, listed below:
[  FAILED  ] DiskQuotaTest.SlaveRecovery

 1 FAILED TEST
  YOU HAVE 12 DISABLED TESTS

make[4]: *** [check-local] Error 1
make[4]: Leaving directory `/mesos/mesos-1.3.0/_build/src'
make[3]: *** [check-am] Error 2
make[3]: Leaving directory `/mesos/mesos-1.3.0/_build/src'
make[2]: *** [check] Error 2
make[2]: Leaving directory `/mesos/mesos-1.3.0/_build/src'
make[1]: *** [check-recursive] Error 1
make[1]: Leaving directory `/mesos/mesos-1.3.0/_build'
make: *** [distcheck] Error 1
+ docker rmi mesos-1490826944-32307
Untagged: mesos-1490826944-32307:latest
Deleted: sha256:fd27b65ce1702d6d32f26b6d4ad451b06baa7600f5f32c2b3f1d2584a11b0df3
Deleted: sha256:2694fa3bc085ca92f7db1a76b3edfd53078a51eed41d6c0b38542ccb9cec20e8
Deleted: sha256:a330f09f74d233b9da391b41cda3f51264b999d814e937ee5b20d2fa0943fda5
Deleted: sha256:166f038e44f144724f606545bfcb523ebe78fa97f738e1d6744a7e56755650de
Deleted: sha256:e7f415279f8da6d1a0e38ee02b8c2d15a170be3d7bb77136bcf130f60066c6c6
Deleted: sha256:16ee1b7d245ce6c7b99d6b3b870f9f1093f9ed22c55d4d8e5355b0ed61f41eac
Deleted: sha256:dda5794d7c86e803fdf2d325820bf75a246b67d984ed4d1d4a719284682443af
Deleted: sha256:f3fefc32a9b9f331368f960b7eadcc366d3acf3ea0fa47a468a1c9aeac812324
Deleted: sha256:1dd64acacb95aa3ebaa434bd0f4ffc30e4eb72c9a8411545016be858759b185f
Deleted: sha256:985516e7bbeef1f8a3f6d5948e0bcbf4e2b29880e730ee0ba58d51a616ed9120
Deleted: sha256:33310dee4f8d8234c742734039a01b547440700be5ae43f33ade008895f99d21
Deleted: sha256:1d531d5d7d553ada989bb4dc3ac621a53c960b8f11c74aa1a4f75f75edb7123d
Deleted: sha256:0200eb76e08c349f03b91d1df09c0e724c8e31c6a9d861d3cbe64535ad36b114
Deleted: sha256:2ef14e3216c0e4cf283afa7e409344dbf5e0a1adcd96794d7f25b99665ee16c9
Deleted: sha256:82e37f294053b6fb64416f3f82c78a0ec05c1d951136fb82d443b9b819bd34d5
Deleted: sha256:efdb3b2363ba62f94e3de159d5aa144ef8f87f9bdaff2424aad21db4eb084da9
Deleted: sha256:dccb0faf3d0ec58cd4b98b70eaea449c780f91c5f95024d4dc46351840443e8d
Deleted: sha256:0bfdcf19aea4003b36ab70105fdd6c8ac5d887ad6f0c467e7ef8ac16e244c367
Deleted: sha256:17a331d9a36231abe2eab249f6ab914ab97893dc46f7689272182fbaa439e803
Deleted: sha256:2a1c0d26cd15c338cc00594ef6bda93cad91961b3bf0f5d700668dea0f7342aa
Deleted: sha256:7de6056601e42cff71e573e666b245e32ca72f556901a56210f6dadce6b55ba1
Deleted: sha256:7d18fafcb604a971d18cbc596aae16b4ad1895525b6db63a89b21a8ec26279f6
Deleted: sha256:a47fd91b0414e28ce88e5407a971b08122d24985f5075aab14c44864a2720e3c
Deleted: sha256:7a9689bff82a6281cd39171fdd45be0ea9c0c340f67874ddb7b6d1eb510294d8
Build step 'Execute shell' marked build as failure

Mime
View raw message