mesos-builds mailing list archives

Site index · List index
Message view « Date » · « Thread »
Top « Date » · « Thread »
From Apache Jenkins Server <jenk...@builds.apache.org>
Subject Build failed in Jenkins: Mesos-Buildbot » autotools,clang,--verbose --enable-libevent --enable-ssl,GLOG_v=1 MESOS_VERBOSE=1,ubuntu:14.04,(docker||Hadoop)&&(!ubuntu-us1)&&(!ubuntu-eu2) #3403
Date Thu, 23 Mar 2017 19:20:43 GMT
See <https://builds.apache.org/job/Mesos-Buildbot/BUILDTOOL=autotools,COMPILER=clang,CONFIGURATION=--verbose%20--enable-libevent%20--enable-ssl,ENVIRONMENT=GLOG_v=1%20MESOS_VERBOSE=1,OS=ubuntu%3A14.04,label_exp=(docker%7C%7CHadoop)&&(!ubuntu-us1)&&(!ubuntu-eu2)/3403/display/redirect?page=changes>

Changes:

[mpark] Fixed `post-reviews.py` to work on Windows.

------------------------------------------
[...truncated 2.60 MB...]
[       OK ] Scheme/HTTPTest.PathParse/1 (41 ms)
[ RUN      ] Scheme/HTTPTest.Get/0
I0323 19:20:26.803338 26257 openssl.cpp:419] CA file path is unspecified! NOTE: Set CA file
path with LIBPROCESS_SSL_CA_FILE=<filepath>
I0323 19:20:26.803364 26257 openssl.cpp:424] CA directory path unspecified! NOTE: Set CA directory
path with LIBPROCESS_SSL_CA_DIR=<dirpath>
I0323 19:20:26.803369 26257 openssl.cpp:429] Will not verify peer certificate!
NOTE: Set LIBPROCESS_SSL_VERIFY_CERT=1 to enable peer certificate verification
I0323 19:20:26.803372 26257 openssl.cpp:435] Will only verify peer certificate if presented!
NOTE: Set LIBPROCESS_SSL_REQUIRE_CERT=1 to require peer certificate verification
I0323 19:20:26.809943 26257 process.cpp:1247] libprocess is initialized on 172.17.0.2:53124
with 16 worker threads
I0323 19:20:26.815322 27288 process.cpp:3705] Handling HTTP event for process '(83)' with
path: '/(83)/get'
I0323 19:20:26.820744 27289 process.cpp:3705] Handling HTTP event for process '(83)' with
path: '/(83)/get'
[       OK ] Scheme/HTTPTest.Get/0 (364 ms)
[ RUN      ] Scheme/HTTPTest.Get/1
I0323 19:20:26.825366 26257 process.cpp:1247] libprocess is initialized on 172.17.0.2:54439
with 16 worker threads
I0323 19:20:26.826333 27312 process.cpp:3705] Handling HTTP event for process '(84)' with
path: '/(84)/get'
I0323 19:20:26.828156 27307 process.cpp:3705] Handling HTTP event for process '(84)' with
path: '/(84)/get'
[       OK ] Scheme/HTTPTest.Get/1 (7 ms)
[ RUN      ] Scheme/HTTPTest.NestedGet/0
I0323 19:20:27.054296 26257 openssl.cpp:419] CA file path is unspecified! NOTE: Set CA file
path with LIBPROCESS_SSL_CA_FILE=<filepath>
I0323 19:20:27.054321 26257 openssl.cpp:424] CA directory path unspecified! NOTE: Set CA directory
path with LIBPROCESS_SSL_CA_DIR=<dirpath>
I0323 19:20:27.054328 26257 openssl.cpp:429] Will not verify peer certificate!
NOTE: Set LIBPROCESS_SSL_VERIFY_CERT=1 to enable peer certificate verification
I0323 19:20:27.054332 26257 openssl.cpp:435] Will only verify peer certificate if presented!
NOTE: Set LIBPROCESS_SSL_REQUIRE_CERT=1 to require peer certificate verification
I0323 19:20:27.061301 26257 process.cpp:1247] libprocess is initialized on 172.17.0.2:50170
with 16 worker threads
I0323 19:20:27.066452 27332 process.cpp:3705] Handling HTTP event for process '(85)' with
path: '/(85)//a/b/c'
I0323 19:20:27.071630 27324 process.cpp:3705] Handling HTTP event for process '(85)' with
path: '/(85)//a/b'
[       OK ] Scheme/HTTPTest.NestedGet/0 (244 ms)
[ RUN      ] Scheme/HTTPTest.NestedGet/1
I0323 19:20:27.077908 26257 process.cpp:1247] libprocess is initialized on 172.17.0.2:49208
with 16 worker threads
I0323 19:20:27.078850 27346 process.cpp:3705] Handling HTTP event for process '(86)' with
path: '/(86)//a/b/c'
I0323 19:20:27.080564 27343 process.cpp:3705] Handling HTTP event for process '(86)' with
path: '/(86)//a/b'
[       OK ] Scheme/HTTPTest.NestedGet/1 (8 ms)
[ RUN      ] Scheme/HTTPTest.StreamingGetComplete/0
I0323 19:20:27.212077 26257 openssl.cpp:419] CA file path is unspecified! NOTE: Set CA file
path with LIBPROCESS_SSL_CA_FILE=<filepath>
I0323 19:20:27.212101 26257 openssl.cpp:424] CA directory path unspecified! NOTE: Set CA directory
path with LIBPROCESS_SSL_CA_DIR=<dirpath>
I0323 19:20:27.212106 26257 openssl.cpp:429] Will not verify peer certificate!
NOTE: Set LIBPROCESS_SSL_VERIFY_CERT=1 to enable peer certificate verification
I0323 19:20:27.212110 26257 openssl.cpp:435] Will only verify peer certificate if presented!
NOTE: Set LIBPROCESS_SSL_REQUIRE_CERT=1 to require peer certificate verification
I0323 19:20:27.221295 26257 process.cpp:1247] libprocess is initialized on 172.17.0.2:57988
with 16 worker threads
I0323 19:20:27.226491 27359 process.cpp:3705] Handling HTTP event for process '(87)' with
path: '/(87)/pipe'
[       OK ] Scheme/HTTPTest.StreamingGetComplete/0 (185 ms)
[ RUN      ] Scheme/HTTPTest.StreamingGetComplete/1
I0323 19:20:27.277631 26257 process.cpp:1247] libprocess is initialized on 172.17.0.2:59088
with 16 worker threads
I0323 19:20:27.278964 27377 process.cpp:3705] Handling HTTP event for process '(88)' with
path: '/(88)/pipe'
[       OK ] Scheme/HTTPTest.StreamingGetComplete/1 (15 ms)
[ RUN      ] Scheme/HTTPTest.StreamingGetFailure/0
I0323 19:20:27.630712 26257 openssl.cpp:419] CA file path is unspecified! NOTE: Set CA file
path with LIBPROCESS_SSL_CA_FILE=<filepath>
I0323 19:20:27.630738 26257 openssl.cpp:424] CA directory path unspecified! NOTE: Set CA directory
path with LIBPROCESS_SSL_CA_DIR=<dirpath>
I0323 19:20:27.630743 26257 openssl.cpp:429] Will not verify peer certificate!
NOTE: Set LIBPROCESS_SSL_VERIFY_CERT=1 to enable peer certificate verification
I0323 19:20:27.630746 26257 openssl.cpp:435] Will only verify peer certificate if presented!
NOTE: Set LIBPROCESS_SSL_REQUIRE_CERT=1 to require peer certificate verification
I0323 19:20:27.633080 26257 process.cpp:1247] libprocess is initialized on 172.17.0.2:34423
with 16 worker threads
I0323 19:20:27.638449 27394 process.cpp:3705] Handling HTTP event for process '(89)' with
path: '/(89)/pipe'
I0323 19:20:27.676874 27389 process.cpp:1605] Failed to read from stream: oops
[       OK ] Scheme/HTTPTest.StreamingGetFailure/0 (397 ms)
[ RUN      ] Scheme/HTTPTest.StreamingGetFailure/1
I0323 19:20:27.689302 26257 process.cpp:1247] libprocess is initialized on 172.17.0.2:54356
with 16 worker threads
I0323 19:20:27.690457 27408 process.cpp:3705] Handling HTTP event for process '(90)' with
path: '/(90)/pipe'
I0323 19:20:27.692369 27413 process.cpp:1605] Failed to read from stream: oops
[       OK ] Scheme/HTTPTest.StreamingGetFailure/1 (15 ms)
[ RUN      ] Scheme/HTTPTest.PipeEquality/0
I0323 19:20:28.248845 26257 openssl.cpp:419] CA file path is unspecified! NOTE: Set CA file
path with LIBPROCESS_SSL_CA_FILE=<filepath>
I0323 19:20:28.248873 26257 openssl.cpp:424] CA directory path unspecified! NOTE: Set CA directory
path with LIBPROCESS_SSL_CA_DIR=<dirpath>
I0323 19:20:28.248880 26257 openssl.cpp:429] Will not verify peer certificate!
NOTE: Set LIBPROCESS_SSL_VERIFY_CERT=1 to enable peer certificate verification
I0323 19:20:28.248885 26257 openssl.cpp:435] Will only verify peer certificate if presented!
NOTE: Set LIBPROCESS_SSL_REQUIRE_CERT=1 to require peer certificate verification
I0323 19:20:28.274127 26257 process.cpp:1247] libprocess is initialized on 172.17.0.2:38492
with 16 worker threads
[       OK ] Scheme/HTTPTest.PipeEquality/0 (581 ms)
[ RUN      ] Scheme/HTTPTest.PipeEquality/1
I0323 19:20:28.289645 26257 process.cpp:1247] libprocess is initialized on 172.17.0.2:45094
with 16 worker threads
[       OK ] Scheme/HTTPTest.PipeEquality/1 (16 ms)
[ RUN      ] Scheme/HTTPTest.Post/0
I0323 19:20:28.876188 26257 openssl.cpp:419] CA file path is unspecified! NOTE: Set CA file
path with LIBPROCESS_SSL_CA_FILE=<filepath>
I0323 19:20:28.876212 26257 openssl.cpp:424] CA directory path unspecified! NOTE: Set CA directory
path with LIBPROCESS_SSL_CA_DIR=<dirpath>
I0323 19:20:28.876217 26257 openssl.cpp:429] Will not verify peer certificate!
NOTE: Set LIBPROCESS_SSL_VERIFY_CERT=1 to enable peer certificate verification
I0323 19:20:28.876224 26257 openssl.cpp:435] Will only verify peer certificate if presented!
NOTE: Set LIBPROCESS_SSL_REQUIRE_CERT=1 to require peer certificate verification
I0323 19:20:28.878720 26257 process.cpp:1247] libprocess is initialized on 172.17.0.2:41635
with 16 worker threads
I0323 19:20:28.884263 27461 process.cpp:3705] Handling HTTP event for process '(91)' with
path: '/(91)/post'
I0323 19:20:28.926146 27470 process.cpp:3705] Handling HTTP event for process '(91)' with
path: '/(91)/post'
[       OK ] Scheme/HTTPTest.Post/0 (676 ms)
[ RUN      ] Scheme/HTTPTest.Post/1
I0323 19:20:28.969224 26257 process.cpp:1247] libprocess is initialized on 172.17.0.2:51635
with 16 worker threads
I0323 19:20:28.971119 27486 process.cpp:3705] Handling HTTP event for process '(92)' with
path: '/(92)/post'
I0323 19:20:28.973618 27484 process.cpp:3705] Handling HTTP event for process '(92)' with
path: '/(92)/post'
[       OK ] Scheme/HTTPTest.Post/1 (9 ms)
[ RUN      ] Scheme/HTTPTest.Delete/0
I0323 19:20:29.297089 26257 openssl.cpp:419] CA file path is unspecified! NOTE: Set CA file
path with LIBPROCESS_SSL_CA_FILE=<filepath>
I0323 19:20:29.297114 26257 openssl.cpp:424] CA directory path unspecified! NOTE: Set CA directory
path with LIBPROCESS_SSL_CA_DIR=<dirpath>
I0323 19:20:29.297121 26257 openssl.cpp:429] Will not verify peer certificate!
NOTE: Set LIBPROCESS_SSL_VERIFY_CERT=1 to enable peer certificate verification
I0323 19:20:29.297124 26257 openssl.cpp:435] Will only verify peer certificate if presented!
NOTE: Set LIBPROCESS_SSL_REQUIRE_CERT=1 to require peer certificate verification
I0323 19:20:29.302157 26257 process.cpp:1247] libprocess is initialized on 172.17.0.2:59003
with 16 worker threads
I0323 19:20:29.307570 27501 process.cpp:3705] Handling HTTP event for process '(93)' with
path: '/(93)/delete'
[       OK ] Scheme/HTTPTest.Delete/0 (334 ms)
[ RUN      ] Scheme/HTTPTest.Delete/1
I0323 19:20:29.333578 26257 process.cpp:1247] libprocess is initialized on 172.17.0.2:35293
with 16 worker threads
I0323 19:20:29.334692 27516 process.cpp:3705] Handling HTTP event for process '(94)' with
path: '/(94)/delete'
[       OK ] Scheme/HTTPTest.Delete/1 (27 ms)
[ RUN      ] Scheme/HTTPTest.Request/0
I0323 19:20:29.743079 26257 openssl.cpp:419] CA file path is unspecified! NOTE: Set CA file
path with LIBPROCESS_SSL_CA_FILE=<filepath>
I0323 19:20:29.743106 26257 openssl.cpp:424] CA directory path unspecified! NOTE: Set CA directory
path with LIBPROCESS_SSL_CA_DIR=<dirpath>
I0323 19:20:29.743111 26257 openssl.cpp:429] Will not verify peer certificate!
NOTE: Set LIBPROCESS_SSL_VERIFY_CERT=1 to enable peer certificate verification
I0323 19:20:29.743115 26257 openssl.cpp:435] Will only verify peer certificate if presented!
NOTE: Set LIBPROCESS_SSL_REQUIRE_CERT=1 to require peer certificate verification
I0323 19:20:29.749900 26257 process.cpp:1247] libprocess is initialized on 172.17.0.2:37590
with 16 worker threads
I0323 19:20:29.755118 27539 process.cpp:3705] Handling HTTP event for process '(95)' with
path: '/(95)/request'
[       OK ] Scheme/HTTPTest.Request/0 (420 ms)
[ RUN      ] Scheme/HTTPTest.Request/1
I0323 19:20:29.761545 26257 process.cpp:1247] libprocess is initialized on 172.17.0.2:38098
with 16 worker threads
I0323 19:20:29.762670 27555 process.cpp:3705] Handling HTTP event for process '(96)' with
path: '/(96)/request'
[       OK ] Scheme/HTTPTest.Request/1 (8 ms)
[ RUN      ] Scheme/HTTPTest.QueryEncodeDecode/0
I0323 19:20:30.027878 26257 openssl.cpp:419] CA file path is unspecified! NOTE: Set CA file
path with LIBPROCESS_SSL_CA_FILE=<filepath>
I0323 19:20:30.027902 26257 openssl.cpp:424] CA directory path unspecified! NOTE: Set CA directory
path with LIBPROCESS_SSL_CA_DIR=<dirpath>
I0323 19:20:30.027907 26257 openssl.cpp:429] Will not verify peer certificate!
NOTE: Set LIBPROCESS_SSL_VERIFY_CERT=1 to enable peer certificate verification
I0323 19:20:30.027911 26257 openssl.cpp:435] Will only verify peer certificate if presented!
NOTE: Set LIBPROCESS_SSL_REQUIRE_CERT=1 to require peer certificate verification
I0323 19:20:30.037513 26257 process.cpp:1247] libprocess is initialized on 172.17.0.2:51367
with 16 worker threads
[       OK ] Scheme/HTTPTest.QueryEncodeDecode/0 (274 ms)
[ RUN      ] Scheme/HTTPTest.QueryEncodeDecode/1
I0323 19:20:30.040359 26257 process.cpp:1247] libprocess is initialized on 172.17.0.2:48452
with 16 worker threads
[       OK ] Scheme/HTTPTest.QueryEncodeDecode/1 (2 ms)
[ RUN      ] Scheme/HTTPTest.Headers/0
I0323 19:20:30.321943 26257 openssl.cpp:419] CA file path is unspecified! NOTE: Set CA file
path with LIBPROCESS_SSL_CA_FILE=<filepath>
I0323 19:20:30.321969 26257 openssl.cpp:424] CA directory path unspecified! NOTE: Set CA directory
path with LIBPROCESS_SSL_CA_DIR=<dirpath>
I0323 19:20:30.321974 26257 openssl.cpp:429] Will not verify peer certificate!
NOTE: Set LIBPROCESS_SSL_VERIFY_CERT=1 to enable peer certificate verification
I0323 19:20:30.321979 26257 openssl.cpp:435] Will only verify peer certificate if presented!
NOTE: Set LIBPROCESS_SSL_REQUIRE_CERT=1 to require peer certificate verification
I0323 19:20:30.326225 26257 process.cpp:1247] libprocess is initialized on 172.17.0.2:44439
with 16 worker threads
[       OK ] Scheme/HTTPTest.Headers/0 (286 ms)
[ RUN      ] Scheme/HTTPTest.Headers/1
I0323 19:20:30.334986 26257 process.cpp:1247] libprocess is initialized on 172.17.0.2:44709
with 16 worker threads
[       OK ] Scheme/HTTPTest.Headers/1 (9 ms)
[ RUN      ] Scheme/HTTPTest.CaseInsensitiveHeaders/0
I0323 19:20:30.848115 26257 openssl.cpp:419] CA file path is unspecified! NOTE: Set CA file
path with LIBPROCESS_SSL_CA_FILE=<filepath>
I0323 19:20:30.848142 26257 openssl.cpp:424] CA directory path unspecified! NOTE: Set CA directory
path with LIBPROCESS_SSL_CA_DIR=<dirpath>
I0323 19:20:30.848150 26257 openssl.cpp:429] Will not verify peer certificate!
NOTE: Set LIBPROCESS_SSL_VERIFY_CERT=1 to enable peer certificate verification
I0323 19:20:30.848155 26257 openssl.cpp:435] Will only verify peer certificate if presented!
NOTE: Set LIBPROCESS_SSL_REQUIRE_CERT=1 to require peer certificate verification
I0323 19:20:30.853708 26257 process.cpp:1247] libprocess is initialized on 172.17.0.2:34940
with 16 worker threads
[       OK ] Scheme/HTTPTest.CaseInsensitiveHeaders/0 (519 ms)
[ RUN      ] Scheme/HTTPTest.CaseInsensitiveHeaders/1
I0323 19:20:30.861758 26257 process.cpp:1247] libprocess is initialized on 172.17.0.2:43361
with 16 worker threads
[       OK ] Scheme/HTTPTest.CaseInsensitiveHeaders/1 (8 ms)
[ RUN      ] Scheme/HTTPTest.WWWAuthenticateHeader/0
I0323 19:20:31.211952 26257 openssl.cpp:419] CA file path is unspecified! NOTE: Set CA file
path with LIBPROCESS_SSL_CA_FILE=<filepath>
I0323 19:20:31.211997 26257 openssl.cpp:424] CA directory path unspecified! NOTE: Set CA directory
path with LIBPROCESS_SSL_CA_DIR=<dirpath>
I0323 19:20:31.212002 26257 openssl.cpp:429] Will not verify peer certificate!
NOTE: Set LIBPROCESS_SSL_VERIFY_CERT=1 to enable peer certificate verification
I0323 19:20:31.212007 26257 openssl.cpp:435] Will only verify peer certificate if presented!
NOTE: Set LIBPROCESS_SSL_REQUIRE_CERT=1 to require peer certificate verification
I0323 19:20:31.231686 26257 process.cpp:1247] libprocess is initialized on 172.17.0.2:49023
with 16 worker threads
[       OK ] Scheme/HTTPTest.WWWAuthenticateHeader/0 (370 ms)
[ RUN      ] Scheme/HTTPTest.WWWAuthenticateHeader/1
I0323 19:20:31.234944 26257 process.cpp:1247] libprocess is initialized on 172.17.0.2:47767
with 16 worker threads
[       OK ] Scheme/HTTPTest.WWWAuthenticateHeader/1 (3 ms)
[ RUN      ] Scheme/HTTPTest.Accepts/0
I0323 19:20:31.589135 26257 openssl.cpp:419] CA file path is unspecified! NOTE: Set CA file
path with LIBPROCESS_SSL_CA_FILE=<filepath>
I0323 19:20:31.589161 26257 openssl.cpp:424] CA directory path unspecified! NOTE: Set CA directory
path with LIBPROCESS_SSL_CA_DIR=<dirpath>
I0323 19:20:31.589169 26257 openssl.cpp:429] Will not verify peer certificate!
NOTE: Set LIBPROCESS_SSL_VERIFY_CERT=1 to enable peer certificate verification
I0323 19:20:31.589174 26257 openssl.cpp:435] Will only verify peer certificate if presented!
NOTE: Set LIBPROCESS_SSL_REQUIRE_CERT=1 to require peer certificate verification
I0323 19:20:31.591401 26257 process.cpp:1247] libprocess is initialized on 172.17.0.2:46032
with 16 worker threads
[       OK ] Scheme/HTTPTest.Accepts/0 (357 ms)
[ RUN      ] Scheme/HTTPTest.Accepts/1
I0323 19:20:31.595165 26257 process.cpp:1247] libprocess is initialized on 172.17.0.2:46751
with 16 worker threads
[       OK ] Scheme/HTTPTest.Accepts/1 (4 ms)
*** Aborted at 1490296831 (unix time) try "date -d @1490296831" if you are using GNU date
***
PC: @     0x2b69d0e7664e (unknown)
I0323 19:20:31.598371 26257 process.cpp:1247] libprocess is initialized on 172.17.0.2:37040
with 16 worker threads
*** SIGSEGV (@0x31174c8) received by PID 26257 (TID 0x2b69d7d1f700) from PID 51475656; stack
trace: ***
    @     0x2b69ce7c8330 (unknown)
[----------] 42 tests from Scheme/HTTPTest (7750 ms total)

[----------] 4 tests from Encryption/NetSocketTest
[ RUN      ] Encryption/NetSocketTest.EOFBeforeRecv/0
    @     0x2b69d0e7664e (unknown)
    @     0x2b69d0676e30 (unknown)
    @     0x2b69d067748c (unknown)
    @           0x4438cf process::UPID::UPID()
    @           0xa034ae process::DispatchEvent::DispatchEvent()
    @           0x9ece33 process::internal::dispatch()
    @           0xa02f6d process::dispatch<>()
    @           0x9ebe57 process::ProcessBase::route()
    @           0xb122cd process::ProcessBase::route<>()
    @           0xb0fba0 process::Help::initialize()
    @           0xb0fc52 process::Help::initialize()
    @           0x9e6940 process::ProcessManager::resume()
    @           0x9f529c process::ProcessManager::init_threads()::$_2::operator()()
    @           0x9f51a5 _ZNSt12_Bind_simpleIFZN7process14ProcessManager12init_threadsEvE3$_2vEE9_M_invokeIJEEEvSt12_Index_tupleIJXspT_EEE
    @           0x9f5175 std::_Bind_simple<>::operator()()
    @           0x9f514c std::thread::_Impl<>::_M_run()
    @     0x2b69d066da60 (unknown)
    @     0x2b69ce7c0184 start_thread
    @     0x2b69d0ed9bed (unknown)
make[7]: *** [check-local] Segmentation fault
make[7]: Leaving directory `/mesos/mesos-1.3.0/_build/3rdparty/libprocess'
make[6]: *** [check-am] Error 2
make[6]: Leaving directory `/mesos/mesos-1.3.0/_build/3rdparty/libprocess'
make[5]: *** [check-recursive] Error 1
make[5]: Leaving directory `/mesos/mesos-1.3.0/_build/3rdparty/libprocess'
make[4]: *** [check] Error 2
make[4]: Leaving directory `/mesos/mesos-1.3.0/_build/3rdparty/libprocess'
make[3]: *** [check-recursive] Error 1
make[3]: Leaving directory `/mesos/mesos-1.3.0/_build/3rdparty'
make[2]: *** [check] Error 2
make[2]: Leaving directory `/mesos/mesos-1.3.0/_build/3rdparty'
make[1]: *** [check-recursive] Error 1
make[1]: Leaving directory `/mesos/mesos-1.3.0/_build'
make: *** [distcheck] Error 1
+ docker rmi mesos-1490295386-16588
Untagged: mesos-1490295386-16588:latest
Deleted: sha256:f26ae0531dc2bd72e4727714ae6e99905996ace412ad496efa40d8e772e08de8
Deleted: sha256:83c7f25f9810f9dc71f72bc78d346b2a597e34c17f80a03db7061ed50ef5e4f6
Deleted: sha256:afacdb41783faceaa6757a1f0f5bb2f54b116160debd00c869b326b33c562cb2
Deleted: sha256:c1d58d772aaaf871e2f435586eae25b0188d592ede29f4812ed779e334aae32c
Deleted: sha256:88a66b6c3e2c63455c534709d3f6519c336feff5bf140fb4b0bc1482c34fe567
Deleted: sha256:9c3f3d13da1c662c4093e3d96ff6e6ed417b3482dd8ac4a76fdab6ee2d61f817
Deleted: sha256:1cc434313c50306a9085727ab35dd5e30929eaca83fefc43ea75f9661d28776f
Deleted: sha256:e12cf4aaa877ecd09378e48fcac6eb003bea25e1a052f747e0299d8c528d77b2
Deleted: sha256:1a2bba81aba37d1af0188d59df896ebf20fbeaa26b3d61afddfb50db571d533c
Deleted: sha256:4856fbf75a35054acc704f7970fe4074f672b6720886c5182a494e35aa56b522
Deleted: sha256:45394c855fda021e1294ce5e3f72cdf95da919e430b8059d46f7297eb1b4325b
Deleted: sha256:9ff578ab66247e00768d2088c0dab7f4d01b4202c8bef5049066ecf8ca7d5063
Deleted: sha256:18fbe0e42eff4790e44e0334b24e64b78bdbcc1460a28b35d803d2674c00d349
Deleted: sha256:3867fbbc38b25dd4b62c6c5a44f915da23e72c59e280e5a489aaaf7af662af75
Deleted: sha256:5fd64e905f11ae86b5c87fc74ea281e7b78c4906279d74323ba19adbee2484bf
Deleted: sha256:d9a3303f955ed77b04db8dd16a67be6eec363f63b0bf5041c72e7f3112d2e205
Deleted: sha256:aaa448efb83bcf7cdc9242965fe1e4e0ce5bcbacb539ed16ccce2da814b01918
Deleted: sha256:c60e5eb95225d9d980f3485367c07d95adc75bc757b1b5e5cecc704209b25adc
Deleted: sha256:b2cc6cc80bec1994dc66373a609771b828f386e4b205398c73713be74f81536a
Deleted: sha256:211a110d4c416959b0dceecec19120e6cf800cf649c7a87e9cd563fba51d2a19
Deleted: sha256:362a03e210f1db26bee1810d4f45376441fbe2b7ebd5c893600fc26c7c1218f9
Deleted: sha256:d36fc01dbfeb572743c7ddcda94b3e01c233cd64062d1b05496419b1bb24591a
Deleted: sha256:7f8ca486b9c64492215e1477b9d71cdc816695646340fdf3d3c34a8f4357ed5c
Deleted: sha256:c789c5964bc9c003c02a9b192166ed50bf0fdb01e3c6935b35d7828b70c9a642
Build step 'Execute shell' marked build as failure

Mime
View raw message