mesos-builds mailing list archives

Site index · List index
Message view « Date » · « Thread »
Top « Date » · « Thread »
From Apache Jenkins Server <jenk...@builds.apache.org>
Subject Build failed in Jenkins: Mesos-Buildbot » cmake,clang,--verbose --enable-libevent --enable-ssl,GLOG_v=1 MESOS_VERBOSE=1,ubuntu:14.04,(docker||Hadoop)&&(!ubuntu-us1)&&(!ubuntu-eu2) #3428
Date Tue, 28 Mar 2017 22:26:58 GMT
See <https://builds.apache.org/job/Mesos-Buildbot/BUILDTOOL=cmake,COMPILER=clang,CONFIGURATION=--verbose%20--enable-libevent%20--enable-ssl,ENVIRONMENT=GLOG_v=1%20MESOS_VERBOSE=1,OS=ubuntu%3A14.04,label_exp=(docker%7C%7CHadoop)&&(!ubuntu-us1)&&(!ubuntu-eu2)/3428/display/redirect?page=changes>

Changes:

[bmahler] Fixed the missing disk utilization in the webui.

------------------------------------------
[...truncated 25.71 MB...]
I0328 22:26:52.533396 31294 slave.cpp:486] Agent resources: cpus(*):2; mem(*):1024; disk(*):1024;
ports(*):[31000-32000]
I0328 22:26:52.533440 31294 slave.cpp:494] Agent attributes: [  ]
I0328 22:26:52.533457 31294 slave.cpp:499] Agent hostname: 5456998d476a
I0328 22:26:52.533577 31287 status_update_manager.cpp:177] Pausing sending status updates
I0328 22:26:52.533926 31298 state.cpp:62] Recovering state from '/tmp/Endpoint_SlaveEndpointTest_AuthorizedRequest_2_k2ui94/meta'
I0328 22:26:52.534236 31294 status_update_manager.cpp:203] Recovering status update manager
I0328 22:26:52.534376 31285 containerizer.cpp:608] Recovering containerizer
I0328 22:26:52.535053 31293 provisioner.cpp:410] Provisioner recovery complete
I0328 22:26:52.535290 31293 slave.cpp:5921] Finished recovery
I0328 22:26:52.535732 31293 slave.cpp:6103] Querying resource estimator for oversubscribable
resources
I0328 22:26:52.536018 31288 slave.cpp:6117] Received oversubscribable resources {} from the
resource estimator
I0328 22:26:52.536975 31286 process.cpp:3705] Handling HTTP event for process 'slave(721)'
with path: '/slave(721)/containers'
I0328 22:26:52.537675 31288 http.cpp:937] Authorizing principal 'test-principal' to GET the
'/containers' endpoint
I0328 22:26:52.539139 31296 slave.cpp:748] Agent terminating
[       OK ] Endpoint/SlaveEndpointTest.AuthorizedRequest/2 (15 ms)
[ RUN      ] Endpoint/SlaveEndpointTest.UnauthorizedRequest/0
I0328 22:26:52.547312 26004 containerizer.cpp:221] Using isolation: posix/cpu,posix/mem,filesystem/posix,network/cni
W0328 22:26:52.547642 26004 backend.cpp:76] Failed to create 'aufs' backend: AufsBackend requires
root privileges
W0328 22:26:52.547686 26004 backend.cpp:76] Failed to create 'bind' backend: BindBackend requires
root privileges
I0328 22:26:52.547698 26004 provisioner.cpp:249] Using default backend 'copy'
I0328 22:26:52.549273 31291 slave.cpp:226] Mesos agent started on (722)@172.17.0.3:46205
I0328 22:26:52.549301 31291 slave.cpp:227] Flags at startup: --acls="" --appc_simple_discovery_uri_prefix="http://"
--appc_store_dir="/tmp/mesos/store/appc" --authenticate_http_executors="true" --authenticate_http_readonly="true"
--authenticate_http_readwrite="true" --authenticatee="crammd5" --authentication_backoff_factor="1secs"
--authorizer="local" --cgroups_cpu_enable_pids_and_tids_count="false" --cgroups_enable_cfs="false"
--cgroups_hierarchy="/sys/fs/cgroup" --cgroups_limit_swap="false" --cgroups_root="mesos" --container_disk_watch_interval="15secs"
--containerizers="mesos" --credential="/tmp/Endpoint_SlaveEndpointTest_UnauthorizedRequest_0_iARAGM/credential"
--default_role="*" --disk_watch_interval="1mins" --docker="docker" --docker_kill_orphans="true"
--docker_registry="https://registry-1.docker.io" --docker_remove_delay="6hrs" --docker_socket="/var/run/docker.sock"
--docker_stop_timeout="0ns" --docker_store_dir="/tmp/mesos/store/docker" --docker_volume_checkpoint_dir="/var/run/mesos/isolators/docker/volume"
--enforce_container_disk_quota="false" --executor_registration_timeout="1mins" --executor_secret_key="secret_key"
--executor_shutdown_grace_period="5secs" --fetcher_cache_dir="/tmp/Endpoint_SlaveEndpointTest_UnauthorizedRequest_0_iARAGM/fetch"
--fetcher_cache_size="2GB" --frameworks_home="" --gc_delay="1weeks" --gc_disk_headroom="0.1"
--hadoop_home="" --help="false" --hostname_lookup="true" --http_command_executor="false" --http_credentials="/tmp/Endpoint_SlaveEndpointTest_UnauthorizedRequest_0_iARAGM/http_credentials"
--http_heartbeat_interval="30secs" --initialize_driver_logging="true" --isolation="posix/cpu,posix/mem"
--launcher="posix" --launcher_dir="/mesos/build/src" --logbufsecs="0" --logging_level="INFO"
--max_completed_executors_per_framework="150" --oversubscribed_resources_interval="15secs"
--perf_duration="10secs" --perf_interval="1mins" --qos_correction_interval_min="0ns" --quiet="false"
--recover="reconnect" --recovery_timeout="15mins" --registration_backoff_factor="10ms" --resources="cpus:2;gpus:0;mem:1024;disk:1024;ports:[31000-32000]"
--revocable_cpu_low_priority="true" --runtime_dir="/tmp/Endpoint_SlaveEndpointTest_UnauthorizedRequest_0_iARAGM"
--sandbox_directory="/mnt/mesos/sandbox" --strict="true" --switch_user="true" --systemd_enable_support="true"
--systemd_runtime_directory="/run/systemd/system" --version="false" --work_dir="/tmp/Endpoint_SlaveEndpointTest_UnauthorizedRequest_0_slKZyr"
I0328 22:26:52.549711 31291 credentials.hpp:86] Loading credential for authentication from
'/tmp/Endpoint_SlaveEndpointTest_UnauthorizedRequest_0_iARAGM/credential'
I0328 22:26:52.549826 31291 slave.cpp:259] Agent using credential for: test-principal
I0328 22:26:52.549841 31291 credentials.hpp:37] Loading credentials for authentication from
'/tmp/Endpoint_SlaveEndpointTest_UnauthorizedRequest_0_iARAGM/http_credentials'
I0328 22:26:52.549955 31291 http.cpp:976] Creating default 'basic' HTTP authenticator for
realm 'mesos-agent-executor'
I0328 22:26:52.550004 31291 http.cpp:997] Creating default 'jwt' HTTP authenticator for realm
'mesos-agent-executor'
I0328 22:26:52.550055 31291 http.cpp:976] Creating default 'basic' HTTP authenticator for
realm 'mesos-agent-readonly'
I0328 22:26:52.550106 31291 http.cpp:997] Creating default 'jwt' HTTP authenticator for realm
'mesos-agent-readonly'
I0328 22:26:52.550273 31291 http.cpp:976] Creating default 'basic' HTTP authenticator for
realm 'mesos-agent-readwrite'
I0328 22:26:52.550331 31291 http.cpp:997] Creating default 'jwt' HTTP authenticator for realm
'mesos-agent-readwrite'
I0328 22:26:52.550995 31291 slave.cpp:486] Agent resources: cpus(*):2; mem(*):1024; disk(*):1024;
ports(*):[31000-32000]
I0328 22:26:52.551038 31291 slave.cpp:494] Agent attributes: [  ]
I0328 22:26:52.551048 31291 slave.cpp:499] Agent hostname: 5456998d476a
I0328 22:26:52.551127 31287 status_update_manager.cpp:177] Pausing sending status updates
I0328 22:26:52.551549 31284 state.cpp:62] Recovering state from '/tmp/Endpoint_SlaveEndpointTest_UnauthorizedRequest_0_slKZyr/meta'
I0328 22:26:52.551715 31292 status_update_manager.cpp:203] Recovering status update manager
I0328 22:26:52.551859 31290 containerizer.cpp:608] Recovering containerizer
I0328 22:26:52.552495 31290 provisioner.cpp:410] Provisioner recovery complete
I0328 22:26:52.552728 31296 slave.cpp:5921] Finished recovery
I0328 22:26:52.553122 31296 slave.cpp:6103] Querying resource estimator for oversubscribable
resources
I0328 22:26:52.553246 31297 slave.cpp:6117] Received oversubscribable resources {} from the
resource estimator
I0328 22:26:52.554010 31288 process.cpp:3705] Handling HTTP event for process 'slave(722)'
with path: '/slave(722)/monitor/statistics'
I0328 22:26:52.554786 31298 http.cpp:937] Authorizing principal 'test-principal' to GET the
'/monitor/statistics' endpoint
I0328 22:26:52.556022 31291 slave.cpp:748] Agent terminating
[       OK ] Endpoint/SlaveEndpointTest.UnauthorizedRequest/0 (14 ms)
[ RUN      ] Endpoint/SlaveEndpointTest.UnauthorizedRequest/1
I0328 22:26:52.566856 26004 containerizer.cpp:221] Using isolation: posix/cpu,posix/mem,filesystem/posix,network/cni
W0328 22:26:52.567162 26004 backend.cpp:76] Failed to create 'aufs' backend: AufsBackend requires
root privileges
W0328 22:26:52.567204 26004 backend.cpp:76] Failed to create 'bind' backend: BindBackend requires
root privileges
I0328 22:26:52.567219 26004 provisioner.cpp:249] Using default backend 'copy'
I0328 22:26:52.568728 31293 slave.cpp:226] Mesos agent started on (723)@172.17.0.3:46205
I0328 22:26:52.568783 31293 slave.cpp:227] Flags at startup: --acls="" --appc_simple_discovery_uri_prefix="http://"
--appc_store_dir="/tmp/mesos/store/appc" --authenticate_http_executors="true" --authenticate_http_readonly="true"
--authenticate_http_readwrite="true" --authenticatee="crammd5" --authentication_backoff_factor="1secs"
--authorizer="local" --cgroups_cpu_enable_pids_and_tids_count="false" --cgroups_enable_cfs="false"
--cgroups_hierarchy="/sys/fs/cgroup" --cgroups_limit_swap="false" --cgroups_root="mesos" --container_disk_watch_interval="15secs"
--containerizers="mesos" --credential="/tmp/Endpoint_SlaveEndpointTest_UnauthorizedRequest_1_Qkmql9/credential"
--default_role="*" --disk_watch_interval="1mins" --docker="docker" --docker_kill_orphans="true"
--docker_registry="https://registry-1.docker.io" --docker_remove_delay="6hrs" --docker_socket="/var/run/docker.sock"
--docker_stop_timeout="0ns" --docker_store_dir="/tmp/mesos/store/docker" --docker_volume_checkpoint_dir="/var/run/mesos/isolators/docker/volume"
--enforce_container_disk_quota="false" --executor_registration_timeout="1mins" --executor_secret_key="secret_key"
--executor_shutdown_grace_period="5secs" --fetcher_cache_dir="/tmp/Endpoint_SlaveEndpointTest_UnauthorizedRequest_1_Qkmql9/fetch"
--fetcher_cache_size="2GB" --frameworks_home="" --gc_delay="1weeks" --gc_disk_headroom="0.1"
--hadoop_home="" --help="false" --hostname_lookup="true" --http_command_executor="false" --http_credentials="/tmp/Endpoint_SlaveEndpointTest_UnauthorizedRequest_1_Qkmql9/http_credentials"
--http_heartbeat_interval="30secs" --initialize_driver_logging="true" --isolation="posix/cpu,posix/mem"
--launcher="posix" --launcher_dir="/mesos/build/src" --logbufsecs="0" --logging_level="INFO"
--max_completed_executors_per_framework="150" --oversubscribed_resources_interval="15secs"
--perf_duration="10secs" --perf_interval="1mins" --qos_correction_interval_min="0ns" --quiet="false"
--recover="reconnect" --recovery_timeout="15mins" --registration_backoff_factor="10ms" --resources="cpus:2;gpus:0;mem:1024;disk:1024;ports:[31000-32000]"
--revocable_cpu_low_priority="true" --runtime_dir="/tmp/Endpoint_SlaveEndpointTest_UnauthorizedRequest_1_Qkmql9"
--sandbox_directory="/mnt/mesos/sandbox" --strict="true" --switch_user="true" --systemd_enable_support="true"
--systemd_runtime_directory="/run/systemd/system" --version="false" --work_dir="/tmp/Endpoint_SlaveEndpointTest_UnauthorizedRequest_1_qBnFaO"
I0328 22:26:52.569191 31293 credentials.hpp:86] Loading credential for authentication from
'/tmp/Endpoint_SlaveEndpointTest_UnauthorizedRequest_1_Qkmql9/credential'
I0328 22:26:52.569290 31293 slave.cpp:259] Agent using credential for: test-principal
I0328 22:26:52.569305 31293 credentials.hpp:37] Loading credentials for authentication from
'/tmp/Endpoint_SlaveEndpointTest_UnauthorizedRequest_1_Qkmql9/http_credentials'
I0328 22:26:52.569416 31293 http.cpp:976] Creating default 'basic' HTTP authenticator for
realm 'mesos-agent-executor'
I0328 22:26:52.569460 31293 http.cpp:997] Creating default 'jwt' HTTP authenticator for realm
'mesos-agent-executor'
I0328 22:26:52.569603 31293 http.cpp:976] Creating default 'basic' HTTP authenticator for
realm 'mesos-agent-readonly'
I0328 22:26:52.569664 31293 http.cpp:997] Creating default 'jwt' HTTP authenticator for realm
'mesos-agent-readonly'
I0328 22:26:52.569726 31293 http.cpp:976] Creating default 'basic' HTTP authenticator for
realm 'mesos-agent-readwrite'
I0328 22:26:52.569778 31293 http.cpp:997] Creating default 'jwt' HTTP authenticator for realm
'mesos-agent-readwrite'
I0328 22:26:52.570533 31293 slave.cpp:486] Agent resources: cpus(*):2; mem(*):1024; disk(*):1024;
ports(*):[31000-32000]
I0328 22:26:52.570574 31293 slave.cpp:494] Agent attributes: [  ]
I0328 22:26:52.570580 31293 slave.cpp:499] Agent hostname: 5456998d476a
I0328 22:26:52.570662 31284 status_update_manager.cpp:177] Pausing sending status updates
I0328 22:26:52.571003 31288 state.cpp:62] Recovering state from '/tmp/Endpoint_SlaveEndpointTest_UnauthorizedRequest_1_qBnFaO/meta'
I0328 22:26:52.571228 31293 status_update_manager.cpp:203] Recovering status update manager
I0328 22:26:52.571445 31287 containerizer.cpp:608] Recovering containerizer
I0328 22:26:52.572028 31287 provisioner.cpp:410] Provisioner recovery complete
I0328 22:26:52.572243 31284 slave.cpp:5921] Finished recovery
I0328 22:26:52.572641 31284 slave.cpp:6103] Querying resource estimator for oversubscribable
resources
I0328 22:26:52.572762 31295 slave.cpp:6117] Received oversubscribable resources {} from the
resource estimator
I0328 22:26:52.573655 31289 process.cpp:3705] Handling HTTP event for process 'slave(723)'
with path: '/slave(723)/monitor/statistics.json'
I0328 22:26:52.574370 31285 http.cpp:937] Authorizing principal 'test-principal' to GET the
'/monitor/statistics.json' endpoint
I0328 22:26:52.575642 31285 slave.cpp:748] Agent terminating
[       OK ] Endpoint/SlaveEndpointTest.UnauthorizedRequest/1 (14 ms)
[ RUN      ] Endpoint/SlaveEndpointTest.UnauthorizedRequest/2
I0328 22:26:52.586442 26004 containerizer.cpp:221] Using isolation: posix/cpu,posix/mem,filesystem/posix,network/cni
W0328 22:26:52.586876 26004 backend.cpp:76] Failed to create 'aufs' backend: AufsBackend requires
root privileges
W0328 22:26:52.586941 26004 backend.cpp:76] Failed to create 'bind' backend: BindBackend requires
root privileges
I0328 22:26:52.586961 26004 provisioner.cpp:249] Using default backend 'copy'
I0328 22:26:52.588552 31290 slave.cpp:226] Mesos agent started on (724)@172.17.0.3:46205
I0328 22:26:52.588583 31290 slave.cpp:227] Flags at startup: --acls="" --appc_simple_discovery_uri_prefix="http://"
--appc_store_dir="/tmp/mesos/store/appc" --authenticate_http_executors="true" --authenticate_http_readonly="true"
--authenticate_http_readwrite="true" --authenticatee="crammd5" --authentication_backoff_factor="1secs"
--authorizer="local" --cgroups_cpu_enable_pids_and_tids_count="false" --cgroups_enable_cfs="false"
--cgroups_hierarchy="/sys/fs/cgroup" --cgroups_limit_swap="false" --cgroups_root="mesos" --container_disk_watch_interval="15secs"
--containerizers="mesos" --credential="/tmp/Endpoint_SlaveEndpointTest_UnauthorizedRequest_2_EvTJcw/credential"
--default_role="*" --disk_watch_interval="1mins" --docker="docker" --docker_kill_orphans="true"
--docker_registry="https://registry-1.docker.io" --docker_remove_delay="6hrs" --docker_socket="/var/run/docker.sock"
--docker_stop_timeout="0ns" --docker_store_dir="/tmp/mesos/store/docker" --docker_volume_checkpoint_dir="/var/run/mesos/isolators/docker/volume"
--enforce_container_disk_quota="false" --executor_registration_timeout="1mins" --executor_secret_key="secret_key"
--executor_shutdown_grace_period="5secs" --fetcher_cache_dir="/tmp/Endpoint_SlaveEndpointTest_UnauthorizedRequest_2_EvTJcw/fetch"
--fetcher_cache_size="2GB" --frameworks_home="" --gc_delay="1weeks" --gc_disk_headroom="0.1"
--hadoop_home="" --help="false" --hostname_lookup="true" --http_command_executor="false" --http_credentials="/tmp/Endpoint_SlaveEndpointTest_UnauthorizedRequest_2_EvTJcw/http_credentials"
--http_heartbeat_interval="30secs" --initialize_driver_logging="true" --isolation="posix/cpu,posix/mem"
--launcher="posix" --launcher_dir="/mesos/build/src" --logbufsecs="0" --logging_level="INFO"
--max_completed_executors_per_framework="150" --oversubscribed_resources_interval="15secs"
--perf_duration="10secs" --perf_interval="1mins" --qos_correction_interval_min="0ns" --quiet="false"
--recover="reconnect" --recovery_timeout="15mins" --registration_backoff_factor="10ms" --resources="cpus:2;gpus:0;mem:1024;disk:1024;ports:[31000-32000]"
--revocable_cpu_low_priority="true" --runtime_dir="/tmp/Endpoint_SlaveEndpointTest_UnauthorizedRequest_2_EvTJcw"
--sandbox_directory="/mnt/mesos/sandbox" --strict="true" --switch_user="true" --systemd_enable_support="true"
--systemd_runtime_directory="/run/systemd/system" --version="false" --work_dir="/tmp/Endpoint_SlaveEndpointTest_UnauthorizedRequest_2_OFjRYa"
I0328 22:26:52.588981 31290 credentials.hpp:86] Loading credential for authentication from
'/tmp/Endpoint_SlaveEndpointTest_UnauthorizedRequest_2_EvTJcw/credential'
I0328 22:26:52.589077 31290 slave.cpp:259] Agent using credential for: test-principal
I0328 22:26:52.589093 31290 credentials.hpp:37] Loading credentials for authentication from
'/tmp/Endpoint_SlaveEndpointTest_UnauthorizedRequest_2_EvTJcw/http_credentials'
I0328 22:26:52.589208 31290 http.cpp:976] Creating default 'basic' HTTP authenticator for
realm 'mesos-agent-executor'
I0328 22:26:52.589251 31290 http.cpp:997] Creating default 'jwt' HTTP authenticator for realm
'mesos-agent-executor'
I0328 22:26:52.589334 31290 http.cpp:976] Creating default 'basic' HTTP authenticator for
realm 'mesos-agent-readonly'
I0328 22:26:52.589406 31290 http.cpp:997] Creating default 'jwt' HTTP authenticator for realm
'mesos-agent-readonly'
I0328 22:26:52.589560 31290 http.cpp:976] Creating default 'basic' HTTP authenticator for
realm 'mesos-agent-readwrite'
I0328 22:26:52.589615 31290 http.cpp:997] Creating default 'jwt' HTTP authenticator for realm
'mesos-agent-readwrite'
I0328 22:26:52.590145 31290 slave.cpp:486] Agent resources: cpus(*):2; mem(*):1024; disk(*):1024;
ports(*):[31000-32000]
I0328 22:26:52.590189 31290 slave.cpp:494] Agent attributes: [  ]
I0328 22:26:52.590200 31290 slave.cpp:499] Agent hostname: 5456998d476a
I0328 22:26:52.590314 31293 status_update_manager.cpp:177] Pausing sending status updates
I0328 22:26:52.590687 31298 state.cpp:62] Recovering state from '/tmp/Endpoint_SlaveEndpointTest_UnauthorizedRequest_2_OFjRYa/meta'
I0328 22:26:52.590993 31293 status_update_manager.cpp:203] Recovering status update manager
I0328 22:26:52.591197 31288 containerizer.cpp:608] Recovering containerizer
I0328 22:26:52.591859 31294 provisioner.cpp:410] Provisioner recovery complete
I0328 22:26:52.592201 31292 slave.cpp:5921] Finished recovery
I0328 22:26:52.592650 31292 slave.cpp:6103] Querying resource estimator for oversubscribable
resources
I0328 22:26:52.592815 31285 slave.cpp:6117] Received oversubscribable resources {} from the
resource estimator
I0328 22:26:52.593747 31295 process.cpp:3705] Handling HTTP event for process 'slave(724)'
with path: '/slave(724)/containers'
I0328 22:26:52.594532 31285 http.cpp:937] Authorizing principal 'test-principal' to GET the
'/containers' endpoint
I0328 22:26:52.596284 26004 slave.cpp:748] Agent terminating
[       OK ] Endpoint/SlaveEndpointTest.UnauthorizedRequest/2 (15 ms)
[ RUN      ] Endpoint/SlaveEndpointTest.NoAuthorizer/0
I0328 22:26:52.602053 26004 containerizer.cpp:221] Using isolation: posix/cpu,posix/mem,filesystem/posix,network/cni
W0328 22:26:52.602437 26004 backend.cpp:76] Failed to create 'aufs' backend: AufsBackend requires
root privileges
W0328 22:26:52.602483 26004 backend.cpp:76] Failed to create 'bind' backend: BindBackend requires
root privileges
I0328 22:26:52.602494 26004 provisioner.cpp:249] Using default backend 'copy'
I0328 22:26:52.603219 26004 cluster.cpp:446] Creating default 'local' authorizer
I0328 22:26:52.603891 31299 slave.cpp:226] Mesos agent started on (725)@172.17.0.3:46205
I0328 22:26:52.603925 31299 slave.cpp:227] Flags at startup: --acls="" --appc_simple_discovery_uri_prefix="http://"
--appc_store_dir="/tmp/mesos/store/appc" --authenticate_http_executors="true" --authenticate_http_readonly="true"
--authenticate_http_readwrite="true" --authenticatee="crammd5" --authentication_backoff_factor="1secs"
--authorizer="local" --cgroups_cpu_enable_pids_and_tids_count="false" --cgroups_enable_cfs="false"
--cgroups_hierarchy="/sys/fs/cgroup" --cgroups_limit_swap="false" --cgroups_root="mesos" --container_disk_watch_interval="15secs"
--containerizers="mesos" --credential="/tmp/Endpoint_SlaveEndpointTest_NoAuthorizer_0_Kf19eT/credential"
--default_role="*" --disk_watch_interval="1mins" --docker="docker" --docker_kill_orphans="true"
--docker_registry="https://registry-1.docker.io" --docker_remove_delay="6hrs" --docker_socket="/var/run/docker.sock"
--docker_stop_timeout="0ns" --docker_store_dir="/tmp/mesos/store/docker" --docker_volume_checkpoint_dir="/var/run/mesos/isolators/docker/volume"
--enforce_container_disk_quota="false" --executor_registration_timeout="1mins" --executor_secret_key="secret_key"
--executor_shutdown_grace_period="5secs" --fetcher_cache_dir="/tmp/Endpoint_SlaveEndpointTest_NoAuthorizer_0_Kf19eT/fetch"
--fetcher_cache_size="2GB" --frameworks_home="" --gc_delay="1weeks" --gc_disk_headroom="0.1"
--hadoop_home="" --help="false" --hostname_lookup="true" --http_command_executor="false" --http_credentials="/tmp/Endpoint_SlaveEndpointTest_NoAuthorizer_0_Kf19eT/http_credentials"
--http_heartbeat_interval="30secs" --initialize_driver_logging="true" --isolation="posix/cpu,posix/mem"
--launcher="posix" --launcher_dir="/mesos/build/src" --logbufsecs="0" --logging_level="INFO"
--max_completed_executors_per_framework="150" --oversubscribed_resources_interval="15secs"
--perf_duration="10secs" --perf_interval="1mins" --qos_correction_interval_min="0ns" --quiet="false"
--recover="reconnect" --recovery_timeout="15mins" --registration_backoff_factor="10ms" --resources="cpus:2;gpus:0;mem:1024;disk:1024;ports:[31000-32000]"
--revocable_cpu_low_priority="true" --runtime_dir="/tmp/Endpoint_SlaveEndpointTest_NoAuthorizer_0_Kf19eT"
--sandbox_directory="/mnt/mesos/sandbox" --strict="true" --switch_user="true" --systemd_enable_support="true"
--systemd_runtime_directory="/run/systemd/system" --version="false" --work_dir="/tmp/Endpoint_SlaveEndpointTest_NoAuthorizer_0_qnkGYx"
I0328 22:26:52.604362 31299 credentials.hpp:86] Loading credential for authentication from
'/tmp/Endpoint_SlaveEndpointTest_NoAuthorizer_0_Kf19eT/credential'
I0328 22:26:52.604460 31299 slave.cpp:259] Agent using credential for: test-principal
I0328 22:26:52.604473 31299 credentials.hpp:37] Loading credentials for authentication from
'/tmp/Endpoint_SlaveEndpointTest_NoAuthorizer_0_Kf19eT/http_credentials'
I0328 22:26:52.604586 31299 http.cpp:976] Creating default 'basic' HTTP authenticator for
realm 'mesos-agent-executor'
I0328 22:26:52.604629 31299 http.cpp:997] Creating default 'jwt' HTTP authenticator for realm
'mesos-agent-executor'
I0328 22:26:52.604722 31299 http.cpp:976] Creating default 'basic' HTTP authenticator for
realm 'mesos-agent-readonly'
I0328 22:26:52.604773 31299 http.cpp:997] Creating default 'jwt' HTTP authenticator for realm
'mesos-agent-readonly'
I0328 22:26:52.604867 31299 http.cpp:976] Creating default 'basic' HTTP authenticator for
realm 'mesos-agent-readwrite'
I0328 22:26:52.604912 31299 http.cpp:997] Creating default 'jwt' HTTP authenticator for realm
'mesos-agent-readwrite'
I0328 22:26:52.605497 31299 slave.cpp:486] Agent resources: cpus(*):2; mem(*):1024; disk(*):1024;
ports(*):[31000-32000]
I0328 22:26:52.605564 31299 slave.cpp:494] Agent attributes: [  ]
I0328 22:26:52.605571 31299 slave.cpp:499] Agent hostname: 5456998d476a
I0328 22:26:52.605705 31289 status_update_manager.cpp:177] Pausing sending status updates
I0328 22:26:52.605984 31295 state.cpp:62] Recovering state from '/tmp/Endpoint_SlaveEndpointTest_NoAuthorizer_0_qnkGYx/meta'
I0328 22:26:52.606132 31298 status_update_manager.cpp:203] Recovering status update manager
I0328 22:26:52.606273 31291 containerizer.cpp:608] Recovering containerizer
I0328 22:26:52.606835 31286 provisioner.cpp:410] Provisioner recovery complete
I0328 22:26:52.607054 31291 slave.cpp:5921] Finished recovery
I0328 22:26:52.607439 31291 slave.cpp:6103] Querying resource estimator for oversubscribable
resources
I0328 22:26:52.607594 31284 slave.cpp:6117] Received oversubscribable resources {} from the
resource estimator
I0328 22:26:52.608232 31284 process.cpp:3705] Handling HTTP event for process 'slave(725)'
with path: '/slave(725)/monitor/statistics'
I0328 22:26:52.608834 31291 http.cpp:937] Authorizing principal 'test-principal' to GET the
'/monitor/statistics' endpoint
I0328 22:26:52.610752 31289 slave.cpp:748] Agent terminating
[       OK ] Endpoint/SlaveEndpointTest.NoAuthorizer/0 (14 ms)
[ RUN      ] Endpoint/SlaveEndpointTest.NoAuthorizer/1
I0328 22:26:52.620915 26004 containerizer.cpp:221] Using isolation: posix/cpu,posix/mem,filesystem/posix,network/cni
W0328 22:26:52.621232 26004 backend.cpp:76] Failed to create 'aufs' backend: AufsBackend requires
root privileges
W0328 22:26:52.621274 26004 backend.cpp:76] Failed to create 'bind' backend: BindBackend requires
root privileges
I0328 22:26:52.621287 26004 provisioner.cpp:249] Using default backend 'copy'
I0328 22:26:52.621989 26004 cluster.cpp:446] Creating default 'local' authorizer
I0328 22:26:52.622558 31297 slave.cpp:226] Mesos agent started on (726)@172.17.0.3:46205
I0328 22:26:52.622589 31297 slave.cpp:227] Flags at startup: --acls="" --appc_simple_discovery_uri_prefix="http://"
--appc_store_dir="/tmp/mesos/store/appc" --authenticate_http_executors="true" --authenticate_http_readonly="true"
--authenticate_http_readwrite="true" --authenticatee="crammd5" --authentication_backoff_factor="1secs"
--authorizer="local" --cgroups_cpu_enable_pids_and_tids_count="false" --cgroups_enable_cfs="false"
--cgroups_hierarchy="/sys/fs/cgroup" --cgroups_limit_swap="false" --cgroups_root="mesos" --container_disk_watch_interval="15secs"
--containerizers="mesos" --credential="/tmp/Endpoint_SlaveEndpointTest_NoAuthorizer_1_Cz33sg/credential"
--default_role="*" --disk_watch_interval="1mins" --docker="docker" --docker_kill_orphans="true"
--docker_registry="https://registry-1.docker.io" --docker_remove_delay="6hrs" --docker_socket="/var/run/docker.sock"
--docker_stop_timeout="0ns" --docker_store_dir="/tmp/mesos/store/docker" --docker_volume_checkpoint_dir="/var/run/mesos/isolators/docker/volume"
--enforce_container_disk_quota="false" --executor_registration_timeout="1mins" --executor_secret_key="secret_key"
--executor_shutdown_grace_period="5secs" --fetcher_cache_dir="/tmp/Endpoint_SlaveEndpointTest_NoAuthorizer_1_Cz33sg/fetch"
--fetcher_cache_size="2GB" --frameworks_home="" --gc_delay="1weeks" --gc_disk_headroom="0.1"
--hadoop_home="" --help="false" --hostname_lookup="true" --http_command_executor="false" --http_credentials="/tmp/Endpoint_SlaveEndpointTest_NoAuthorizer_1_Cz33sg/http_credentials"
--http_heartbeat_interval="30secs" --initialize_driver_logging="true" --isolation="posix/cpu,posix/mem"
--launcher="posix" --launcher_dir="/mesos/build/src" --logbufsecs="0" --logging_level="INFO"
--max_completed_executors_per_framework="150" --oversubscribed_resources_interval="15secs"
--perf_duration="10secs" --perf_interval="1mins" --qos_correction_interval_min="0ns" --quiet="false"
--recover="reconnect" --recovery_timeout="15mins" --registration_backoff_factor="10ms" --resources="cpus:2;gpus:0;mem:1024;disk:1024;ports:[31000-32000]"
--revocable_cpu_low_priority="true" --runtime_dir="/tmp/Endpoint_SlaveEndpointTest_NoAuthorizer_1_Cz33sg"
--sandbox_directory="/mnt/mesos/sandbox" --strict="true" --switch_user="true" --systemd_enable_support="true"
--systemd_runtime_directory="/run/systemd/system" --version="false" --work_dir="/tmp/Endpoint_SlaveEndpointTest_NoAuthorizer_1_6rBy9U"
I0328 22:26:52.623010 31297 credentials.hpp:86] Loading credential for authentication from
'/tmp/Endpoint_SlaveEndpointTest_NoAuthorizer_1_Cz33sg/credential'
I0328 22:26:52.623112 31297 slave.cpp:259] Agent using credential for: test-principal
I0328 22:26:52.623128 31297 credentials.hpp:37] Loading credentials for authentication from
'/tmp/Endpoint_SlaveEndpointTest_NoAuthorizer_1_Cz33sg/http_credentials'
I0328 22:26:52.623255 31297 http.cpp:976] Creating default 'basic' HTTP authenticator for
realm 'mesos-agent-executor'
I0328 22:26:52.623309 31297 http.cpp:997] Creating default 'jwt' HTTP authenticator for realm
'mesos-agent-executor'
I0328 22:26:52.623442 31297 http.cpp:976] Creating default 'basic' HTTP authenticator for
realm 'mesos-agent-readonly'
I0328 22:26:52.623550 31297 http.cpp:997] Creating default 'jwt' HTTP authenticator for realm
'mesos-agent-readonly'
I0328 22:26:52.623644 31297 http.cpp:976] Creating default 'basic' HTTP authenticator for
realm 'mesos-agent-readwrite'
I0328 22:26:52.623736 31297 http.cpp:997] Creating default 'jwt' HTTP authenticator for realm
'mesos-agent-readwrite'
I0328 22:26:52.624373 31297 slave.cpp:486] Agent resources: cpus(*):2; mem(*):1024; disk(*):1024;
ports(*):[31000-32000]
I0328 22:26:52.624418 31297 slave.cpp:494] Agent attributes: [  ]
I0328 22:26:52.624429 31297 slave.cpp:499] Agent hostname: 5456998d476a
I0328 22:26:52.624513 31285 status_update_manager.cpp:177] Pausing sending status updates
I0328 22:26:52.624860 31285 state.cpp:62] Recovering state from '/tmp/Endpoint_SlaveEndpointTest_NoAuthorizer_1_6rBy9U/meta'
I0328 22:26:52.625072 31299 status_update_manager.cpp:203] Recovering status update manager
I0328 22:26:52.625180 31292 containerizer.cpp:608] Recovering containerizer
I0328 22:26:52.625957 31289 provisioner.cpp:410] Provisioner recovery complete
I0328 22:26:52.626178 31296 slave.cpp:5921] Finished recovery
I0328 22:26:52.626628 31296 slave.cpp:6103] Querying resource estimator for oversubscribable
resources
I0328 22:26:52.626739 31291 slave.cpp:6117] Received oversubscribable resources {} from the
resource estimator
I0328 22:26:52.627421 31285 process.cpp:3705] Handling HTTP event for process 'slave(726)'
with path: '/slave(726)/monitor/statistics.json'
I0328 22:26:52.628103 31293 http.cpp:937] Authorizing principal 'test-principal' to GET the
'/monitor/statistics.json' endpoint
I0328 22:26:52.629698 26004 slave.cpp:748] Agent terminating
[       OK ] Endpoint/SlaveEndpointTest.NoAuthorizer/1 (13 ms)
[ RUN      ] Endpoint/SlaveEndpointTest.NoAuthorizer/2
I0328 22:26:52.636531 26004 containerizer.cpp:221] Using isolation: posix/cpu,posix/mem,filesystem/posix,network/cni
W0328 22:26:52.636864 26004 backend.cpp:76] Failed to create 'aufs' backend: AufsBackend requires
root privileges
W0328 22:26:52.636916 26004 backend.cpp:76] Failed to create 'bind' backend: BindBackend requires
root privileges
I0328 22:26:52.636936 26004 provisioner.cpp:249] Using default backend 'copy'
I0328 22:26:52.637733 26004 cluster.cpp:446] Creating default 'local' authorizer
I0328 22:26:52.638245 31286 slave.cpp:226] Mesos agent started on (727)@172.17.0.3:46205
I0328 22:26:52.638303 31286 slave.cpp:227] Flags at startup: --acls="" --appc_simple_discovery_uri_prefix="http://"
--appc_store_dir="/tmp/mesos/store/appc" --authenticate_http_executors="true" --authenticate_http_readonly="true"
--authenticate_http_readwrite="true" --authenticatee="crammd5" --authentication_backoff_factor="1secs"
--authorizer="local" --cgroups_cpu_enable_pids_and_tids_count="false" --cgroups_enable_cfs="false"
--cgroups_hierarchy="/sys/fs/cgroup" --cgroups_limit_swap="false" --cgroups_root="mesos" --container_disk_watch_interval="15secs"
--containerizers="mesos" --credential="/tmp/Endpoint_SlaveEndpointTest_NoAuthorizer_2_rYvQRD/credential"
--default_role="*" --disk_watch_interval="1mins" --docker="docker" --docker_kill_orphans="true"
--docker_registry="https://registry-1.docker.io" --docker_remove_delay="6hrs" --docker_socket="/var/run/docker.sock"
--docker_stop_timeout="0ns" --docker_store_dir="/tmp/mesos/store/docker" --docker_volume_checkpoint_dir="/var/run/mesos/isolators/docker/volume"
--enforce_container_disk_quota="false" --executor_registration_timeout="1mins" --executor_secret_key="secret_key"
--executor_shutdown_grace_period="5secs" --fetcher_cache_dir="/tmp/Endpoint_SlaveEndpointTest_NoAuthorizer_2_rYvQRD/fetch"
--fetcher_cache_size="2GB" --frameworks_home="" --gc_delay="1weeks" --gc_disk_headroom="0.1"
--hadoop_home="" --help="false" --hostname_lookup="true" --http_command_executor="false" --http_credentials="/tmp/Endpoint_SlaveEndpointTest_NoAuthorizer_2_rYvQRD/http_credentials"
--http_heartbeat_interval="30secs" --initialize_driver_logging="true" --isolation="posix/cpu,posix/mem"
--launcher="posix" --launcher_dir="/mesos/build/src" --logbufsecs="0" --logging_level="INFO"
--max_completed_executors_per_framework="150" --oversubscribed_resources_interval="15secs"
--perf_duration="10secs" --perf_interval="1mins" --qos_correction_interval_min="0ns" --quiet="false"
--recover="reconnect" --recovery_timeout="15mins" --registration_backoff_factor="10ms" --resources="cpus:2;gpus:0;mem:1024;disk:1024;ports:[31000-32000]"
--revocable_cpu_low_priority="true" --runtime_dir="/tmp/Endpoint_SlaveEndpointTest_NoAuthorizer_2_rYvQRD"
--sandbox_directory="/mnt/mesos/sandbox" --strict="true" --switch_user="true" --systemd_enable_support="true"
--systemd_runtime_directory="/run/systemd/system" --version="false" --work_dir="/tmp/Endpoint_SlaveEndpointTest_NoAuthorizer_2_fb8Kvi"
I0328 22:26:52.638667 31286 credentials.hpp:86] Loading credential for authentication from
'/tmp/Endpoint_SlaveEndpointTest_NoAuthorizer_2_rYvQRD/credential'
I0328 22:26:52.638747 31286 slave.cpp:259] Agent using credential for: test-principal
I0328 22:26:52.638761 31286 credentials.hpp:37] Loading credentials for authentication from
'/tmp/Endpoint_SlaveEndpointTest_NoAuthorizer_2_rYvQRD/http_credentials'
I0328 22:26:52.638859 31286 http.cpp:976] Creating default 'basic' HTTP authenticator for
realm 'mesos-agent-executor'
I0328 22:26:52.638896 31286 http.cpp:997] Creating default 'jwt' HTTP authenticator for realm
'mesos-agent-executor'
I0328 22:26:52.638972 31286 http.cpp:976] Creating default 'basic' HTTP authenticator for
realm 'mesos-agent-readonly'
I0328 22:26:52.639014 31286 http.cpp:997] Creating default 'jwt' HTTP authenticator for realm
'mesos-agent-readonly'
I0328 22:26:52.639106 31286 http.cpp:976] Creating default 'basic' HTTP authenticator for
realm 'mesos-agent-readwrite'
I0328 22:26:52.639152 31286 http.cpp:997] Creating default 'jwt' HTTP authenticator for realm
'mesos-agent-readwrite'
I0328 22:26:52.639662 31286 slave.cpp:486] Agent resources: cpus(*):2; mem(*):1024; disk(*):1024;
ports(*):[31000-32000]
I0328 22:26:52.639701 31286 slave.cpp:494] Agent attributes: [  ]
I0328 22:26:52.639711 31286 slave.cpp:499] Agent hostname: 5456998d476a
I0328 22:26:52.639778 31292 status_update_manager.cpp:177] Pausing sending status updates
I0328 22:26:52.640033 31293 state.cpp:62] Recovering state from '/tmp/Endpoint_SlaveEndpointTest_NoAuthorizer_2_fb8Kvi/meta'
I0328 22:26:52.640225 31294 status_update_manager.cpp:203] Recovering status update manager
I0328 22:26:52.640300 31293 containerizer.cpp:608] Recovering containerizer
I0328 22:26:52.640939 31285 provisioner.cpp:410] Provisioner recovery complete
I0328 22:26:52.641134 31288 slave.cpp:5921] Finished recovery
I0328 22:26:52.641479 31288 slave.cpp:6103] Querying resource estimator for oversubscribable
resources
I0328 22:26:52.641680 31285 slave.cpp:6117] Received oversubscribable resources {} from the
resource estimator
I0328 22:26:52.642339 31288 process.cpp:3705] Handling HTTP event for process 'slave(727)'
with path: '/slave(727)/containers'
I0328 22:26:52.642992 31294 http.cpp:937] Authorizing principal 'test-principal' to GET the
'/containers' endpoint
I0328 22:26:52.644803 31297 slave.cpp:748] Agent terminating
[       OK ] Endpoint/SlaveEndpointTest.NoAuthorizer/2 (13 ms)
[----------] 9 tests from Endpoint/SlaveEndpointTest (158 ms total)

[----------] Global test environment tear-down
[==========] 1488 tests from 166 test cases ran. (309102 ms total)
[  PASSED  ] 1487 tests.
[  FAILED  ] 1 test, listed below:
[  FAILED  ] ContainerLoggerTest.LOGROTATE_RotateInSandbox

 1 FAILED TEST
  YOU HAVE 12 DISABLED TESTS

make[3]: Leaving directory `/mesos/build'
make[3]: *** [CMakeFiles/check] Error 1
make[2]: *** [CMakeFiles/check.dir/all] Error 2
make[2]: Leaving directory `/mesos/build'
make[1]: *** [CMakeFiles/check.dir/rule] Error 2
make[1]: Leaving directory `/mesos/build'
make: *** [check] Error 2
+ docker rmi mesos-1490737404-26527
Untagged: mesos-1490737404-26527:latest
Deleted: sha256:0237a8c8e86ac7ceaa4b9151600ba8c3701aa70c9175612bceb7cf09ba1d3105
Deleted: sha256:02ec4c8efa271ca3c0cf2853290a716647c0b59ff3b0b3b117c8394bd1ada83f
Deleted: sha256:e724dfbfc6607bc5211b051667820212beb438563c2b804dce64e3fd0748f6ff
Deleted: sha256:d111287e6ca4c88cf9013fafc210db7ddc2de599092bdb4c03ce06d9fc081959
Deleted: sha256:2defe2e1a83679471e46fc56055d86ea7cde5cb8b7d072f455a806ffe6ebdd59
Deleted: sha256:2493fba2ab24a44aa129513b99e2caa8dac31a6cfaad2ee2eb9df964ac022127
Deleted: sha256:375d0b8959ee4c6ebac3ef19d4566972af2835bab9fb71da6b0eaf3e18fd7391
Deleted: sha256:b8297e617d5b24f01563017a4940455f1d2f1c4199fd701b1934b5d178174eff
Deleted: sha256:aaf53d0d4a68e1287e690f738fd56fc50f2570db5e46192a64069f808e904b1a
Deleted: sha256:a03e550f15337308e65db0850bf30bb277f21f4fd1a27f24e364e9f4db3336e6
Deleted: sha256:17f1ead614179653054227753fcef68f18cf732f2c8a292b8595a4365d9330b1
Deleted: sha256:26aa6ce8aaf9bf8e5a320d7be4f622b540c8ea9987012205a72605087b8b0e7f
Deleted: sha256:2d422d0b91f677ba3da870449ffae2161e35c5b8c5d027a187d9d68b5dbfa291
Deleted: sha256:505e972c8ebd415376252537fd2190189ae8fb5ae73b299c672ebfcd7f6ef5af
Deleted: sha256:f65ddb0f5962e28a154f9ce66662d5e9aae65064bc0dd8bb9b6ac22325d14d00
Deleted: sha256:fafb0ac27dc61ea27a1a7aadf5b11493f54d0377cdef6d2c73fc84e32a2d7bf5
Deleted: sha256:f610799dc4cd03bb6f0fff46e2638576dc8f8cafab751a0e50c2ebb952a4fc07
Deleted: sha256:fa27ed142c4b1bcc657c10765f209652a80eccb0fa638c8654b65bfffe6f08c7
Deleted: sha256:f245b86169cf50e663086241f8dbb464ae6af6896fef2b37cfb227a48c15aeb8
Deleted: sha256:b1b75eeda4c383b2085441d1c4f4c945dce5899e6a2bf59867e5c23237943bd1
Deleted: sha256:edef467255d9f691ff79ff7dc98aae60f33c018aee844d0d418c96df72176a07
Deleted: sha256:fd5a4347307a128683d1aed748ee611dea8caf9023ddde522e31559dd2eb51d3
Deleted: sha256:8d7cbc5f5219e5883d700796299392cda1145c5a9d87413f36bf680d5ecd8932
Deleted: sha256:8ced6aee4171beec98ac86c87ab4678685154a7abc63b3cc360115585549322a
Build step 'Execute shell' marked build as failure

Mime
View raw message