mesos-builds mailing list archives

Site index · List index
Message view « Date » · « Thread »
Top « Date » · « Thread »
From Vinod Kone <vinodk...@apache.org>
Subject Re: Build failed in Jenkins: Mesos-Buildbot » cmake,gcc,--verbose --enable-libevent --enable-ssl,GLOG_v=1 MESOS_VERBOSE=1,ubuntu:14.04,(docker||Hadoop)&&(!ubuntu-us1)&&(!ubuntu-eu2) #3278
Date Fri, 17 Feb 2017 23:23:09 GMT
joseph?

On Fri, Feb 17, 2017 at 1:24 PM, Apache Jenkins Server <
jenkins@builds.apache.org> wrote:

> See <https://builds.apache.org/job/Mesos-Buildbot/BUILDTOOL=
> cmake,COMPILER=gcc,CONFIGURATION=--verbose%20--enable-libevent%20--enable-
> ssl,ENVIRONMENT=GLOG_v=1%20MESOS_VERBOSE=1,OS=ubuntu%
> 3A14.04,label_exp=(docker%7C%7CHadoop)&&(!ubuntu-us1)&&(!
> ubuntu-eu2)/3278/changes>
>
> Changes:
>
> [vinodkone] Added the 'Secret' protobuf message.
>
> [vinodkone] Added a 'SECRET' type to the 'Environment' protobuf message.
>
> [vinodkone] Removed redundant 'Times(1)' from master validation tests.
>
> [vinodkone] Removed all instances of '.Times(1)' from Mesos tests.
>
> [vinodkone] Removed all instances of '.Times(1)' from libprocess tests.
>
> ------------------------------------------
> [...truncated 179084 lines...]
> I0217 21:23:51.608100 27162 status_update_manager.cpp:177] Pausing sending
> status updates
> I0217 21:23:51.608412 27169 state.cpp:62] Recovering state from
> '/tmp/Endpoint_SlaveEndpointTest_AuthorizedRequest_1_T6sHE0/meta'
> I0217 21:23:51.608608 27158 status_update_manager.cpp:203] Recovering
> status update manager
> I0217 21:23:51.608770 27168 containerizer.cpp:599] Recovering containerizer
> I0217 21:23:51.609272 27160 provisioner.cpp:410] Provisioner recovery
> complete
> I0217 21:23:51.609494 27161 slave.cpp:5555] Finished recovery
> I0217 21:23:51.609840 27161 slave.cpp:5729] Querying resource estimator
> for oversubscribable resources
> I0217 21:23:51.609947 27173 slave.cpp:5743] Received oversubscribable
> resources {} from the resource estimator
> I0217 21:23:51.610651 27168 process.cpp:3704] Handling HTTP event for
> process 'slave(693)' with path: '/slave(693)/monitor/statistics.json'
> I0217 21:23:51.611034 27161 http.cpp:871] Authorizing principal
> 'test-principal' to GET the '/monitor/statistics.json' endpoint
> I0217 21:23:51.612053 27165 slave.cpp:803] Agent terminating
> [       OK ] Endpoint/SlaveEndpointTest.AuthorizedRequest/1 (56 ms)
> [ RUN      ] Endpoint/SlaveEndpointTest.AuthorizedRequest/2
> I0217 21:23:51.661541 27157 containerizer.cpp:220] Using isolation:
> posix/cpu,posix/mem,filesystem/posix,network/cni
> W0217 21:23:51.661875 27157 backend.cpp:76] Failed to create 'aufs'
> backend: AufsBackend requires root privileges
> W0217 21:23:51.661912 27157 backend.cpp:76] Failed to create 'bind'
> backend: BindBackend requires root privileges
> I0217 21:23:51.661967 27157 provisioner.cpp:249] Using default backend
> 'copy'
> I0217 21:23:51.662900 27166 slave.cpp:211] Mesos agent started on (694)@
> 172.17.0.2:45180
> I0217 21:23:51.662930 27166 slave.cpp:212] Flags at startup: --acls=""
> --appc_simple_discovery_uri_prefix="http://" --appc_store_dir="/tmp/mesos/store/appc"
> --authenticate_http_readonly="true" --authenticate_http_readwrite="true"
> --authenticatee="crammd5" --authentication_backoff_factor="1secs"
> --authorizer="local" --cgroups_cpu_enable_pids_and_tids_count="false"
> --cgroups_enable_cfs="false" --cgroups_hierarchy="/sys/fs/cgroup"
> --cgroups_limit_swap="false" --cgroups_root="mesos" --container_disk_watch_interval="15secs"
> --containerizers="mesos" --credential="/tmp/Endpoint_SlaveEndpointTest_
> AuthorizedRequest_2_kZVgWd/credential" --default_role="*"
> --disk_watch_interval="1mins" --docker="docker"
> --docker_kill_orphans="true" --docker_registry="https://
> registry-1.docker.io" --docker_remove_delay="6hrs"
> --docker_socket="/var/run/docker.sock" --docker_stop_timeout="0ns"
> --docker_store_dir="/tmp/mesos/store/docker" --docker_volume_checkpoint_
> dir="/var/run/mesos/isolators/docker/volume" --enforce_container_disk_quota="false"
> --executor_registration_timeout="1mins" --executor_shutdown_grace_period="5secs"
> --fetcher_cache_dir="/tmp/Endpoint_SlaveEndpointTest_
> AuthorizedRequest_2_kZVgWd/fetch" --fetcher_cache_size="2GB"
> --frameworks_home="" --gc_delay="1weeks" --gc_disk_headroom="0.1"
> --hadoop_home="" --help="false" --hostname_lookup="true"
> --http_authenticators="basic" --http_command_executor="false"
> --http_credentials="/tmp/Endpoint_SlaveEndpointTest_
> AuthorizedRequest_2_kZVgWd/http_credentials" --http_heartbeat_interval="30secs"
> --initialize_driver_logging="true" --isolation="posix/cpu,posix/mem"
> --launcher="posix" --launcher_dir="/mesos/build/src" --logbufsecs="0"
> --logging_level="INFO" --max_completed_executors_per_framework="150"
> --oversubscribed_resources_interval="15secs" --perf_duration="10secs"
> --perf_interval="1mins" --qos_correction_interval_min="0ns"
> --quiet="false" --recover="reconnect" --recovery_timeout="15mins"
> --registration_backoff_factor="10ms" --resources="cpus:2;gpus:0;
> mem:1024;disk:1024;ports:[31000-32000]" --revocable_cpu_low_priority="true"
> --runtime_dir="/tmp/Endpoint_SlaveEndpointTest_AuthorizedRequest_2_kZVgWd"
> --sandbox_directory="/mnt/mesos/sandbox" --strict="true"
> --switch_user="true" --systemd_enable_support="true"
> --systemd_runtime_directory="/run/systemd/system" --version="false"
> --work_dir="/tmp/Endpoint_SlaveEndpointTest_AuthorizedRequest_2_rOqE1z"
> I0217 21:23:51.663211 27166 credentials.hpp:86] Loading credential for
> authentication from '/tmp/Endpoint_SlaveEndpointTest_
> AuthorizedRequest_2_kZVgWd/credential'
> I0217 21:23:51.663278 27166 slave.cpp:354] Agent using credential for:
> test-principal
> I0217 21:23:51.663291 27166 credentials.hpp:37] Loading credentials for
> authentication from '/tmp/Endpoint_SlaveEndpointTest_
> AuthorizedRequest_2_kZVgWd/http_credentials'
> I0217 21:23:51.663367 27166 http.cpp:919] Using default 'basic' HTTP
> authenticator for realm 'mesos-agent-readonly'
> I0217 21:23:51.663405 27166 http.cpp:919] Using default 'basic' HTTP
> authenticator for realm 'mesos-agent-readwrite'
> I0217 21:23:51.663808 27166 slave.cpp:541] Agent resources: cpus(*):2;
> mem(*):1024; disk(*):1024; ports(*):[31000-32000]
> I0217 21:23:51.663842 27166 slave.cpp:549] Agent attributes: [  ]
> I0217 21:23:51.663851 27166 slave.cpp:554] Agent hostname: 96fd44d6ddb2
> I0217 21:23:51.663914 27159 status_update_manager.cpp:177] Pausing sending
> status updates
> I0217 21:23:51.664265 27168 state.cpp:62] Recovering state from
> '/tmp/Endpoint_SlaveEndpointTest_AuthorizedRequest_2_rOqE1z/meta'
> I0217 21:23:51.664446 27172 status_update_manager.cpp:203] Recovering
> status update manager
> I0217 21:23:51.664543 27162 containerizer.cpp:599] Recovering containerizer
> I0217 21:23:51.665124 27160 provisioner.cpp:410] Provisioner recovery
> complete
> I0217 21:23:51.665321 27158 slave.cpp:5555] Finished recovery
> I0217 21:23:51.665760 27158 slave.cpp:5729] Querying resource estimator
> for oversubscribable resources
> I0217 21:23:51.665860 27169 slave.cpp:5743] Received oversubscribable
> resources {} from the resource estimator
> I0217 21:23:51.666546 27169 process.cpp:3704] Handling HTTP event for
> process 'slave(694)' with path: '/slave(694)/containers'
> I0217 21:23:51.666963 27159 http.cpp:871] Authorizing principal
> 'test-principal' to GET the '/containers' endpoint
> I0217 21:23:51.668365 27159 slave.cpp:803] Agent terminating
> [       OK ] Endpoint/SlaveEndpointTest.AuthorizedRequest/2 (35 ms)
> [ RUN      ] Endpoint/SlaveEndpointTest.UnauthorizedRequest/0
> I0217 21:23:51.697213 27157 containerizer.cpp:220] Using isolation:
> posix/cpu,posix/mem,filesystem/posix,network/cni
> W0217 21:23:51.697459 27157 backend.cpp:76] Failed to create 'aufs'
> backend: AufsBackend requires root privileges
> W0217 21:23:51.697500 27157 backend.cpp:76] Failed to create 'bind'
> backend: BindBackend requires root privileges
> I0217 21:23:51.697520 27157 provisioner.cpp:249] Using default backend
> 'copy'
> I0217 21:23:51.698375 27159 slave.cpp:211] Mesos agent started on (695)@
> 172.17.0.2:45180
> I0217 21:23:51.698393 27159 slave.cpp:212] Flags at startup: --acls=""
> --appc_simple_discovery_uri_prefix="http://" --appc_store_dir="/tmp/mesos/store/appc"
> --authenticate_http_readonly="true" --authenticate_http_readwrite="true"
> --authenticatee="crammd5" --authentication_backoff_factor="1secs"
> --authorizer="local" --cgroups_cpu_enable_pids_and_tids_count="false"
> --cgroups_enable_cfs="false" --cgroups_hierarchy="/sys/fs/cgroup"
> --cgroups_limit_swap="false" --cgroups_root="mesos" --container_disk_watch_interval="15secs"
> --containerizers="mesos" --credential="/tmp/Endpoint_SlaveEndpointTest_
> UnauthorizedRequest_0_Uu50SN/credential" --default_role="*"
> --disk_watch_interval="1mins" --docker="docker"
> --docker_kill_orphans="true" --docker_registry="https://
> registry-1.docker.io" --docker_remove_delay="6hrs"
> --docker_socket="/var/run/docker.sock" --docker_stop_timeout="0ns"
> --docker_store_dir="/tmp/mesos/store/docker" --docker_volume_checkpoint_
> dir="/var/run/mesos/isolators/docker/volume" --enforce_container_disk_quota="false"
> --executor_registration_timeout="1mins" --executor_shutdown_grace_period="5secs"
> --fetcher_cache_dir="/tmp/Endpoint_SlaveEndpointTest_
> UnauthorizedRequest_0_Uu50SN/fetch" --fetcher_cache_size="2GB"
> --frameworks_home="" --gc_delay="1weeks" --gc_disk_headroom="0.1"
> --hadoop_home="" --help="false" --hostname_lookup="true"
> --http_authenticators="basic" --http_command_executor="false"
> --http_credentials="/tmp/Endpoint_SlaveEndpointTest_
> UnauthorizedRequest_0_Uu50SN/http_credentials" --http_heartbeat_interval="30secs"
> --initialize_driver_logging="true" --isolation="posix/cpu,posix/mem"
> --launcher="posix" --launcher_dir="/mesos/build/src" --logbufsecs="0"
> --logging_level="INFO" --max_completed_executors_per_framework="150"
> --oversubscribed_resources_interval="15secs" --perf_duration="10secs"
> --perf_interval="1mins" --qos_correction_interval_min="0ns"
> --quiet="false" --recover="reconnect" --recovery_timeout="15mins"
> --registration_backoff_factor="10ms" --resources="cpus:2;gpus:0;
> mem:1024;disk:1024;ports:[31000-32000]" --revocable_cpu_low_priority="true"
> --runtime_dir="/tmp/Endpoint_SlaveEndpointTest_UnauthorizedRequest_0_Uu50SN"
> --sandbox_directory="/mnt/mesos/sandbox" --strict="true"
> --switch_user="true" --systemd_enable_support="true"
> --systemd_runtime_directory="/run/systemd/system" --version="false"
> --work_dir="/tmp/Endpoint_SlaveEndpointTest_UnauthorizedRequest_0_J65xS9"
> I0217 21:23:51.698632 27159 credentials.hpp:86] Loading credential for
> authentication from '/tmp/Endpoint_SlaveEndpointTest_
> UnauthorizedRequest_0_Uu50SN/credential'
> I0217 21:23:51.698699 27159 slave.cpp:354] Agent using credential for:
> test-principal
> I0217 21:23:51.698711 27159 credentials.hpp:37] Loading credentials for
> authentication from '/tmp/Endpoint_SlaveEndpointTest_
> UnauthorizedRequest_0_Uu50SN/http_credentials'
> I0217 21:23:51.698788 27159 http.cpp:919] Using default 'basic' HTTP
> authenticator for realm 'mesos-agent-readonly'
> I0217 21:23:51.698828 27159 http.cpp:919] Using default 'basic' HTTP
> authenticator for realm 'mesos-agent-readwrite'
> I0217 21:23:51.699170 27159 slave.cpp:541] Agent resources: cpus(*):2;
> mem(*):1024; disk(*):1024; ports(*):[31000-32000]
> I0217 21:23:51.699201 27159 slave.cpp:549] Agent attributes: [  ]
> I0217 21:23:51.699206 27159 slave.cpp:554] Agent hostname: 96fd44d6ddb2
> I0217 21:23:51.699265 27173 status_update_manager.cpp:177] Pausing sending
> status updates
> I0217 21:23:51.699563 27173 state.cpp:62] Recovering state from
> '/tmp/Endpoint_SlaveEndpointTest_UnauthorizedRequest_0_J65xS9/meta'
> I0217 21:23:51.699848 27173 status_update_manager.cpp:203] Recovering
> status update manager
> I0217 21:23:51.699942 27158 containerizer.cpp:599] Recovering containerizer
> I0217 21:23:51.700688 27169 provisioner.cpp:410] Provisioner recovery
> complete
> I0217 21:23:51.700856 27168 slave.cpp:5555] Finished recovery
> I0217 21:23:51.701175 27168 slave.cpp:5729] Querying resource estimator
> for oversubscribable resources
> I0217 21:23:51.701251 27159 slave.cpp:5743] Received oversubscribable
> resources {} from the resource estimator
> I0217 21:23:51.702049 27169 process.cpp:3704] Handling HTTP event for
> process 'slave(695)' with path: '/slave(695)/monitor/statistics'
> I0217 21:23:51.702412 27160 http.cpp:871] Authorizing principal
> 'test-principal' to GET the '/monitor/statistics' endpoint
> I0217 21:23:51.703378 27162 slave.cpp:803] Agent terminating
> [       OK ] Endpoint/SlaveEndpointTest.UnauthorizedRequest/0 (10 ms)
> [ RUN      ] Endpoint/SlaveEndpointTest.UnauthorizedRequest/1
> I0217 21:23:51.714581 27157 containerizer.cpp:220] Using isolation:
> posix/cpu,posix/mem,filesystem/posix,network/cni
> W0217 21:23:51.714948 27157 backend.cpp:76] Failed to create 'aufs'
> backend: AufsBackend requires root privileges
> W0217 21:23:51.714998 27157 backend.cpp:76] Failed to create 'bind'
> backend: BindBackend requires root privileges
> I0217 21:23:51.715019 27157 provisioner.cpp:249] Using default backend
> 'copy'
> I0217 21:23:51.716120 27160 slave.cpp:211] Mesos agent started on (696)@
> 172.17.0.2:45180
> I0217 21:23:51.716277 27160 slave.cpp:212] Flags at startup: --acls=""
> --appc_simple_discovery_uri_prefix="http://" --appc_store_dir="/tmp/mesos/store/appc"
> --authenticate_http_readonly="true" --authenticate_http_readwrite="true"
> --authenticatee="crammd5" --authentication_backoff_factor="1secs"
> --authorizer="local" --cgroups_cpu_enable_pids_and_tids_count="false"
> --cgroups_enable_cfs="false" --cgroups_hierarchy="/sys/fs/cgroup"
> --cgroups_limit_swap="false" --cgroups_root="mesos" --container_disk_watch_interval="15secs"
> --containerizers="mesos" --credential="/tmp/Endpoint_SlaveEndpointTest_
> UnauthorizedRequest_1_OX6S3n/credential" --default_role="*"
> --disk_watch_interval="1mins" --docker="docker"
> --docker_kill_orphans="true" --docker_registry="https://
> registry-1.docker.io" --docker_remove_delay="6hrs"
> --docker_socket="/var/run/docker.sock" --docker_stop_timeout="0ns"
> --docker_store_dir="/tmp/mesos/store/docker" --docker_volume_checkpoint_
> dir="/var/run/mesos/isolators/docker/volume" --enforce_container_disk_quota="false"
> --executor_registration_timeout="1mins" --executor_shutdown_grace_period="5secs"
> --fetcher_cache_dir="/tmp/Endpoint_SlaveEndpointTest_
> UnauthorizedRequest_1_OX6S3n/fetch" --fetcher_cache_size="2GB"
> --frameworks_home="" --gc_delay="1weeks" --gc_disk_headroom="0.1"
> --hadoop_home="" --help="false" --hostname_lookup="true"
> --http_authenticators="basic" --http_command_executor="false"
> --http_credentials="/tmp/Endpoint_SlaveEndpointTest_
> UnauthorizedRequest_1_OX6S3n/http_credentials" --http_heartbeat_interval="30secs"
> --initialize_driver_logging="true" --isolation="posix/cpu,posix/mem"
> --launcher="posix" --launcher_dir="/mesos/build/src" --logbufsecs="0"
> --logging_level="INFO" --max_completed_executors_per_framework="150"
> --oversubscribed_resources_interval="15secs" --perf_duration="10secs"
> --perf_interval="1mins" --qos_correction_interval_min="0ns"
> --quiet="false" --recover="reconnect" --recovery_timeout="15mins"
> --registration_backoff_factor="10ms" --resources="cpus:2;gpus:0;
> mem:1024;disk:1024;ports:[31000-32000]" --revocable_cpu_low_priority="true"
> --runtime_dir="/tmp/Endpoint_SlaveEndpointTest_UnauthorizedRequest_1_OX6S3n"
> --sandbox_directory="/mnt/mesos/sandbox" --strict="true"
> --switch_user="true" --systemd_enable_support="true"
> --systemd_runtime_directory="/run/systemd/system" --version="false"
> --work_dir="/tmp/Endpoint_SlaveEndpointTest_UnauthorizedRequest_1_blgD0J"
> I0217 21:23:51.716848 27160 credentials.hpp:86] Loading credential for
> authentication from '/tmp/Endpoint_SlaveEndpointTest_
> UnauthorizedRequest_1_OX6S3n/credential'
> I0217 21:23:51.728404 27160 slave.cpp:354] Agent using credential for:
> test-principal
> I0217 21:23:51.728430 27160 credentials.hpp:37] Loading credentials for
> authentication from '/tmp/Endpoint_SlaveEndpointTest_
> UnauthorizedRequest_1_OX6S3n/http_credentials'
> I0217 21:23:51.728565 27160 http.cpp:919] Using default 'basic' HTTP
> authenticator for realm 'mesos-agent-readonly'
> I0217 21:23:51.728648 27160 http.cpp:919] Using default 'basic' HTTP
> authenticator for realm 'mesos-agent-readwrite'
> I0217 21:23:51.729086 27160 slave.cpp:541] Agent resources: cpus(*):2;
> mem(*):1024; disk(*):1024; ports(*):[31000-32000]
> I0217 21:23:51.729130 27160 slave.cpp:549] Agent attributes: [  ]
> I0217 21:23:51.729140 27160 slave.cpp:554] Agent hostname: 96fd44d6ddb2
> I0217 21:23:51.729214 27173 status_update_manager.cpp:177] Pausing sending
> status updates
> I0217 21:23:51.729563 27161 state.cpp:62] Recovering state from
> '/tmp/Endpoint_SlaveEndpointTest_UnauthorizedRequest_1_blgD0J/meta'
> I0217 21:23:51.729714 27173 status_update_manager.cpp:203] Recovering
> status update manager
> I0217 21:23:51.729908 27173 containerizer.cpp:599] Recovering containerizer
> I0217 21:23:51.730532 27165 provisioner.cpp:410] Provisioner recovery
> complete
> I0217 21:23:51.730732 27171 slave.cpp:5555] Finished recovery
> I0217 21:23:51.731181 27171 slave.cpp:5729] Querying resource estimator
> for oversubscribable resources
> I0217 21:23:51.735787 27166 slave.cpp:5743] Received oversubscribable
> resources {} from the resource estimator
> I0217 21:23:51.736635 27163 process.cpp:3704] Handling HTTP event for
> process 'slave(696)' with path: '/slave(696)/monitor/statistics.json'
> I0217 21:23:51.737076 27171 http.cpp:871] Authorizing principal
> 'test-principal' to GET the '/monitor/statistics.json' endpoint
> I0217 21:23:51.738108 27157 slave.cpp:803] Agent terminating
> [       OK ] Endpoint/SlaveEndpointTest.UnauthorizedRequest/1 (28 ms)
> [ RUN      ] Endpoint/SlaveEndpointTest.UnauthorizedRequest/2
> I0217 21:23:51.765947 27157 containerizer.cpp:220] Using isolation:
> posix/cpu,posix/mem,filesystem/posix,network/cni
> W0217 21:23:51.766317 27157 backend.cpp:76] Failed to create 'aufs'
> backend: AufsBackend requires root privileges
> W0217 21:23:51.766366 27157 backend.cpp:76] Failed to create 'bind'
> backend: BindBackend requires root privileges
> I0217 21:23:51.766384 27157 provisioner.cpp:249] Using default backend
> 'copy'
> I0217 21:23:51.767961 27164 slave.cpp:211] Mesos agent started on (697)@
> 172.17.0.2:45180
> I0217 21:23:51.768019 27164 slave.cpp:212] Flags at startup: --acls=""
> --appc_simple_discovery_uri_prefix="http://" --appc_store_dir="/tmp/mesos/store/appc"
> --authenticate_http_readonly="true" --authenticate_http_readwrite="true"
> --authenticatee="crammd5" --authentication_backoff_factor="1secs"
> --authorizer="local" --cgroups_cpu_enable_pids_and_tids_count="false"
> --cgroups_enable_cfs="false" --cgroups_hierarchy="/sys/fs/cgroup"
> --cgroups_limit_swap="false" --cgroups_root="mesos" --container_disk_watch_interval="15secs"
> --containerizers="mesos" --credential="/tmp/Endpoint_SlaveEndpointTest_
> UnauthorizedRequest_2_sGbnIY/credential" --default_role="*"
> --disk_watch_interval="1mins" --docker="docker"
> --docker_kill_orphans="true" --docker_registry="https://
> registry-1.docker.io" --docker_remove_delay="6hrs"
> --docker_socket="/var/run/docker.sock" --docker_stop_timeout="0ns"
> --docker_store_dir="/tmp/mesos/store/docker" --docker_volume_checkpoint_
> dir="/var/run/mesos/isolators/docker/volume" --enforce_container_disk_quota="false"
> --executor_registration_timeout="1mins" --executor_shutdown_grace_period="5secs"
> --fetcher_cache_dir="/tmp/Endpoint_SlaveEndpointTest_
> UnauthorizedRequest_2_sGbnIY/fetch" --fetcher_cache_size="2GB"
> --frameworks_home="" --gc_delay="1weeks" --gc_disk_headroom="0.1"
> --hadoop_home="" --help="false" --hostname_lookup="true"
> --http_authenticators="basic" --http_command_executor="false"
> --http_credentials="/tmp/Endpoint_SlaveEndpointTest_
> UnauthorizedRequest_2_sGbnIY/http_credentials" --http_heartbeat_interval="30secs"
> --initialize_driver_logging="true" --isolation="posix/cpu,posix/mem"
> --launcher="posix" --launcher_dir="/mesos/build/src" --logbufsecs="0"
> --logging_level="INFO" --max_completed_executors_per_framework="150"
> --oversubscribed_resources_interval="15secs" --perf_duration="10secs"
> --perf_interval="1mins" --qos_correction_interval_min="0ns"
> --quiet="false" --recover="reconnect" --recovery_timeout="15mins"
> --registration_backoff_factor="10ms" --resources="cpus:2;gpus:0;
> mem:1024;disk:1024;ports:[31000-32000]" --revocable_cpu_low_priority="true"
> --runtime_dir="/tmp/Endpoint_SlaveEndpointTest_UnauthorizedRequest_2_sGbnIY"
> --sandbox_directory="/mnt/mesos/sandbox" --strict="true"
> --switch_user="true" --systemd_enable_support="true"
> --systemd_runtime_directory="/run/systemd/system" --version="false"
> --work_dir="/tmp/Endpoint_SlaveEndpointTest_UnauthorizedRequest_2_5giQwk"
> I0217 21:23:51.768497 27164 credentials.hpp:86] Loading credential for
> authentication from '/tmp/Endpoint_SlaveEndpointTest_
> UnauthorizedRequest_2_sGbnIY/credential'
> I0217 21:23:51.768631 27164 slave.cpp:354] Agent using credential for:
> test-principal
> I0217 21:23:51.768646 27164 credentials.hpp:37] Loading credentials for
> authentication from '/tmp/Endpoint_SlaveEndpointTest_
> UnauthorizedRequest_2_sGbnIY/http_credentials'
> I0217 21:23:51.768765 27164 http.cpp:919] Using default 'basic' HTTP
> authenticator for realm 'mesos-agent-readonly'
> I0217 21:23:51.768826 27164 http.cpp:919] Using default 'basic' HTTP
> authenticator for realm 'mesos-agent-readwrite'
> I0217 21:23:51.769222 27164 slave.cpp:541] Agent resources: cpus(*):2;
> mem(*):1024; disk(*):1024; ports(*):[31000-32000]
> I0217 21:23:51.769258 27164 slave.cpp:549] Agent attributes: [  ]
> I0217 21:23:51.769269 27164 slave.cpp:554] Agent hostname: 96fd44d6ddb2
> I0217 21:23:51.769361 27161 status_update_manager.cpp:177] Pausing sending
> status updates
> I0217 21:23:51.769744 27158 state.cpp:62] Recovering state from
> '/tmp/Endpoint_SlaveEndpointTest_UnauthorizedRequest_2_5giQwk/meta'
> I0217 21:23:51.769958 27158 status_update_manager.cpp:203] Recovering
> status update manager
> I0217 21:23:51.770103 27163 containerizer.cpp:599] Recovering containerizer
> I0217 21:23:51.770594 27163 provisioner.cpp:410] Provisioner recovery
> complete
> I0217 21:23:51.770843 27173 slave.cpp:5555] Finished recovery
> I0217 21:23:51.771317 27173 slave.cpp:5729] Querying resource estimator
> for oversubscribable resources
> I0217 21:23:51.771514 27169 slave.cpp:5743] Received oversubscribable
> resources {} from the resource estimator
> I0217 21:23:51.772971 27166 process.cpp:3704] Handling HTTP event for
> process 'slave(697)' with path: '/slave(697)/containers'
> I0217 21:23:51.773530 27160 http.cpp:871] Authorizing principal
> 'test-principal' to GET the '/containers' endpoint
> I0217 21:23:51.775970 27171 slave.cpp:803] Agent terminating
> [       OK ] Endpoint/SlaveEndpointTest.UnauthorizedRequest/2 (18 ms)
> [ RUN      ] Endpoint/SlaveEndpointTest.NoAuthorizer/0
> I0217 21:23:51.789280 27157 containerizer.cpp:220] Using isolation:
> posix/cpu,posix/mem,filesystem/posix,network/cni
> W0217 21:23:51.789623 27157 backend.cpp:76] Failed to create 'aufs'
> backend: AufsBackend requires root privileges
> W0217 21:23:51.789666 27157 backend.cpp:76] Failed to create 'bind'
> backend: BindBackend requires root privileges
> I0217 21:23:51.789681 27157 provisioner.cpp:249] Using default backend
> 'copy'
> I0217 21:23:51.790212 27157 cluster.cpp:446] Creating default 'local'
> authorizer
> I0217 21:23:51.790870 27165 slave.cpp:211] Mesos agent started on (698)@
> 172.17.0.2:45180
> I0217 21:23:51.790896 27165 slave.cpp:212] Flags at startup: --acls=""
> --appc_simple_discovery_uri_prefix="http://" --appc_store_dir="/tmp/mesos/store/appc"
> --authenticate_http_readonly="true" --authenticate_http_readwrite="true"
> --authenticatee="crammd5" --authentication_backoff_factor="1secs"
> --authorizer="local" --cgroups_cpu_enable_pids_and_tids_count="false"
> --cgroups_enable_cfs="false" --cgroups_hierarchy="/sys/fs/cgroup"
> --cgroups_limit_swap="false" --cgroups_root="mesos" --container_disk_watch_interval="15secs"
> --containerizers="mesos" --credential="/tmp/Endpoint_SlaveEndpointTest_
> NoAuthorizer_0_q5DOEz/credential" --default_role="*"
> --disk_watch_interval="1mins" --docker="docker"
> --docker_kill_orphans="true" --docker_registry="https://
> registry-1.docker.io" --docker_remove_delay="6hrs"
> --docker_socket="/var/run/docker.sock" --docker_stop_timeout="0ns"
> --docker_store_dir="/tmp/mesos/store/docker" --docker_volume_checkpoint_
> dir="/var/run/mesos/isolators/docker/volume" --enforce_container_disk_quota="false"
> --executor_registration_timeout="1mins" --executor_shutdown_grace_period="5secs"
> --fetcher_cache_dir="/tmp/Endpoint_SlaveEndpointTest_NoAuthorizer_0_q5DOEz/fetch"
> --fetcher_cache_size="2GB" --frameworks_home="" --gc_delay="1weeks"
> --gc_disk_headroom="0.1" --hadoop_home="" --help="false"
> --hostname_lookup="true" --http_authenticators="basic"
> --http_command_executor="false" --http_credentials="/tmp/
> Endpoint_SlaveEndpointTest_NoAuthorizer_0_q5DOEz/http_credentials"
> --http_heartbeat_interval="30secs" --initialize_driver_logging="true"
> --isolation="posix/cpu,posix/mem" --launcher="posix"
> --launcher_dir="/mesos/build/src" --logbufsecs="0" --logging_level="INFO"
> --max_completed_executors_per_framework="150" --oversubscribed_resources_interval="15secs"
> --perf_duration="10secs" --perf_interval="1mins"
> --qos_correction_interval_min="0ns" --quiet="false" --recover="reconnect"
> --recovery_timeout="15mins" --registration_backoff_factor="10ms"
> --resources="cpus:2;gpus:0;mem:1024;disk:1024;ports:[31000-32000]"
> --revocable_cpu_low_priority="true" --runtime_dir="/tmp/Endpoint_
> SlaveEndpointTest_NoAuthorizer_0_q5DOEz" --sandbox_directory="/mnt/mesos/sandbox"
> --strict="true" --switch_user="true" --systemd_enable_support="true"
> --systemd_runtime_directory="/run/systemd/system" --version="false"
> --work_dir="/tmp/Endpoint_SlaveEndpointTest_NoAuthorizer_0_LnXtpV"
> I0217 21:23:51.791232 27165 credentials.hpp:86] Loading credential for
> authentication from '/tmp/Endpoint_SlaveEndpointTest_
> NoAuthorizer_0_q5DOEz/credential'
> I0217 21:23:51.791329 27165 slave.cpp:354] Agent using credential for:
> test-principal
> I0217 21:23:51.791342 27165 credentials.hpp:37] Loading credentials for
> authentication from '/tmp/Endpoint_SlaveEndpointTest_
> NoAuthorizer_0_q5DOEz/http_credentials'
> I0217 21:23:51.791431 27165 http.cpp:919] Using default 'basic' HTTP
> authenticator for realm 'mesos-agent-readonly'
> I0217 21:23:51.791491 27165 http.cpp:919] Using default 'basic' HTTP
> authenticator for realm 'mesos-agent-readwrite'
> I0217 21:23:51.792016 27165 slave.cpp:541] Agent resources: cpus(*):2;
> mem(*):1024; disk(*):1024; ports(*):[31000-32000]
> I0217 21:23:51.792052 27165 slave.cpp:549] Agent attributes: [  ]
> I0217 21:23:51.792058 27165 slave.cpp:554] Agent hostname: 96fd44d6ddb2
> I0217 21:23:51.792134 27166 status_update_manager.cpp:177] Pausing sending
> status updates
> I0217 21:23:51.792441 27158 state.cpp:62] Recovering state from
> '/tmp/Endpoint_SlaveEndpointTest_NoAuthorizer_0_LnXtpV/meta'
> I0217 21:23:51.792573 27160 status_update_manager.cpp:203] Recovering
> status update manager
> I0217 21:23:51.792671 27165 containerizer.cpp:599] Recovering containerizer
> I0217 21:23:51.793149 27166 provisioner.cpp:410] Provisioner recovery
> complete
> I0217 21:23:51.793303 27161 slave.cpp:5555] Finished recovery
> I0217 21:23:51.793645 27161 slave.cpp:5729] Querying resource estimator
> for oversubscribable resources
> I0217 21:23:51.793750 27172 slave.cpp:5743] Received oversubscribable
> resources {} from the resource estimator
> I0217 21:23:51.794531 27170 process.cpp:3704] Handling HTTP event for
> process 'slave(698)' with path: '/slave(698)/monitor/statistics'
> I0217 21:23:51.795042 27161 http.cpp:871] Authorizing principal
> 'test-principal' to GET the '/monitor/statistics' endpoint
> I0217 21:23:51.796733 27167 slave.cpp:803] Agent terminating
> [       OK ] Endpoint/SlaveEndpointTest.NoAuthorizer/0 (12 ms)
> [ RUN      ] Endpoint/SlaveEndpointTest.NoAuthorizer/1
> I0217 21:23:51.840709 27157 containerizer.cpp:220] Using isolation:
> posix/cpu,posix/mem,filesystem/posix,network/cni
> W0217 21:23:51.840977 27157 backend.cpp:76] Failed to create 'aufs'
> backend: AufsBackend requires root privileges
> W0217 21:23:51.841019 27157 backend.cpp:76] Failed to create 'bind'
> backend: BindBackend requires root privileges
> I0217 21:23:51.841037 27157 provisioner.cpp:249] Using default backend
> 'copy'
> I0217 21:23:51.841729 27157 cluster.cpp:446] Creating default 'local'
> authorizer
> I0217 21:23:51.842288 27170 slave.cpp:211] Mesos agent started on (699)@
> 172.17.0.2:45180
> I0217 21:23:51.842306 27170 slave.cpp:212] Flags at startup: --acls=""
> --appc_simple_discovery_uri_prefix="http://" --appc_store_dir="/tmp/mesos/store/appc"
> --authenticate_http_readonly="true" --authenticate_http_readwrite="true"
> --authenticatee="crammd5" --authentication_backoff_factor="1secs"
> --authorizer="local" --cgroups_cpu_enable_pids_and_tids_count="false"
> --cgroups_enable_cfs="false" --cgroups_hierarchy="/sys/fs/cgroup"
> --cgroups_limit_swap="false" --cgroups_root="mesos" --container_disk_watch_interval="15secs"
> --containerizers="mesos" --credential="/tmp/Endpoint_SlaveEndpointTest_
> NoAuthorizer_1_utw33a/credential" --default_role="*"
> --disk_watch_interval="1mins" --docker="docker"
> --docker_kill_orphans="true" --docker_registry="https://
> registry-1.docker.io" --docker_remove_delay="6hrs"
> --docker_socket="/var/run/docker.sock" --docker_stop_timeout="0ns"
> --docker_store_dir="/tmp/mesos/store/docker" --docker_volume_checkpoint_
> dir="/var/run/mesos/isolators/docker/volume" --enforce_container_disk_quota="false"
> --executor_registration_timeout="1mins" --executor_shutdown_grace_period="5secs"
> --fetcher_cache_dir="/tmp/Endpoint_SlaveEndpointTest_NoAuthorizer_1_utw33a/fetch"
> --fetcher_cache_size="2GB" --frameworks_home="" --gc_delay="1weeks"
> --gc_disk_headroom="0.1" --hadoop_home="" --help="false"
> --hostname_lookup="true" --http_authenticators="basic"
> --http_command_executor="false" --http_credentials="/tmp/
> Endpoint_SlaveEndpointTest_NoAuthorizer_1_utw33a/http_credentials"
> --http_heartbeat_interval="30secs" --initialize_driver_logging="true"
> --isolation="posix/cpu,posix/mem" --launcher="posix"
> --launcher_dir="/mesos/build/src" --logbufsecs="0" --logging_level="INFO"
> --max_completed_executors_per_framework="150" --oversubscribed_resources_interval="15secs"
> --perf_duration="10secs" --perf_interval="1mins"
> --qos_correction_interval_min="0ns" --quiet="false" --recover="reconnect"
> --recovery_timeout="15mins" --registration_backoff_factor="10ms"
> --resources="cpus:2;gpus:0;mem:1024;disk:1024;ports:[31000-32000]"
> --revocable_cpu_low_priority="true" --runtime_dir="/tmp/Endpoint_
> SlaveEndpointTest_NoAuthorizer_1_utw33a" --sandbox_directory="/mnt/mesos/sandbox"
> --strict="true" --switch_user="true" --systemd_enable_support="true"
> --systemd_runtime_directory="/run/systemd/system" --version="false"
> --work_dir="/tmp/Endpoint_SlaveEndpointTest_NoAuthorizer_1_J1ulGw"
> I0217 21:23:51.842607 27170 credentials.hpp:86] Loading credential for
> authentication from '/tmp/Endpoint_SlaveEndpointTest_
> NoAuthorizer_1_utw33a/credential'
> I0217 21:23:51.842696 27170 slave.cpp:354] Agent using credential for:
> test-principal
> I0217 21:23:51.842710 27170 credentials.hpp:37] Loading credentials for
> authentication from '/tmp/Endpoint_SlaveEndpointTest_
> NoAuthorizer_1_utw33a/http_credentials'
> I0217 21:23:51.842799 27170 http.cpp:919] Using default 'basic' HTTP
> authenticator for realm 'mesos-agent-readonly'
> I0217 21:23:51.842842 27170 http.cpp:919] Using default 'basic' HTTP
> authenticator for realm 'mesos-agent-readwrite'
> I0217 21:23:51.843235 27170 slave.cpp:541] Agent resources: cpus(*):2;
> mem(*):1024; disk(*):1024; ports(*):[31000-32000]
> I0217 21:23:51.843271 27170 slave.cpp:549] Agent attributes: [  ]
> I0217 21:23:51.843276 27170 slave.cpp:554] Agent hostname: 96fd44d6ddb2
> I0217 21:23:51.843331 27167 status_update_manager.cpp:177] Pausing sending
> status updates
> I0217 21:23:51.843700 27163 state.cpp:62] Recovering state from
> '/tmp/Endpoint_SlaveEndpointTest_NoAuthorizer_1_J1ulGw/meta'
> I0217 21:23:51.843961 27165 status_update_manager.cpp:203] Recovering
> status update manager
> I0217 21:23:51.844066 27168 containerizer.cpp:599] Recovering containerizer
> I0217 21:23:51.844589 27160 provisioner.cpp:410] Provisioner recovery
> complete
> I0217 21:23:51.844794 27167 slave.cpp:5555] Finished recovery
> I0217 21:23:51.845165 27167 slave.cpp:5729] Querying resource estimator
> for oversubscribable resources
> I0217 21:23:51.845291 27169 slave.cpp:5743] Received oversubscribable
> resources {} from the resource estimator
> I0217 21:23:51.846007 27168 process.cpp:3704] Handling HTTP event for
> process 'slave(699)' with path: '/slave(699)/monitor/statistics.json'
> I0217 21:23:51.846443 27167 http.cpp:871] Authorizing principal
> 'test-principal' to GET the '/monitor/statistics.json' endpoint
> I0217 21:23:51.847617 27170 slave.cpp:803] Agent terminating
> [       OK ] Endpoint/SlaveEndpointTest.NoAuthorizer/1 (11 ms)
> [ RUN      ] Endpoint/SlaveEndpointTest.NoAuthorizer/2
> I0217 21:23:51.896796 27157 containerizer.cpp:220] Using isolation:
> posix/cpu,posix/mem,filesystem/posix,network/cni
> W0217 21:23:51.897215 27157 backend.cpp:76] Failed to create 'aufs'
> backend: AufsBackend requires root privileges
> W0217 21:23:51.897279 27157 backend.cpp:76] Failed to create 'bind'
> backend: BindBackend requires root privileges
> I0217 21:23:51.897297 27157 provisioner.cpp:249] Using default backend
> 'copy'
> I0217 21:23:51.897951 27157 cluster.cpp:446] Creating default 'local'
> authorizer
> I0217 21:23:51.898691 27158 slave.cpp:211] Mesos agent started on (700)@
> 172.17.0.2:45180
> I0217 21:23:51.898717 27158 slave.cpp:212] Flags at startup: --acls=""
> --appc_simple_discovery_uri_prefix="http://" --appc_store_dir="/tmp/mesos/store/appc"
> --authenticate_http_readonly="true" --authenticate_http_readwrite="true"
> --authenticatee="crammd5" --authentication_backoff_factor="1secs"
> --authorizer="local" --cgroups_cpu_enable_pids_and_tids_count="false"
> --cgroups_enable_cfs="false" --cgroups_hierarchy="/sys/fs/cgroup"
> --cgroups_limit_swap="false" --cgroups_root="mesos" --container_disk_watch_interval="15secs"
> --containerizers="mesos" --credential="/tmp/Endpoint_SlaveEndpointTest_
> NoAuthorizer_2_wPqN2M/credential" --default_role="*"
> --disk_watch_interval="1mins" --docker="docker"
> --docker_kill_orphans="true" --docker_registry="https://
> registry-1.docker.io" --docker_remove_delay="6hrs"
> --docker_socket="/var/run/docker.sock" --docker_stop_timeout="0ns"
> --docker_store_dir="/tmp/mesos/store/docker" --docker_volume_checkpoint_
> dir="/var/run/mesos/isolators/docker/volume" --enforce_container_disk_quota="false"
> --executor_registration_timeout="1mins" --executor_shutdown_grace_period="5secs"
> --fetcher_cache_dir="/tmp/Endpoint_SlaveEndpointTest_NoAuthorizer_2_wPqN2M/fetch"
> --fetcher_cache_size="2GB" --frameworks_home="" --gc_delay="1weeks"
> --gc_disk_headroom="0.1" --hadoop_home="" --help="false"
> --hostname_lookup="true" --http_authenticators="basic"
> --http_command_executor="false" --http_credentials="/tmp/
> Endpoint_SlaveEndpointTest_NoAuthorizer_2_wPqN2M/http_credentials"
> --http_heartbeat_interval="30secs" --initialize_driver_logging="true"
> --isolation="posix/cpu,posix/mem" --launcher="posix"
> --launcher_dir="/mesos/build/src" --logbufsecs="0" --logging_level="INFO"
> --max_completed_executors_per_framework="150" --oversubscribed_resources_interval="15secs"
> --perf_duration="10secs" --perf_interval="1mins"
> --qos_correction_interval_min="0ns" --quiet="false" --recover="reconnect"
> --recovery_timeout="15mins" --registration_backoff_factor="10ms"
> --resources="cpus:2;gpus:0;mem:1024;disk:1024;ports:[31000-32000]"
> --revocable_cpu_low_priority="true" --runtime_dir="/tmp/Endpoint_
> SlaveEndpointTest_NoAuthorizer_2_wPqN2M" --sandbox_directory="/mnt/mesos/sandbox"
> --strict="true" --switch_user="true" --systemd_enable_support="true"
> --systemd_runtime_directory="/run/systemd/system" --version="false"
> --work_dir="/tmp/Endpoint_SlaveEndpointTest_NoAuthorizer_2_XlB1v8"
> I0217 21:23:51.899245 27158 credentials.hpp:86] Loading credential for
> authentication from '/tmp/Endpoint_SlaveEndpointTest_
> NoAuthorizer_2_wPqN2M/credential'
> I0217 21:23:51.899354 27158 slave.cpp:354] Agent using credential for:
> test-principal
> I0217 21:23:51.899392 27158 credentials.hpp:37] Loading credentials for
> authentication from '/tmp/Endpoint_SlaveEndpointTest_
> NoAuthorizer_2_wPqN2M/http_credentials'
> I0217 21:23:51.899516 27158 http.cpp:919] Using default 'basic' HTTP
> authenticator for realm 'mesos-agent-readonly'
> I0217 21:23:51.899580 27158 http.cpp:919] Using default 'basic' HTTP
> authenticator for realm 'mesos-agent-readwrite'
> I0217 21:23:51.900041 27158 slave.cpp:541] Agent resources: cpus(*):2;
> mem(*):1024; disk(*):1024; ports(*):[31000-32000]
> I0217 21:23:51.900075 27158 slave.cpp:549] Agent attributes: [  ]
> I0217 21:23:51.900080 27158 slave.cpp:554] Agent hostname: 96fd44d6ddb2
> I0217 21:23:51.900161 27171 status_update_manager.cpp:177] Pausing sending
> status updates
> I0217 21:23:51.900532 27172 state.cpp:62] Recovering state from
> '/tmp/Endpoint_SlaveEndpointTest_NoAuthorizer_2_XlB1v8/meta'
> I0217 21:23:51.900683 27158 status_update_manager.cpp:203] Recovering
> status update manager
> I0217 21:23:51.900825 27169 containerizer.cpp:599] Recovering containerizer
> I0217 21:23:51.901258 27159 provisioner.cpp:410] Provisioner recovery
> complete
> I0217 21:23:51.901437 27172 slave.cpp:5555] Finished recovery
> I0217 21:23:51.936105 27172 slave.cpp:5729] Querying resource estimator
> for oversubscribable resources
> I0217 21:23:51.936211 27172 slave.cpp:5743] Received oversubscribable
> resources {} from the resource estimator
> I0217 21:23:51.936954 27168 process.cpp:3704] Handling HTTP event for
> process 'slave(700)' with path: '/slave(700)/containers'
> I0217 21:23:51.937361 27168 http.cpp:871] Authorizing principal
> 'test-principal' to GET the '/containers' endpoint
> I0217 21:23:51.938828 27158 slave.cpp:803] Agent terminating
> [       OK ] Endpoint/SlaveEndpointTest.NoAuthorizer/2 (75 ms)
> [----------] 9 tests from Endpoint/SlaveEndpointTest (419 ms total)
>
> [----------] Global test environment tear-down
> [==========] 1447 tests from 160 test cases ran. (505427 ms total)
> [  PASSED  ] 1446 tests.
> [  FAILED  ] 1 test, listed below:
> [  FAILED  ] ContainerLoggerTest.LOGROTATE_RotateInSandbox
>
>  1 FAILED TEST
>   YOU HAVE 12 DISABLED TESTS
>
> make[3]: *** [CMakeFiles/check] Error 1
> make[3]: Leaving directory `/mesos/build'
> make[2]: *** [CMakeFiles/check.dir/all] Error 2
> make[2]: Leaving directory `/mesos/build'
> make[1]: *** [CMakeFiles/check.dir/rule] Error 2
> make[1]: Leaving directory `/mesos/build'
> make: *** [check] Error 2
> + docker rmi mesos-1487361486-4999
> Untagged: mesos-1487361486-4999:latest
> Deleted: sha256:413b84e8bbc583beadb2fb94ffa6cf
> a7343794045975f8552791d573300cec51
> Deleted: sha256:56ed282970d023ec2fa327ff427f13
> 8b6bbb4646b24375f68b1f9b7e2184765d
> Deleted: sha256:094ed5c3ef6d2abd803d49fdafcabe
> 777da3c33b9f266873053ce2ba66acb287
> Deleted: sha256:2753fb66c3e4c4debaa9cfb52e20ff
> 53d7e4cc57212b3f9ee24ad5ee076818fa
> Deleted: sha256:aca7dc4c4bd70b754cc27a42f81cde
> eb3e6e50008063d25d4020ae5e7bc64521
> Deleted: sha256:cf8e94b89c70a2b5eba972fba4924d
> eb4d01aeb9452b3efc47a21f8b713c6d1c
> Deleted: sha256:71c612a4ca0f17418a738a03521f07
> 8c98d5fde293ddca4cb8f94d93d4c757fc
> Deleted: sha256:b41d530ebadd15ffee9fbcbafe2a58
> 2e837d152c0897b12757e6cbac59c0aa8e
> Deleted: sha256:5289cefccd77fdca6f79dae5c7f037
> 5787f163d4b27b22ff977c2ea4df061663
> Deleted: sha256:5d568b4eecd7fd155130dd59f8e97a
> 61c497f6bbed76a3ce0b8ecd9d30e0393c
> Deleted: sha256:41a9888e733f23d599abfdf14f29ed
> 3c6af46a0e9d8f2c29f69d12dce7690a49
> Deleted: sha256:36c45187d89e570d26b7ac397ea1bd
> 5281a1b2db249100cfbe98d97d4d16755f
> Deleted: sha256:0e738b23fea1734ea165e86e05c095
> ef0299283ed5c7ebc98e5102f5c3b04ff9
> Deleted: sha256:32a6a6cb7c1150f9a0a761729e025b
> 228453afeac6ecea66cf9c3b3bcdb4dd1c
> Deleted: sha256:934995ecbb4adbd950e1a09938eacb
> e88baf91c4b54a08203e2725ec9a7906ef
> Deleted: sha256:0f306e9e45d2b37a0fcaeefdcc4f5e
> eb49b62e7f418f5028a63351d92d838881
> Deleted: sha256:17bf733391609cb4c386051c89a9fd
> b4fedf61c54d567988fb18b09ad63759c6
> Deleted: sha256:ce15d0097d16e21b945661a2a070ea
> 51b3256b76ef5669c8f28cca56fbb57150
> Deleted: sha256:6df43c81222b11c971e4e44803fb5c
> df47e4400c44193865fa33d821e4ed1224
> Deleted: sha256:2d75b48fe2f2d62f562273ca67752d
> 17922c5b7ebcb77aa9640ead7ab4edb6e0
> Deleted: sha256:bb63037d558007f8ce7281c93dc8c9
> 741376e275afd86ee259f080ebe95bffbe
> Deleted: sha256:5dbd13b6e56f429e1bfd1e861d8fc7
> 20c51f2e7ad4b282800a22d5158767e93b
> Deleted: sha256:26cd3c1b0ba8c76a1c8df6ba86cfb3
> f1dac9d4accf3d8b929d5d80a8ee305bee
> Deleted: sha256:c35ee36c6df8126a4b425649a193d3
> c5a6da9f7d11a6044b1a4fe9ab46e686fe
> Build step 'Execute shell' marked build as failure
>

Mime
  • Unnamed multipart/alternative (inline, None, 0 bytes)
View raw message