mesos-builds mailing list archives

Site index · List index
Message view « Date » · « Thread »
Top « Date » · « Thread »
From Greg Mann <g...@mesosphere.io>
Subject Re: Build failed in Jenkins: Mesos-Buildbot » autotools,clang,--verbose --enable-libevent --enable-ssl,GLOG_v=1 MESOS_VERBOSE=1,ubuntu:14.04,(docker||Hadoop)&&(!ubuntu-us1)&&(!ubuntu-eu2) #3254
Date Sat, 11 Feb 2017 00:55:24 GMT
This is tracked here: https://issues.apache.org/jira/browse/MESOS-6938

On Fri, Feb 10, 2017 at 9:47 AM, Apache Jenkins Server <
jenkins@builds.apache.org> wrote:

> See <https://builds.apache.org/job/Mesos-Buildbot/BUILDTOOL=
> autotools,COMPILER=clang,CONFIGURATION=--verbose%20--
> enable-libevent%20--enable-ssl,ENVIRONMENT=GLOG_v=1%
> 20MESOS_VERBOSE=1,OS=ubuntu%3A14.04,label_exp=(docker%7C%
> 7CHadoop)&&(!ubuntu-us1)&&(!ubuntu-eu2)/3254/changes>
>
> Changes:
>
> [xujyan] Fix the shell script to not use deprecated [..] in increment
> operation.
>
> ------------------------------------------
> [...truncated 14478 lines...]
> I0210 17:47:33.188987 25985 process.cpp:1246] libprocess is initialized on
> 172.17.0.2:33380 with 16 worker threads
> [       OK ] Scheme/HTTPTest.PipeEOF/0 (248 ms)
> [ RUN      ] Scheme/HTTPTest.PipeEOF/1
> I0210 17:47:33.191834 25985 process.cpp:1246] libprocess is initialized on
> 172.17.0.2:35121 with 16 worker threads
> [       OK ] Scheme/HTTPTest.PipeEOF/1 (3 ms)
> [ RUN      ] Scheme/HTTPTest.PipeFailure/0
> I0210 17:47:33.394027 25985 openssl.cpp:419] CA file path is unspecified!
> NOTE: Set CA file path with LIBPROCESS_SSL_CA_FILE=<filepath>
> I0210 17:47:33.394053 25985 openssl.cpp:424] CA directory path
> unspecified! NOTE: Set CA directory path with LIBPROCESS_SSL_CA_DIR=<
> dirpath>
> I0210 17:47:33.394059 25985 openssl.cpp:429] Will not verify peer
> certificate!
> NOTE: Set LIBPROCESS_SSL_VERIFY_CERT=1 to enable peer certificate
> verification
> I0210 17:47:33.394063 25985 openssl.cpp:435] Will only verify peer
> certificate if presented!
> NOTE: Set LIBPROCESS_SSL_REQUIRE_CERT=1 to require peer certificate
> verification
> I0210 17:47:33.397025 25985 process.cpp:1246] libprocess is initialized on
> 172.17.0.2:42239 with 16 worker threads
> [       OK ] Scheme/HTTPTest.PipeFailure/0 (206 ms)
> [ RUN      ] Scheme/HTTPTest.PipeFailure/1
> I0210 17:47:33.406873 25985 process.cpp:1246] libprocess is initialized on
> 172.17.0.2:57515 with 16 worker threads
> [       OK ] Scheme/HTTPTest.PipeFailure/1 (9 ms)
> [ RUN      ] Scheme/HTTPTest.PipeReaderCloses/0
> I0210 17:47:34.029083 25985 openssl.cpp:419] CA file path is unspecified!
> NOTE: Set CA file path with LIBPROCESS_SSL_CA_FILE=<filepath>
> I0210 17:47:34.029111 25985 openssl.cpp:424] CA directory path
> unspecified! NOTE: Set CA directory path with LIBPROCESS_SSL_CA_DIR=<
> dirpath>
> I0210 17:47:34.029116 25985 openssl.cpp:429] Will not verify peer
> certificate!
> NOTE: Set LIBPROCESS_SSL_VERIFY_CERT=1 to enable peer certificate
> verification
> I0210 17:47:34.029120 25985 openssl.cpp:435] Will only verify peer
> certificate if presented!
> NOTE: Set LIBPROCESS_SSL_REQUIRE_CERT=1 to require peer certificate
> verification
> I0210 17:47:34.043170 25985 process.cpp:1246] libprocess is initialized on
> 172.17.0.2:48193 with 16 worker threads
> [       OK ] Scheme/HTTPTest.PipeReaderCloses/0 (636 ms)
> [ RUN      ] Scheme/HTTPTest.PipeReaderCloses/1
> I0210 17:47:34.047116 25985 process.cpp:1246] libprocess is initialized on
> 172.17.0.2:39341 with 16 worker threads
> [       OK ] Scheme/HTTPTest.PipeReaderCloses/1 (4 ms)
> [ RUN      ] Scheme/HTTPTest.Encode/0
> I0210 17:47:34.311111 25985 openssl.cpp:419] CA file path is unspecified!
> NOTE: Set CA file path with LIBPROCESS_SSL_CA_FILE=<filepath>
> I0210 17:47:34.311146 25985 openssl.cpp:424] CA directory path
> unspecified! NOTE: Set CA directory path with LIBPROCESS_SSL_CA_DIR=<
> dirpath>
> I0210 17:47:34.311156 25985 openssl.cpp:429] Will not verify peer
> certificate!
> NOTE: Set LIBPROCESS_SSL_VERIFY_CERT=1 to enable peer certificate
> verification
> I0210 17:47:34.311162 25985 openssl.cpp:435] Will only verify peer
> certificate if presented!
> NOTE: Set LIBPROCESS_SSL_REQUIRE_CERT=1 to require peer certificate
> verification
> I0210 17:47:34.313869 25985 process.cpp:1246] libprocess is initialized on
> 172.17.0.2:42557 with 16 worker threads
> [       OK ] Scheme/HTTPTest.Encode/0 (267 ms)
> [ RUN      ] Scheme/HTTPTest.Encode/1
> I0210 17:47:34.330765 25985 process.cpp:1246] libprocess is initialized on
> 172.17.0.2:55203 with 16 worker threads
> [       OK ] Scheme/HTTPTest.Encode/1 (17 ms)
> [ RUN      ] Scheme/HTTPTest.PathParse/0
> I0210 17:47:34.493952 25985 openssl.cpp:419] CA file path is unspecified!
> NOTE: Set CA file path with LIBPROCESS_SSL_CA_FILE=<filepath>
> I0210 17:47:34.493981 25985 openssl.cpp:424] CA directory path
> unspecified! NOTE: Set CA directory path with LIBPROCESS_SSL_CA_DIR=<
> dirpath>
> I0210 17:47:34.493988 25985 openssl.cpp:429] Will not verify peer
> certificate!
> NOTE: Set LIBPROCESS_SSL_VERIFY_CERT=1 to enable peer certificate
> verification
> I0210 17:47:34.493994 25985 openssl.cpp:435] Will only verify peer
> certificate if presented!
> NOTE: Set LIBPROCESS_SSL_REQUIRE_CERT=1 to require peer certificate
> verification
> I0210 17:47:34.502269 25985 process.cpp:1246] libprocess is initialized on
> 172.17.0.2:54436 with 16 worker threads
> [       OK ] Scheme/HTTPTest.PathParse/0 (171 ms)
> [ RUN      ] Scheme/HTTPTest.PathParse/1
> I0210 17:47:34.514127 25985 process.cpp:1246] libprocess is initialized on
> 172.17.0.2:37804 with 16 worker threads
> [       OK ] Scheme/HTTPTest.PathParse/1 (12 ms)
> [ RUN      ] Scheme/HTTPTest.Get/0
> I0210 17:47:35.117147 25985 openssl.cpp:419] CA file path is unspecified!
> NOTE: Set CA file path with LIBPROCESS_SSL_CA_FILE=<filepath>
> I0210 17:47:35.117173 25985 openssl.cpp:424] CA directory path
> unspecified! NOTE: Set CA directory path with LIBPROCESS_SSL_CA_DIR=<
> dirpath>
> I0210 17:47:35.117180 25985 openssl.cpp:429] Will not verify peer
> certificate!
> NOTE: Set LIBPROCESS_SSL_VERIFY_CERT=1 to enable peer certificate
> verification
> I0210 17:47:35.117184 25985 openssl.cpp:435] Will only verify peer
> certificate if presented!
> NOTE: Set LIBPROCESS_SSL_REQUIRE_CERT=1 to require peer certificate
> verification
> I0210 17:47:35.122938 25985 process.cpp:1246] libprocess is initialized on
> 172.17.0.2:39238 with 16 worker threads
> I0210 17:47:35.129412 27024 process.cpp:3704] Handling HTTP event for
> process '(81)' with path: '/(81)/get'
> I0210 17:47:35.135144 27019 process.cpp:3704] Handling HTTP event for
> process '(81)' with path: '/(81)/get'
> [       OK ] Scheme/HTTPTest.Get/0 (622 ms)
> [ RUN      ] Scheme/HTTPTest.Get/1
> I0210 17:47:35.139276 25985 process.cpp:1246] libprocess is initialized on
> 172.17.0.2:36325 with 16 worker threads
> I0210 17:47:35.140391 27038 process.cpp:3704] Handling HTTP event for
> process '(82)' with path: '/(82)/get'
> I0210 17:47:35.142622 27042 process.cpp:3704] Handling HTTP event for
> process '(82)' with path: '/(82)/get'
> [       OK ] Scheme/HTTPTest.Get/1 (8 ms)
> [ RUN      ] Scheme/HTTPTest.NestedGet/0
> I0210 17:47:35.855554 25985 openssl.cpp:419] CA file path is unspecified!
> NOTE: Set CA file path with LIBPROCESS_SSL_CA_FILE=<filepath>
> I0210 17:47:35.855581 25985 openssl.cpp:424] CA directory path
> unspecified! NOTE: Set CA directory path with LIBPROCESS_SSL_CA_DIR=<
> dirpath>
> I0210 17:47:35.855585 25985 openssl.cpp:429] Will not verify peer
> certificate!
> NOTE: Set LIBPROCESS_SSL_VERIFY_CERT=1 to enable peer certificate
> verification
> I0210 17:47:35.855588 25985 openssl.cpp:435] Will only verify peer
> certificate if presented!
> NOTE: Set LIBPROCESS_SSL_REQUIRE_CERT=1 to require peer certificate
> verification
> I0210 17:47:35.858150 25985 process.cpp:1246] libprocess is initialized on
> 172.17.0.2:36172 with 16 worker threads
> I0210 17:47:35.864831 27057 process.cpp:3704] Handling HTTP event for
> process '(83)' with path: '/(83)//a/b/c'
> I0210 17:47:35.877792 27062 process.cpp:3704] Handling HTTP event for
> process '(83)' with path: '/(83)//a/b'
> [       OK ] Scheme/HTTPTest.NestedGet/0 (735 ms)
> [ RUN      ] Scheme/HTTPTest.NestedGet/1
> I0210 17:47:35.897882 25985 process.cpp:1246] libprocess is initialized on
> 172.17.0.2:54713 with 16 worker threads
> I0210 17:47:35.899351 27079 process.cpp:3704] Handling HTTP event for
> process '(84)' with path: '/(84)//a/b/c'
> I0210 17:47:35.901896 27069 process.cpp:3704] Handling HTTP event for
> process '(84)' with path: '/(84)//a/b'
> [       OK ] Scheme/HTTPTest.NestedGet/1 (24 ms)
> [ RUN      ] Scheme/HTTPTest.StreamingGetComplete/0
> I0210 17:47:36.513770 25985 openssl.cpp:419] CA file path is unspecified!
> NOTE: Set CA file path with LIBPROCESS_SSL_CA_FILE=<filepath>
> I0210 17:47:36.513804 25985 openssl.cpp:424] CA directory path
> unspecified! NOTE: Set CA directory path with LIBPROCESS_SSL_CA_DIR=<
> dirpath>
> I0210 17:47:36.513814 25985 openssl.cpp:429] Will not verify peer
> certificate!
> NOTE: Set LIBPROCESS_SSL_VERIFY_CERT=1 to enable peer certificate
> verification
> I0210 17:47:36.513820 25985 openssl.cpp:435] Will only verify peer
> certificate if presented!
> NOTE: Set LIBPROCESS_SSL_REQUIRE_CERT=1 to require peer certificate
> verification
> I0210 17:47:36.517359 25985 process.cpp:1246] libprocess is initialized on
> 172.17.0.2:48988 with 16 worker threads
> I0210 17:47:36.524685 27082 process.cpp:3704] Handling HTTP event for
> process '(85)' with path: '/(85)/pipe'
> [       OK ] Scheme/HTTPTest.StreamingGetComplete/0 (664 ms)
> [ RUN      ] Scheme/HTTPTest.StreamingGetComplete/1
> I0210 17:47:36.569738 25985 process.cpp:1246] libprocess is initialized on
> 172.17.0.2:50339 with 16 worker threads
> I0210 17:47:36.571089 27113 process.cpp:3704] Handling HTTP event for
> process '(86)' with path: '/(86)/pipe'
> [       OK ] Scheme/HTTPTest.StreamingGetComplete/1 (7 ms)
> [ RUN      ] Scheme/HTTPTest.StreamingGetFailure/0
> I0210 17:47:37.001372 25985 openssl.cpp:419] CA file path is unspecified!
> NOTE: Set CA file path with LIBPROCESS_SSL_CA_FILE=<filepath>
> I0210 17:47:37.001397 25985 openssl.cpp:424] CA directory path
> unspecified! NOTE: Set CA directory path with LIBPROCESS_SSL_CA_DIR=<
> dirpath>
> I0210 17:47:37.001404 25985 openssl.cpp:429] Will not verify peer
> certificate!
> NOTE: Set LIBPROCESS_SSL_VERIFY_CERT=1 to enable peer certificate
> verification
> I0210 17:47:37.001407 25985 openssl.cpp:435] Will only verify peer
> certificate if presented!
> NOTE: Set LIBPROCESS_SSL_REQUIRE_CERT=1 to require peer certificate
> verification
> I0210 17:47:37.006376 25985 process.cpp:1246] libprocess is initialized on
> 172.17.0.2:37787 with 16 worker threads
> I0210 17:47:37.012176 27126 process.cpp:3704] Handling HTTP event for
> process '(87)' with path: '/(87)/pipe'
> I0210 17:47:37.057710 27121 process.cpp:1604] Failed to read from stream:
> oops
> [       OK ] Scheme/HTTPTest.StreamingGetFailure/0 (485 ms)
> [ RUN      ] Scheme/HTTPTest.StreamingGetFailure/1
> I0210 17:47:37.061837 25985 process.cpp:1246] libprocess is initialized on
> 172.17.0.2:51698 with 16 worker threads
> I0210 17:47:37.063071 27136 process.cpp:3704] Handling HTTP event for
> process '(88)' with path: '/(88)/pipe'
> I0210 17:47:37.065017 27137 process.cpp:1604] Failed to read from stream:
> oops
> [       OK ] Scheme/HTTPTest.StreamingGetFailure/1 (12 ms)
> [ RUN      ] Scheme/HTTPTest.PipeEquality/0
> I0210 17:47:37.354684 25985 openssl.cpp:419] CA file path is unspecified!
> NOTE: Set CA file path with LIBPROCESS_SSL_CA_FILE=<filepath>
> I0210 17:47:37.354712 25985 openssl.cpp:424] CA directory path
> unspecified! NOTE: Set CA directory path with LIBPROCESS_SSL_CA_DIR=<
> dirpath>
> I0210 17:47:37.354719 25985 openssl.cpp:429] Will not verify peer
> certificate!
> NOTE: Set LIBPROCESS_SSL_VERIFY_CERT=1 to enable peer certificate
> verification
> I0210 17:47:37.354725 25985 openssl.cpp:435] Will only verify peer
> certificate if presented!
> NOTE: Set LIBPROCESS_SSL_REQUIRE_CERT=1 to require peer certificate
> verification
> I0210 17:47:37.364990 25985 process.cpp:1246] libprocess is initialized on
> 172.17.0.2:58520 with 16 worker threads
> [       OK ] Scheme/HTTPTest.PipeEquality/0 (294 ms)
> [ RUN      ] Scheme/HTTPTest.PipeEquality/1
> I0210 17:47:37.375885 25985 process.cpp:1246] libprocess is initialized on
> 172.17.0.2:38363 with 16 worker threads
> [       OK ] Scheme/HTTPTest.PipeEquality/1 (11 ms)
> [ RUN      ] Scheme/HTTPTest.Post/0
> I0210 17:47:37.719427 25985 openssl.cpp:419] CA file path is unspecified!
> NOTE: Set CA file path with LIBPROCESS_SSL_CA_FILE=<filepath>
> I0210 17:47:37.719458 25985 openssl.cpp:424] CA directory path
> unspecified! NOTE: Set CA directory path with LIBPROCESS_SSL_CA_DIR=<
> dirpath>
> I0210 17:47:37.719467 25985 openssl.cpp:429] Will not verify peer
> certificate!
> NOTE: Set LIBPROCESS_SSL_VERIFY_CERT=1 to enable peer certificate
> verification
> I0210 17:47:37.719475 25985 openssl.cpp:435] Will only verify peer
> certificate if presented!
> NOTE: Set LIBPROCESS_SSL_REQUIRE_CERT=1 to require peer certificate
> verification
> I0210 17:47:37.729879 25985 process.cpp:1246] libprocess is initialized on
> 172.17.0.2:46578 with 16 worker threads
> I0210 17:47:37.735815 27188 process.cpp:3704] Handling HTTP event for
> process '(89)' with path: '/(89)/post'
> I0210 17:47:37.781461 27184 process.cpp:3704] Handling HTTP event for
> process '(89)' with path: '/(89)/post'
> [       OK ] Scheme/HTTPTest.Post/0 (446 ms)
> [ RUN      ] Scheme/HTTPTest.Post/1
> I0210 17:47:37.826949 25985 process.cpp:1246] libprocess is initialized on
> 172.17.0.2:33308 with 16 worker threads
> I0210 17:47:37.828176 27201 process.cpp:3704] Handling HTTP event for
> process '(90)' with path: '/(90)/post'
> I0210 17:47:37.838585 27214 process.cpp:3704] Handling HTTP event for
> process '(90)' with path: '/(90)/post'
> [       OK ] Scheme/HTTPTest.Post/1 (18 ms)
> [ RUN      ] Scheme/HTTPTest.Delete/0
> I0210 17:47:38.342335 25985 openssl.cpp:419] CA file path is unspecified!
> NOTE: Set CA file path with LIBPROCESS_SSL_CA_FILE=<filepath>
> I0210 17:47:38.342361 25985 openssl.cpp:424] CA directory path
> unspecified! NOTE: Set CA directory path with LIBPROCESS_SSL_CA_DIR=<
> dirpath>
> I0210 17:47:38.342366 25985 openssl.cpp:429] Will not verify peer
> certificate!
> NOTE: Set LIBPROCESS_SSL_VERIFY_CERT=1 to enable peer certificate
> verification
> I0210 17:47:38.342370 25985 openssl.cpp:435] Will only verify peer
> certificate if presented!
> NOTE: Set LIBPROCESS_SSL_REQUIRE_CERT=1 to require peer certificate
> verification
> I0210 17:47:38.350837 25985 process.cpp:1246] libprocess is initialized on
> 172.17.0.2:46394 with 16 worker threads
> I0210 17:47:38.357511 27226 process.cpp:3704] Handling HTTP event for
> process '(91)' with path: '/(91)/delete'
> [       OK ] Scheme/HTTPTest.Delete/0 (519 ms)
> [ RUN      ] Scheme/HTTPTest.Delete/1
> I0210 17:47:38.361845 25985 process.cpp:1246] libprocess is initialized on
> 172.17.0.2:51583 with 16 worker threads
> I0210 17:47:38.362804 27235 process.cpp:3704] Handling HTTP event for
> process '(92)' with path: '/(92)/delete'
> [       OK ] Scheme/HTTPTest.Delete/1 (5 ms)
> [ RUN      ] Scheme/HTTPTest.Request/0
> I0210 17:47:38.598870 25985 openssl.cpp:419] CA file path is unspecified!
> NOTE: Set CA file path with LIBPROCESS_SSL_CA_FILE=<filepath>
> I0210 17:47:38.598896 25985 openssl.cpp:424] CA directory path
> unspecified! NOTE: Set CA directory path with LIBPROCESS_SSL_CA_DIR=<
> dirpath>
> I0210 17:47:38.598901 25985 openssl.cpp:429] Will not verify peer
> certificate!
> NOTE: Set LIBPROCESS_SSL_VERIFY_CERT=1 to enable peer certificate
> verification
> I0210 17:47:38.598906 25985 openssl.cpp:435] Will only verify peer
> certificate if presented!
> NOTE: Set LIBPROCESS_SSL_REQUIRE_CERT=1 to require peer certificate
> verification
> I0210 17:47:38.601167 25985 process.cpp:1246] libprocess is initialized on
> 172.17.0.2:60665 with 16 worker threads
> I0210 17:47:38.607869 27254 process.cpp:3704] Handling HTTP event for
> process '(93)' with path: '/(93)/request'
> [       OK ] Scheme/HTTPTest.Request/0 (245 ms)
> [ RUN      ] Scheme/HTTPTest.Request/1
> I0210 17:47:38.614701 25985 process.cpp:1246] libprocess is initialized on
> 172.17.0.2:60243 with 16 worker threads
> I0210 17:47:38.616544 27269 process.cpp:3704] Handling HTTP event for
> process '(94)' with path: '/(94)/request'
> [       OK ] Scheme/HTTPTest.Request/1 (9 ms)
> [ RUN      ] Scheme/HTTPTest.QueryEncodeDecode/0
> I0210 17:47:38.944344 25985 openssl.cpp:419] CA file path is unspecified!
> NOTE: Set CA file path with LIBPROCESS_SSL_CA_FILE=<filepath>
> I0210 17:47:38.944371 25985 openssl.cpp:424] CA directory path
> unspecified! NOTE: Set CA directory path with LIBPROCESS_SSL_CA_DIR=<
> dirpath>
> I0210 17:47:38.944376 25985 openssl.cpp:429] Will not verify peer
> certificate!
> NOTE: Set LIBPROCESS_SSL_VERIFY_CERT=1 to enable peer certificate
> verification
> I0210 17:47:38.944380 25985 openssl.cpp:435] Will only verify peer
> certificate if presented!
> NOTE: Set LIBPROCESS_SSL_REQUIRE_CERT=1 to require peer certificate
> verification
> I0210 17:47:38.947120 25985 process.cpp:1246] libprocess is initialized on
> 172.17.0.2:46656 with 16 worker threads
> [       OK ] Scheme/HTTPTest.QueryEncodeDecode/0 (328 ms)
> [ RUN      ] Scheme/HTTPTest.QueryEncodeDecode/1
> I0210 17:47:38.949785 25985 process.cpp:1246] libprocess is initialized on
> 172.17.0.2:50630 with 16 worker threads
> *** Aborted at 1486748858 (unix time) try "date -d @1486748858" if you are
> using GNU date ***
> [       OK ] Scheme/HTTPTest.QueryEncodeDecode/1 (3 ms)
> [ RUN      ] Scheme/HTTPTest.Headers/0
> PC: @     0x2b737efa3eee (unknown)
> *** SIGSEGV (@0x285ecb8) received by PID 25985 (TID 0x2b7384e43700) from
> PID 42331320; stack trace: ***
>     @     0x2b737c8f8330 (unknown)
>     @     0x2b737efa3eee (unknown)
>     @     0x2b737e7a6e30 (unknown)
>     @     0x2b737e7a748c (unknown)
>     @           0x442f6f process::UPID::UPID()
>     @           0x9f4cbe process::DispatchEvent::DispatchEvent()
>     @           0x9de773 process::internal::dispatch()
>     @           0x9f477d process::dispatch<>()
>     @           0x9dd797 process::ProcessBase::route()
>     @           0xaf570d process::ProcessBase::route<>()
>     @           0xaf2fe0 process::Help::initialize()
>     @           0xaf3092 process::Help::initialize()
>     @           0x9d8280 process::ProcessManager::resume()
>     @           0x9e6aac process::ProcessManager::init_
> threads()::$_2::operator()()
>     @           0x9e69b5 _ZNSt12_Bind_simpleIFZN7process14ProcessMan
> ager12init_threadsEvE3$_2vEE9_M_invokeIJEEEvSt12_Index_tupleIJXspT_EEE
>     @           0x9e6985 std::_Bind_simple<>::operator()()
>     @           0x9e695c std::thread::_Impl<>::_M_run()
>     @     0x2b737e79da60 (unknown)
>     @     0x2b737c8f0184 start_thread
>     @     0x2b737f00637d (unknown)
> make[7]: *** [check-local] Segmentation fault
> make[7]: Leaving directory `/mesos/mesos-1.3.0/_build/3rdparty/libprocess'
> make[6]: *** [check-am] Error 2
> make[6]: Leaving directory `/mesos/mesos-1.3.0/_build/3rdparty/libprocess'
> make[5]: *** [check-recursive] Error 1
> make[5]: Leaving directory `/mesos/mesos-1.3.0/_build/3rdparty/libprocess'
> make[4]: *** [check] Error 2
> make[4]: Leaving directory `/mesos/mesos-1.3.0/_build/3rdparty/libprocess'
> make[3]: *** [check-recursive] Error 1
> make[3]: Leaving directory `/mesos/mesos-1.3.0/_build/3rdparty'
> make[2]: *** [check] Error 2
> make[2]: Leaving directory `/mesos/mesos-1.3.0/_build/3rdparty'
> make[1]: *** [check-recursive] Error 1
> make[1]: Leaving directory `/mesos/mesos-1.3.0/_build'
> make: *** [distcheck] Error 1
> + docker rmi mesos-1486747344-2469
> Untagged: mesos-1486747344-2469:latest
> Deleted: sha256:718dab3323bbf7d0ba3d8e8e8c7a8d
> 43f5d50a8c1c596366a9912e0e76eea58a
> Deleted: sha256:63368258697450882360007350a55f
> 61bddb24ad027a6bd56d5b0a190f685467
> Deleted: sha256:d76cce98dc1159a1c3a41e54b15ab2
> c594545b3626104458c9c9c7b6f072523a
> Deleted: sha256:7f29ccea53165b9b3d6198f22821e0
> f1f7a420b1928249c764a04a228de0be9f
> Deleted: sha256:04acf4f940698bd3408b89dcd90704
> 3a68ae4b993499d7647a52335849dc2f73
> Deleted: sha256:bdd67bf345c27af7c3f210fa528b0e
> d0a5217879ce2175bed5deef0459019cf9
> Deleted: sha256:a2f2456e7d1d19ee60f79834aed828
> 166726a35a9d1c1288911f99892ce85190
> Deleted: sha256:fa3d1e78333eca7a53d3299a2ce1f5
> 9c0676a34809cea68bf819a468c9a19151
> Deleted: sha256:c85ca873ab66fd0ff6a2731071184a
> 2f38e284c1a4a6667267398eae30574354
> Deleted: sha256:76614a418290d08ce9ecb0cf39ce20
> dab007058c4f0c366df676d9a8ac4c0086
> Deleted: sha256:123f8ddc65c92c3c4d2af1b7602035
> 69e636c532b117aead0843fe85690f7af2
> Deleted: sha256:292f501823d6c596913123b1727607
> 1a92d46f6bd179fff9c91f71214b9b473a
> Deleted: sha256:d9af27e6b29ae2159fa7343e970175
> 4ff3336b4405cd06a958fb9517355c5100
> Deleted: sha256:a0974687650992c7408f4364a2d50d
> ec199cc7f160b4f63675de5d70b262bb42
> Deleted: sha256:89b1cb88b70132b5fdbdc29f89b578
> 42b4eefd23546a651b9cabe30d5fb7da66
> Deleted: sha256:1d302d5d305e1dddafce0e73d50309
> 02260147b109a45bc640b0eacd197ef404
> Deleted: sha256:8b8c548cdbc561cb0e8b6fe0a90308
> 2d7b251edb58be892fed448dfad675c2ae
> Deleted: sha256:620db328b4605e772059ea1f00967e
> e5cd5cc60c52b3c0e3406ad73016e74cf3
> Deleted: sha256:3da0e263360bbd2bbb3e0c74d5b27d
> 0d5e2dd30d58aa102568ea85332a208ad5
> Deleted: sha256:e6b05802976e8b269ddd3be5d898b4
> b87d0fdcbf35f7ee0bd4e5a97be6d5789b
> Deleted: sha256:19d396b2666cb0712998eb73313298
> dcd2dc4008452d2a401c271abb1ff712bc
> Deleted: sha256:10ab20297a5d1a52a432a6932303ef
> 30e73b0500413fdb32136b339fcd45383c
> Deleted: sha256:8f9e21aa7b7d79ab506e18890c8b36
> d19bd35db4843ab24562b2fa3b8468e4aa
> Deleted: sha256:2720f9c65300d01e3962775e8b23ba
> d9b47fdf1c977f247c6b97d67390c2bb4e
> Build step 'Execute shell' marked build as failure
>

Mime
  • Unnamed multipart/alternative (inline, None, 0 bytes)
View raw message