mesos-builds mailing list archives

Site index · List index
Message view « Date » · « Thread »
Top « Date » · « Thread »
From Apache Jenkins Server <jenk...@builds.apache.org>
Subject Build failed in Jenkins: Mesos-Buildbot » cmake,gcc,--verbose --enable-libevent --enable-ssl,GLOG_v=1 MESOS_VERBOSE=1,ubuntu:14.04,(docker||Hadoop)&&(!ubuntu-us1)&&(!ubuntu-eu2) #3262
Date Tue, 14 Feb 2017 13:54:21 GMT
See <https://builds.apache.org/job/Mesos-Buildbot/BUILDTOOL=cmake,COMPILER=gcc,CONFIGURATION=--verbose%20--enable-libevent%20--enable-ssl,ENVIRONMENT=GLOG_v=1%20MESOS_VERBOSE=1,OS=ubuntu%3A14.04,label_exp=(docker%7C%7CHadoop)&&(!ubuntu-us1)&&(!ubuntu-eu2)/3262/changes>

Changes:

[gyliu513] Added test case for suppress and revive with multi role framework.

------------------------------------------
[...truncated 177180 lines...]
I0214 13:54:00.030016 27158 process.cpp:3704] Handling HTTP event for process 'slave(692)'
with path: '/slave(692)/monitor/statistics.json'
I0214 13:54:00.030416 27162 http.cpp:871] Authorizing principal 'test-principal' to GET the
'/monitor/statistics.json' endpoint
I0214 13:54:00.031584 27161 slave.cpp:803] Agent terminating
[       OK ] Endpoint/SlaveEndpointTest.AuthorizedRequest/1 (11 ms)
[ RUN      ] Endpoint/SlaveEndpointTest.AuthorizedRequest/2
I0214 13:54:00.070264 27154 containerizer.cpp:220] Using isolation: posix/cpu,posix/mem,filesystem/posix,network/cni
W0214 13:54:00.070669 27154 backend.cpp:76] Failed to create 'aufs' backend: AufsBackend requires
root privileges
W0214 13:54:00.070714 27154 backend.cpp:76] Failed to create 'bind' backend: BindBackend requires
root privileges
I0214 13:54:00.070732 27154 provisioner.cpp:249] Using default backend 'copy'
I0214 13:54:00.071930 27162 slave.cpp:211] Mesos agent started on (693)@172.17.0.3:45143
I0214 13:54:00.071949 27162 slave.cpp:212] Flags at startup: --acls="" --appc_simple_discovery_uri_prefix="http://"
--appc_store_dir="/tmp/mesos/store/appc" --authenticate_http_readonly="true" --authenticate_http_readwrite="true"
--authenticatee="crammd5" --authentication_backoff_factor="1secs" --authorizer="local" --cgroups_cpu_enable_pids_and_tids_count="false"
--cgroups_enable_cfs="false" --cgroups_hierarchy="/sys/fs/cgroup" --cgroups_limit_swap="false"
--cgroups_root="mesos" --container_disk_watch_interval="15secs" --containerizers="mesos" --credential="/tmp/Endpoint_SlaveEndpointTest_AuthorizedRequest_2_SgVVg3/credential"
--default_role="*" --disk_watch_interval="1mins" --docker="docker" --docker_kill_orphans="true"
--docker_registry="https://registry-1.docker.io" --docker_remove_delay="6hrs" --docker_socket="/var/run/docker.sock"
--docker_stop_timeout="0ns" --docker_store_dir="/tmp/mesos/store/docker" --docker_volume_checkpoint_dir="/var/run/mesos/isolators/docker/volume"
--enforce_container_disk_quota="false" --executor_registration_timeout="1mins" --executor_shutdown_grace_period="5secs"
--fetcher_cache_dir="/tmp/Endpoint_SlaveEndpointTest_AuthorizedRequest_2_SgVVg3/fetch" --fetcher_cache_size="2GB"
--frameworks_home="" --gc_delay="1weeks" --gc_disk_headroom="0.1" --hadoop_home="" --help="false"
--hostname_lookup="true" --http_authenticators="basic" --http_command_executor="false" --http_credentials="/tmp/Endpoint_SlaveEndpointTest_AuthorizedRequest_2_SgVVg3/http_credentials"
--http_heartbeat_interval="30secs" --initialize_driver_logging="true" --isolation="posix/cpu,posix/mem"
--launcher="posix" --launcher_dir="/mesos/build/src" --logbufsecs="0" --logging_level="INFO"
--max_completed_executors_per_framework="150" --oversubscribed_resources_interval="15secs"
--perf_duration="10secs" --perf_interval="1mins" --qos_correction_interval_min="0ns" --quiet="false"
--recover="reconnect" --recovery_timeout="15mins" --registration_backoff_factor="10ms" --resources="cpus:2;gpus:0;mem:1024;disk:1024;ports:[31000-32000]"
--revocable_cpu_low_priority="true" --runtime_dir="/tmp/Endpoint_SlaveEndpointTest_AuthorizedRequest_2_SgVVg3"
--sandbox_directory="/mnt/mesos/sandbox" --strict="true" --switch_user="true" --systemd_enable_support="true"
--systemd_runtime_directory="/run/systemd/system" --version="false" --work_dir="/tmp/Endpoint_SlaveEndpointTest_AuthorizedRequest_2_ifTaIc"
I0214 13:54:00.072317 27162 credentials.hpp:86] Loading credential for authentication from
'/tmp/Endpoint_SlaveEndpointTest_AuthorizedRequest_2_SgVVg3/credential'
I0214 13:54:00.072433 27162 slave.cpp:354] Agent using credential for: test-principal
I0214 13:54:00.072448 27162 credentials.hpp:37] Loading credentials for authentication from
'/tmp/Endpoint_SlaveEndpointTest_AuthorizedRequest_2_SgVVg3/http_credentials'
I0214 13:54:00.072582 27162 http.cpp:919] Using default 'basic' HTTP authenticator for realm
'mesos-agent-readonly'
I0214 13:54:00.072641 27162 http.cpp:919] Using default 'basic' HTTP authenticator for realm
'mesos-agent-readwrite'
I0214 13:54:00.073271 27162 slave.cpp:541] Agent resources: cpus(*):2; mem(*):1024; disk(*):1024;
ports(*):[31000-32000]
I0214 13:54:00.073318 27162 slave.cpp:549] Agent attributes: [  ]
I0214 13:54:00.073326 27162 slave.cpp:554] Agent hostname: d28ca37380df
I0214 13:54:00.073456 27158 status_update_manager.cpp:177] Pausing sending status updates
I0214 13:54:00.074081 27166 state.cpp:62] Recovering state from '/tmp/Endpoint_SlaveEndpointTest_AuthorizedRequest_2_ifTaIc/meta'
I0214 13:54:00.074252 27169 status_update_manager.cpp:203] Recovering status update manager
I0214 13:54:00.074373 27160 containerizer.cpp:599] Recovering containerizer
I0214 13:54:00.075811 27162 provisioner.cpp:410] Provisioner recovery complete
I0214 13:54:00.076020 27166 slave.cpp:5555] Finished recovery
I0214 13:54:00.076452 27166 slave.cpp:5729] Querying resource estimator for oversubscribable
resources
I0214 13:54:00.076548 27166 slave.cpp:5743] Received oversubscribable resources {} from the
resource estimator
I0214 13:54:00.081010 27164 process.cpp:3704] Handling HTTP event for process 'slave(693)'
with path: '/slave(693)/containers'
I0214 13:54:00.081528 27161 http.cpp:871] Authorizing principal 'test-principal' to GET the
'/containers' endpoint
I0214 13:54:00.082940 27154 slave.cpp:803] Agent terminating
[       OK ] Endpoint/SlaveEndpointTest.AuthorizedRequest/2 (18 ms)
[ RUN      ] Endpoint/SlaveEndpointTest.UnauthorizedRequest/0
I0214 13:54:00.128461 27154 containerizer.cpp:220] Using isolation: posix/cpu,posix/mem,filesystem/posix,network/cni
W0214 13:54:00.128842 27154 backend.cpp:76] Failed to create 'aufs' backend: AufsBackend requires
root privileges
W0214 13:54:00.128893 27154 backend.cpp:76] Failed to create 'bind' backend: BindBackend requires
root privileges
I0214 13:54:00.128914 27154 provisioner.cpp:249] Using default backend 'copy'
I0214 13:54:00.130321 27158 slave.cpp:211] Mesos agent started on (694)@172.17.0.3:45143
I0214 13:54:00.130364 27158 slave.cpp:212] Flags at startup: --acls="" --appc_simple_discovery_uri_prefix="http://"
--appc_store_dir="/tmp/mesos/store/appc" --authenticate_http_readonly="true" --authenticate_http_readwrite="true"
--authenticatee="crammd5" --authentication_backoff_factor="1secs" --authorizer="local" --cgroups_cpu_enable_pids_and_tids_count="false"
--cgroups_enable_cfs="false" --cgroups_hierarchy="/sys/fs/cgroup" --cgroups_limit_swap="false"
--cgroups_root="mesos" --container_disk_watch_interval="15secs" --containerizers="mesos" --credential="/tmp/Endpoint_SlaveEndpointTest_UnauthorizedRequest_0_4eroTq/credential"
--default_role="*" --disk_watch_interval="1mins" --docker="docker" --docker_kill_orphans="true"
--docker_registry="https://registry-1.docker.io" --docker_remove_delay="6hrs" --docker_socket="/var/run/docker.sock"
--docker_stop_timeout="0ns" --docker_store_dir="/tmp/mesos/store/docker" --docker_volume_checkpoint_dir="/var/run/mesos/isolators/docker/volume"
--enforce_container_disk_quota="false" --executor_registration_timeout="1mins" --executor_shutdown_grace_period="5secs"
--fetcher_cache_dir="/tmp/Endpoint_SlaveEndpointTest_UnauthorizedRequest_0_4eroTq/fetch" --fetcher_cache_size="2GB"
--frameworks_home="" --gc_delay="1weeks" --gc_disk_headroom="0.1" --hadoop_home="" --help="false"
--hostname_lookup="true" --http_authenticators="basic" --http_command_executor="false" --http_credentials="/tmp/Endpoint_SlaveEndpointTest_UnauthorizedRequest_0_4eroTq/http_credentials"
--http_heartbeat_interval="30secs" --initialize_driver_logging="true" --isolation="posix/cpu,posix/mem"
--launcher="posix" --launcher_dir="/mesos/build/src" --logbufsecs="0" --logging_level="INFO"
--max_completed_executors_per_framework="150" --oversubscribed_resources_interval="15secs"
--perf_duration="10secs" --perf_interval="1mins" --qos_correction_interval_min="0ns" --quiet="false"
--recover="reconnect" --recovery_timeout="15mins" --registration_backoff_factor="10ms" --resources="cpus:2;gpus:0;mem:1024;disk:1024;ports:[31000-32000]"
--revocable_cpu_low_priority="true" --runtime_dir="/tmp/Endpoint_SlaveEndpointTest_UnauthorizedRequest_0_4eroTq"
--sandbox_directory="/mnt/mesos/sandbox" --strict="true" --switch_user="true" --systemd_enable_support="true"
--systemd_runtime_directory="/run/systemd/system" --version="false" --work_dir="/tmp/Endpoint_SlaveEndpointTest_UnauthorizedRequest_0_C907aA"
I0214 13:54:00.130738 27158 credentials.hpp:86] Loading credential for authentication from
'/tmp/Endpoint_SlaveEndpointTest_UnauthorizedRequest_0_4eroTq/credential'
I0214 13:54:00.130827 27158 slave.cpp:354] Agent using credential for: test-principal
I0214 13:54:00.130846 27158 credentials.hpp:37] Loading credentials for authentication from
'/tmp/Endpoint_SlaveEndpointTest_UnauthorizedRequest_0_4eroTq/http_credentials'
I0214 13:54:00.130965 27158 http.cpp:919] Using default 'basic' HTTP authenticator for realm
'mesos-agent-readonly'
I0214 13:54:00.131014 27158 http.cpp:919] Using default 'basic' HTTP authenticator for realm
'mesos-agent-readwrite'
I0214 13:54:00.131420 27158 slave.cpp:541] Agent resources: cpus(*):2; mem(*):1024; disk(*):1024;
ports(*):[31000-32000]
I0214 13:54:00.131456 27158 slave.cpp:549] Agent attributes: [  ]
I0214 13:54:00.131463 27158 slave.cpp:554] Agent hostname: d28ca37380df
I0214 13:54:00.131536 27166 status_update_manager.cpp:177] Pausing sending status updates
I0214 13:54:00.132014 27156 state.cpp:62] Recovering state from '/tmp/Endpoint_SlaveEndpointTest_UnauthorizedRequest_0_C907aA/meta'
I0214 13:54:00.132226 27162 status_update_manager.cpp:203] Recovering status update manager
I0214 13:54:00.132311 27167 containerizer.cpp:599] Recovering containerizer
I0214 13:54:00.132974 27159 provisioner.cpp:410] Provisioner recovery complete
I0214 13:54:00.133177 27160 slave.cpp:5555] Finished recovery
I0214 13:54:00.133579 27160 slave.cpp:5729] Querying resource estimator for oversubscribable
resources
I0214 13:54:00.133741 27170 slave.cpp:5743] Received oversubscribable resources {} from the
resource estimator
I0214 13:54:00.134620 27165 process.cpp:3704] Handling HTTP event for process 'slave(694)'
with path: '/slave(694)/monitor/statistics'
I0214 13:54:00.135135 27157 http.cpp:871] Authorizing principal 'test-principal' to GET the
'/monitor/statistics' endpoint
I0214 13:54:00.136361 27156 slave.cpp:803] Agent terminating
[       OK ] Endpoint/SlaveEndpointTest.UnauthorizedRequest/0 (12 ms)
[ RUN      ] Endpoint/SlaveEndpointTest.UnauthorizedRequest/1
I0214 13:54:00.192443 27154 containerizer.cpp:220] Using isolation: posix/cpu,posix/mem,filesystem/posix,network/cni
W0214 13:54:00.226390 27154 backend.cpp:76] Failed to create 'aufs' backend: AufsBackend requires
root privileges
W0214 13:54:00.226441 27154 backend.cpp:76] Failed to create 'bind' backend: BindBackend requires
root privileges
I0214 13:54:00.226455 27154 provisioner.cpp:249] Using default backend 'copy'
I0214 13:54:00.227649 27167 slave.cpp:211] Mesos agent started on (695)@172.17.0.3:45143
I0214 13:54:00.227664 27167 slave.cpp:212] Flags at startup: --acls="" --appc_simple_discovery_uri_prefix="http://"
--appc_store_dir="/tmp/mesos/store/appc" --authenticate_http_readonly="true" --authenticate_http_readwrite="true"
--authenticatee="crammd5" --authentication_backoff_factor="1secs" --authorizer="local" --cgroups_cpu_enable_pids_and_tids_count="false"
--cgroups_enable_cfs="false" --cgroups_hierarchy="/sys/fs/cgroup" --cgroups_limit_swap="false"
--cgroups_root="mesos" --container_disk_watch_interval="15secs" --containerizers="mesos" --credential="/tmp/Endpoint_SlaveEndpointTest_UnauthorizedRequest_1_Co5lgQ/credential"
--default_role="*" --disk_watch_interval="1mins" --docker="docker" --docker_kill_orphans="true"
--docker_registry="https://registry-1.docker.io" --docker_remove_delay="6hrs" --docker_socket="/var/run/docker.sock"
--docker_stop_timeout="0ns" --docker_store_dir="/tmp/mesos/store/docker" --docker_volume_checkpoint_dir="/var/run/mesos/isolators/docker/volume"
--enforce_container_disk_quota="false" --executor_registration_timeout="1mins" --executor_shutdown_grace_period="5secs"
--fetcher_cache_dir="/tmp/Endpoint_SlaveEndpointTest_UnauthorizedRequest_1_Co5lgQ/fetch" --fetcher_cache_size="2GB"
--frameworks_home="" --gc_delay="1weeks" --gc_disk_headroom="0.1" --hadoop_home="" --help="false"
--hostname_lookup="true" --http_authenticators="basic" --http_command_executor="false" --http_credentials="/tmp/Endpoint_SlaveEndpointTest_UnauthorizedRequest_1_Co5lgQ/http_credentials"
--http_heartbeat_interval="30secs" --initialize_driver_logging="true" --isolation="posix/cpu,posix/mem"
--launcher="posix" --launcher_dir="/mesos/build/src" --logbufsecs="0" --logging_level="INFO"
--max_completed_executors_per_framework="150" --oversubscribed_resources_interval="15secs"
--perf_duration="10secs" --perf_interval="1mins" --qos_correction_interval_min="0ns" --quiet="false"
--recover="reconnect" --recovery_timeout="15mins" --registration_backoff_factor="10ms" --resources="cpus:2;gpus:0;mem:1024;disk:1024;ports:[31000-32000]"
--revocable_cpu_low_priority="true" --runtime_dir="/tmp/Endpoint_SlaveEndpointTest_UnauthorizedRequest_1_Co5lgQ"
--sandbox_directory="/mnt/mesos/sandbox" --strict="true" --switch_user="true" --systemd_enable_support="true"
--systemd_runtime_directory="/run/systemd/system" --version="false" --work_dir="/tmp/Endpoint_SlaveEndpointTest_UnauthorizedRequest_1_evjJnZ"
I0214 13:54:00.228001 27167 credentials.hpp:86] Loading credential for authentication from
'/tmp/Endpoint_SlaveEndpointTest_UnauthorizedRequest_1_Co5lgQ/credential'
I0214 13:54:00.228085 27167 slave.cpp:354] Agent using credential for: test-principal
I0214 13:54:00.228096 27167 credentials.hpp:37] Loading credentials for authentication from
'/tmp/Endpoint_SlaveEndpointTest_UnauthorizedRequest_1_Co5lgQ/http_credentials'
I0214 13:54:00.228188 27167 http.cpp:919] Using default 'basic' HTTP authenticator for realm
'mesos-agent-readonly'
I0214 13:54:00.228237 27167 http.cpp:919] Using default 'basic' HTTP authenticator for realm
'mesos-agent-readwrite'
I0214 13:54:00.228667 27167 slave.cpp:541] Agent resources: cpus(*):2; mem(*):1024; disk(*):1024;
ports(*):[31000-32000]
I0214 13:54:00.228703 27167 slave.cpp:549] Agent attributes: [  ]
I0214 13:54:00.228708 27167 slave.cpp:554] Agent hostname: d28ca37380df
I0214 13:54:00.228821 27155 status_update_manager.cpp:177] Pausing sending status updates
I0214 13:54:00.229019 27155 state.cpp:62] Recovering state from '/tmp/Endpoint_SlaveEndpointTest_UnauthorizedRequest_1_evjJnZ/meta'
I0214 13:54:00.229197 27160 status_update_manager.cpp:203] Recovering status update manager
I0214 13:54:00.229322 27166 containerizer.cpp:599] Recovering containerizer
I0214 13:54:00.229831 27155 provisioner.cpp:410] Provisioner recovery complete
I0214 13:54:00.229950 27158 slave.cpp:5555] Finished recovery
I0214 13:54:00.230247 27158 slave.cpp:5729] Querying resource estimator for oversubscribable
resources
I0214 13:54:00.230376 27158 slave.cpp:5743] Received oversubscribable resources {} from the
resource estimator
I0214 13:54:00.231109 27157 process.cpp:3704] Handling HTTP event for process 'slave(695)'
with path: '/slave(695)/monitor/statistics.json'
I0214 13:54:00.231554 27157 http.cpp:871] Authorizing principal 'test-principal' to GET the
'/monitor/statistics.json' endpoint
I0214 13:54:00.232481 27168 slave.cpp:803] Agent terminating
[       OK ] Endpoint/SlaveEndpointTest.UnauthorizedRequest/1 (87 ms)
[ RUN      ] Endpoint/SlaveEndpointTest.UnauthorizedRequest/2
I0214 13:54:00.282819 27154 containerizer.cpp:220] Using isolation: posix/cpu,posix/mem,filesystem/posix,network/cni
W0214 13:54:00.283120 27154 backend.cpp:76] Failed to create 'aufs' backend: AufsBackend requires
root privileges
W0214 13:54:00.283150 27154 backend.cpp:76] Failed to create 'bind' backend: BindBackend requires
root privileges
I0214 13:54:00.283162 27154 provisioner.cpp:249] Using default backend 'copy'
I0214 13:54:00.284093 27165 slave.cpp:211] Mesos agent started on (696)@172.17.0.3:45143
I0214 13:54:00.284111 27165 slave.cpp:212] Flags at startup: --acls="" --appc_simple_discovery_uri_prefix="http://"
--appc_store_dir="/tmp/mesos/store/appc" --authenticate_http_readonly="true" --authenticate_http_readwrite="true"
--authenticatee="crammd5" --authentication_backoff_factor="1secs" --authorizer="local" --cgroups_cpu_enable_pids_and_tids_count="false"
--cgroups_enable_cfs="false" --cgroups_hierarchy="/sys/fs/cgroup" --cgroups_limit_swap="false"
--cgroups_root="mesos" --container_disk_watch_interval="15secs" --containerizers="mesos" --credential="/tmp/Endpoint_SlaveEndpointTest_UnauthorizedRequest_2_cDffBg/credential"
--default_role="*" --disk_watch_interval="1mins" --docker="docker" --docker_kill_orphans="true"
--docker_registry="https://registry-1.docker.io" --docker_remove_delay="6hrs" --docker_socket="/var/run/docker.sock"
--docker_stop_timeout="0ns" --docker_store_dir="/tmp/mesos/store/docker" --docker_volume_checkpoint_dir="/var/run/mesos/isolators/docker/volume"
--enforce_container_disk_quota="false" --executor_registration_timeout="1mins" --executor_shutdown_grace_period="5secs"
--fetcher_cache_dir="/tmp/Endpoint_SlaveEndpointTest_UnauthorizedRequest_2_cDffBg/fetch" --fetcher_cache_size="2GB"
--frameworks_home="" --gc_delay="1weeks" --gc_disk_headroom="0.1" --hadoop_home="" --help="false"
--hostname_lookup="true" --http_authenticators="basic" --http_command_executor="false" --http_credentials="/tmp/Endpoint_SlaveEndpointTest_UnauthorizedRequest_2_cDffBg/http_credentials"
--http_heartbeat_interval="30secs" --initialize_driver_logging="true" --isolation="posix/cpu,posix/mem"
--launcher="posix" --launcher_dir="/mesos/build/src" --logbufsecs="0" --logging_level="INFO"
--max_completed_executors_per_framework="150" --oversubscribed_resources_interval="15secs"
--perf_duration="10secs" --perf_interval="1mins" --qos_correction_interval_min="0ns" --quiet="false"
--recover="reconnect" --recovery_timeout="15mins" --registration_backoff_factor="10ms" --resources="cpus:2;gpus:0;mem:1024;disk:1024;ports:[31000-32000]"
--revocable_cpu_low_priority="true" --runtime_dir="/tmp/Endpoint_SlaveEndpointTest_UnauthorizedRequest_2_cDffBg"
--sandbox_directory="/mnt/mesos/sandbox" --strict="true" --switch_user="true" --systemd_enable_support="true"
--systemd_runtime_directory="/run/systemd/system" --version="false" --work_dir="/tmp/Endpoint_SlaveEndpointTest_UnauthorizedRequest_2_iEWStp"
I0214 13:54:00.284430 27165 credentials.hpp:86] Loading credential for authentication from
'/tmp/Endpoint_SlaveEndpointTest_UnauthorizedRequest_2_cDffBg/credential'
I0214 13:54:00.284514 27165 slave.cpp:354] Agent using credential for: test-principal
I0214 13:54:00.284530 27165 credentials.hpp:37] Loading credentials for authentication from
'/tmp/Endpoint_SlaveEndpointTest_UnauthorizedRequest_2_cDffBg/http_credentials'
I0214 13:54:00.284634 27165 http.cpp:919] Using default 'basic' HTTP authenticator for realm
'mesos-agent-readonly'
I0214 13:54:00.284700 27165 http.cpp:919] Using default 'basic' HTTP authenticator for realm
'mesos-agent-readwrite'
I0214 13:54:00.285107 27165 slave.cpp:541] Agent resources: cpus(*):2; mem(*):1024; disk(*):1024;
ports(*):[31000-32000]
I0214 13:54:00.285147 27165 slave.cpp:549] Agent attributes: [  ]
I0214 13:54:00.285154 27165 slave.cpp:554] Agent hostname: d28ca37380df
I0214 13:54:00.285233 27161 status_update_manager.cpp:177] Pausing sending status updates
I0214 13:54:00.285655 27155 state.cpp:62] Recovering state from '/tmp/Endpoint_SlaveEndpointTest_UnauthorizedRequest_2_iEWStp/meta'
I0214 13:54:00.285810 27168 status_update_manager.cpp:203] Recovering status update manager
I0214 13:54:00.285980 27162 containerizer.cpp:599] Recovering containerizer
I0214 13:54:00.286460 27170 provisioner.cpp:410] Provisioner recovery complete
I0214 13:54:00.286604 27159 slave.cpp:5555] Finished recovery
I0214 13:54:00.286972 27159 slave.cpp:5729] Querying resource estimator for oversubscribable
resources
I0214 13:54:00.287112 27167 slave.cpp:5743] Received oversubscribable resources {} from the
resource estimator
I0214 13:54:00.287870 27165 process.cpp:3704] Handling HTTP event for process 'slave(696)'
with path: '/slave(696)/containers'
I0214 13:54:00.288244 27163 http.cpp:871] Authorizing principal 'test-principal' to GET the
'/containers' endpoint
I0214 13:54:00.289118 27157 slave.cpp:803] Agent terminating
[       OK ] Endpoint/SlaveEndpointTest.UnauthorizedRequest/2 (12 ms)
[ RUN      ] Endpoint/SlaveEndpointTest.NoAuthorizer/0
I0214 13:54:00.321352 27154 containerizer.cpp:220] Using isolation: posix/cpu,posix/mem,filesystem/posix,network/cni
W0214 13:54:00.321594 27154 backend.cpp:76] Failed to create 'aufs' backend: AufsBackend requires
root privileges
W0214 13:54:00.321629 27154 backend.cpp:76] Failed to create 'bind' backend: BindBackend requires
root privileges
I0214 13:54:00.321640 27154 provisioner.cpp:249] Using default backend 'copy'
I0214 13:54:00.322079 27154 cluster.cpp:446] Creating default 'local' authorizer
I0214 13:54:00.322562 27161 slave.cpp:211] Mesos agent started on (697)@172.17.0.3:45143
I0214 13:54:00.322578 27161 slave.cpp:212] Flags at startup: --acls="" --appc_simple_discovery_uri_prefix="http://"
--appc_store_dir="/tmp/mesos/store/appc" --authenticate_http_readonly="true" --authenticate_http_readwrite="true"
--authenticatee="crammd5" --authentication_backoff_factor="1secs" --authorizer="local" --cgroups_cpu_enable_pids_and_tids_count="false"
--cgroups_enable_cfs="false" --cgroups_hierarchy="/sys/fs/cgroup" --cgroups_limit_swap="false"
--cgroups_root="mesos" --container_disk_watch_interval="15secs" --containerizers="mesos" --credential="/tmp/Endpoint_SlaveEndpointTest_NoAuthorizer_0_qfqaoH/credential"
--default_role="*" --disk_watch_interval="1mins" --docker="docker" --docker_kill_orphans="true"
--docker_registry="https://registry-1.docker.io" --docker_remove_delay="6hrs" --docker_socket="/var/run/docker.sock"
--docker_stop_timeout="0ns" --docker_store_dir="/tmp/mesos/store/docker" --docker_volume_checkpoint_dir="/var/run/mesos/isolators/docker/volume"
--enforce_container_disk_quota="false" --executor_registration_timeout="1mins" --executor_shutdown_grace_period="5secs"
--fetcher_cache_dir="/tmp/Endpoint_SlaveEndpointTest_NoAuthorizer_0_qfqaoH/fetch" --fetcher_cache_size="2GB"
--frameworks_home="" --gc_delay="1weeks" --gc_disk_headroom="0.1" --hadoop_home="" --help="false"
--hostname_lookup="true" --http_authenticators="basic" --http_command_executor="false" --http_credentials="/tmp/Endpoint_SlaveEndpointTest_NoAuthorizer_0_qfqaoH/http_credentials"
--http_heartbeat_interval="30secs" --initialize_driver_logging="true" --isolation="posix/cpu,posix/mem"
--launcher="posix" --launcher_dir="/mesos/build/src" --logbufsecs="0" --logging_level="INFO"
--max_completed_executors_per_framework="150" --oversubscribed_resources_interval="15secs"
--perf_duration="10secs" --perf_interval="1mins" --qos_correction_interval_min="0ns" --quiet="false"
--recover="reconnect" --recovery_timeout="15mins" --registration_backoff_factor="10ms" --resources="cpus:2;gpus:0;mem:1024;disk:1024;ports:[31000-32000]"
--revocable_cpu_low_priority="true" --runtime_dir="/tmp/Endpoint_SlaveEndpointTest_NoAuthorizer_0_qfqaoH"
--sandbox_directory="/mnt/mesos/sandbox" --strict="true" --switch_user="true" --systemd_enable_support="true"
--systemd_runtime_directory="/run/systemd/system" --version="false" --work_dir="/tmp/Endpoint_SlaveEndpointTest_NoAuthorizer_0_mtRxaQ"
I0214 13:54:00.323036 27161 credentials.hpp:86] Loading credential for authentication from
'/tmp/Endpoint_SlaveEndpointTest_NoAuthorizer_0_qfqaoH/credential'
I0214 13:54:00.323119 27161 slave.cpp:354] Agent using credential for: test-principal
I0214 13:54:00.323135 27161 credentials.hpp:37] Loading credentials for authentication from
'/tmp/Endpoint_SlaveEndpointTest_NoAuthorizer_0_qfqaoH/http_credentials'
I0214 13:54:00.323237 27161 http.cpp:919] Using default 'basic' HTTP authenticator for realm
'mesos-agent-readonly'
I0214 13:54:00.323279 27161 http.cpp:919] Using default 'basic' HTTP authenticator for realm
'mesos-agent-readwrite'
I0214 13:54:00.323832 27161 slave.cpp:541] Agent resources: cpus(*):2; mem(*):1024; disk(*):1024;
ports(*):[31000-32000]
I0214 13:54:00.323865 27161 slave.cpp:549] Agent attributes: [  ]
I0214 13:54:00.323871 27161 slave.cpp:554] Agent hostname: d28ca37380df
I0214 13:54:00.323936 27155 status_update_manager.cpp:177] Pausing sending status updates
I0214 13:54:00.324200 27157 state.cpp:62] Recovering state from '/tmp/Endpoint_SlaveEndpointTest_NoAuthorizer_0_mtRxaQ/meta'
I0214 13:54:00.324326 27161 status_update_manager.cpp:203] Recovering status update manager
I0214 13:54:00.324409 27160 containerizer.cpp:599] Recovering containerizer
I0214 13:54:00.324910 27160 provisioner.cpp:410] Provisioner recovery complete
I0214 13:54:00.325140 27165 slave.cpp:5555] Finished recovery
I0214 13:54:00.325454 27165 slave.cpp:5729] Querying resource estimator for oversubscribable
resources
I0214 13:54:00.325565 27168 slave.cpp:5743] Received oversubscribable resources {} from the
resource estimator
I0214 13:54:00.328233 27170 process.cpp:3704] Handling HTTP event for process 'slave(697)'
with path: '/slave(697)/monitor/statistics'
I0214 13:54:00.328593 27159 http.cpp:871] Authorizing principal 'test-principal' to GET the
'/monitor/statistics' endpoint
I0214 13:54:00.329823 27157 slave.cpp:803] Agent terminating
[       OK ] Endpoint/SlaveEndpointTest.NoAuthorizer/0 (12 ms)
[ RUN      ] Endpoint/SlaveEndpointTest.NoAuthorizer/1
I0214 13:54:00.371207 27154 containerizer.cpp:220] Using isolation: posix/cpu,posix/mem,filesystem/posix,network/cni
W0214 13:54:00.371493 27154 backend.cpp:76] Failed to create 'aufs' backend: AufsBackend requires
root privileges
W0214 13:54:00.371532 27154 backend.cpp:76] Failed to create 'bind' backend: BindBackend requires
root privileges
I0214 13:54:00.371552 27154 provisioner.cpp:249] Using default backend 'copy'
I0214 13:54:00.372228 27154 cluster.cpp:446] Creating default 'local' authorizer
I0214 13:54:00.372771 27161 slave.cpp:211] Mesos agent started on (698)@172.17.0.3:45143
I0214 13:54:00.372802 27161 slave.cpp:212] Flags at startup: --acls="" --appc_simple_discovery_uri_prefix="http://"
--appc_store_dir="/tmp/mesos/store/appc" --authenticate_http_readonly="true" --authenticate_http_readwrite="true"
--authenticatee="crammd5" --authentication_backoff_factor="1secs" --authorizer="local" --cgroups_cpu_enable_pids_and_tids_count="false"
--cgroups_enable_cfs="false" --cgroups_hierarchy="/sys/fs/cgroup" --cgroups_limit_swap="false"
--cgroups_root="mesos" --container_disk_watch_interval="15secs" --containerizers="mesos" --credential="/tmp/Endpoint_SlaveEndpointTest_NoAuthorizer_1_cHXAF8/credential"
--default_role="*" --disk_watch_interval="1mins" --docker="docker" --docker_kill_orphans="true"
--docker_registry="https://registry-1.docker.io" --docker_remove_delay="6hrs" --docker_socket="/var/run/docker.sock"
--docker_stop_timeout="0ns" --docker_store_dir="/tmp/mesos/store/docker" --docker_volume_checkpoint_dir="/var/run/mesos/isolators/docker/volume"
--enforce_container_disk_quota="false" --executor_registration_timeout="1mins" --executor_shutdown_grace_period="5secs"
--fetcher_cache_dir="/tmp/Endpoint_SlaveEndpointTest_NoAuthorizer_1_cHXAF8/fetch" --fetcher_cache_size="2GB"
--frameworks_home="" --gc_delay="1weeks" --gc_disk_headroom="0.1" --hadoop_home="" --help="false"
--hostname_lookup="true" --http_authenticators="basic" --http_command_executor="false" --http_credentials="/tmp/Endpoint_SlaveEndpointTest_NoAuthorizer_1_cHXAF8/http_credentials"
--http_heartbeat_interval="30secs" --initialize_driver_logging="true" --isolation="posix/cpu,posix/mem"
--launcher="posix" --launcher_dir="/mesos/build/src" --logbufsecs="0" --logging_level="INFO"
--max_completed_executors_per_framework="150" --oversubscribed_resources_interval="15secs"
--perf_duration="10secs" --perf_interval="1mins" --qos_correction_interval_min="0ns" --quiet="false"
--recover="reconnect" --recovery_timeout="15mins" --registration_backoff_factor="10ms" --resources="cpus:2;gpus:0;mem:1024;disk:1024;ports:[31000-32000]"
--revocable_cpu_low_priority="true" --runtime_dir="/tmp/Endpoint_SlaveEndpointTest_NoAuthorizer_1_cHXAF8"
--sandbox_directory="/mnt/mesos/sandbox" --strict="true" --switch_user="true" --systemd_enable_support="true"
--systemd_runtime_directory="/run/systemd/system" --version="false" --work_dir="/tmp/Endpoint_SlaveEndpointTest_NoAuthorizer_1_QF0Sjh"
I0214 13:54:00.373183 27161 credentials.hpp:86] Loading credential for authentication from
'/tmp/Endpoint_SlaveEndpointTest_NoAuthorizer_1_cHXAF8/credential'
I0214 13:54:00.373299 27161 slave.cpp:354] Agent using credential for: test-principal
I0214 13:54:00.373318 27161 credentials.hpp:37] Loading credentials for authentication from
'/tmp/Endpoint_SlaveEndpointTest_NoAuthorizer_1_cHXAF8/http_credentials'
I0214 13:54:00.373461 27161 http.cpp:919] Using default 'basic' HTTP authenticator for realm
'mesos-agent-readonly'
I0214 13:54:00.373517 27161 http.cpp:919] Using default 'basic' HTTP authenticator for realm
'mesos-agent-readwrite'
I0214 13:54:00.373909 27161 slave.cpp:541] Agent resources: cpus(*):2; mem(*):1024; disk(*):1024;
ports(*):[31000-32000]
I0214 13:54:00.373950 27161 slave.cpp:549] Agent attributes: [  ]
I0214 13:54:00.373958 27161 slave.cpp:554] Agent hostname: d28ca37380df
I0214 13:54:00.374294 27161 status_update_manager.cpp:177] Pausing sending status updates
I0214 13:54:00.374529 27161 state.cpp:62] Recovering state from '/tmp/Endpoint_SlaveEndpointTest_NoAuthorizer_1_QF0Sjh/meta'
I0214 13:54:00.374666 27161 status_update_manager.cpp:203] Recovering status update manager
I0214 13:54:00.374721 27161 containerizer.cpp:599] Recovering containerizer
I0214 13:54:00.375119 27161 provisioner.cpp:410] Provisioner recovery complete
I0214 13:54:00.375253 27161 slave.cpp:5555] Finished recovery
I0214 13:54:00.375576 27161 slave.cpp:5729] Querying resource estimator for oversubscribable
resources
I0214 13:54:00.375775 27165 slave.cpp:5743] Received oversubscribable resources {} from the
resource estimator
I0214 13:54:00.376580 27159 process.cpp:3704] Handling HTTP event for process 'slave(698)'
with path: '/slave(698)/monitor/statistics.json'
I0214 13:54:00.376936 27168 http.cpp:871] Authorizing principal 'test-principal' to GET the
'/monitor/statistics.json' endpoint
I0214 13:54:00.378736 27163 slave.cpp:803] Agent terminating
[       OK ] Endpoint/SlaveEndpointTest.NoAuthorizer/1 (43 ms)
[ RUN      ] Endpoint/SlaveEndpointTest.NoAuthorizer/2
I0214 13:54:00.414419 27154 containerizer.cpp:220] Using isolation: posix/cpu,posix/mem,filesystem/posix,network/cni
W0214 13:54:00.414749 27154 backend.cpp:76] Failed to create 'aufs' backend: AufsBackend requires
root privileges
W0214 13:54:00.414793 27154 backend.cpp:76] Failed to create 'bind' backend: BindBackend requires
root privileges
I0214 13:54:00.414809 27154 provisioner.cpp:249] Using default backend 'copy'
I0214 13:54:00.415599 27154 cluster.cpp:446] Creating default 'local' authorizer
I0214 13:54:00.416162 27159 slave.cpp:211] Mesos agent started on (699)@172.17.0.3:45143
I0214 13:54:00.416380 27159 slave.cpp:212] Flags at startup: --acls="" --appc_simple_discovery_uri_prefix="http://"
--appc_store_dir="/tmp/mesos/store/appc" --authenticate_http_readonly="true" --authenticate_http_readwrite="true"
--authenticatee="crammd5" --authentication_backoff_factor="1secs" --authorizer="local" --cgroups_cpu_enable_pids_and_tids_count="false"
--cgroups_enable_cfs="false" --cgroups_hierarchy="/sys/fs/cgroup" --cgroups_limit_swap="false"
--cgroups_root="mesos" --container_disk_watch_interval="15secs" --containerizers="mesos" --credential="/tmp/Endpoint_SlaveEndpointTest_NoAuthorizer_2_mRE2pA/credential"
--default_role="*" --disk_watch_interval="1mins" --docker="docker" --docker_kill_orphans="true"
--docker_registry="https://registry-1.docker.io" --docker_remove_delay="6hrs" --docker_socket="/var/run/docker.sock"
--docker_stop_timeout="0ns" --docker_store_dir="/tmp/mesos/store/docker" --docker_volume_checkpoint_dir="/var/run/mesos/isolators/docker/volume"
--enforce_container_disk_quota="false" --executor_registration_timeout="1mins" --executor_shutdown_grace_period="5secs"
--fetcher_cache_dir="/tmp/Endpoint_SlaveEndpointTest_NoAuthorizer_2_mRE2pA/fetch" --fetcher_cache_size="2GB"
--frameworks_home="" --gc_delay="1weeks" --gc_disk_headroom="0.1" --hadoop_home="" --help="false"
--hostname_lookup="true" --http_authenticators="basic" --http_command_executor="false" --http_credentials="/tmp/Endpoint_SlaveEndpointTest_NoAuthorizer_2_mRE2pA/http_credentials"
--http_heartbeat_interval="30secs" --initialize_driver_logging="true" --isolation="posix/cpu,posix/mem"
--launcher="posix" --launcher_dir="/mesos/build/src" --logbufsecs="0" --logging_level="INFO"
--max_completed_executors_per_framework="150" --oversubscribed_resources_interval="15secs"
--perf_duration="10secs" --perf_interval="1mins" --qos_correction_interval_min="0ns" --quiet="false"
--recover="reconnect" --recovery_timeout="15mins" --registration_backoff_factor="10ms" --resources="cpus:2;gpus:0;mem:1024;disk:1024;ports:[31000-32000]"
--revocable_cpu_low_priority="true" --runtime_dir="/tmp/Endpoint_SlaveEndpointTest_NoAuthorizer_2_mRE2pA"
--sandbox_directory="/mnt/mesos/sandbox" --strict="true" --switch_user="true" --systemd_enable_support="true"
--systemd_runtime_directory="/run/systemd/system" --version="false" --work_dir="/tmp/Endpoint_SlaveEndpointTest_NoAuthorizer_2_oJBmXI"
I0214 13:54:00.416913 27159 credentials.hpp:86] Loading credential for authentication from
'/tmp/Endpoint_SlaveEndpointTest_NoAuthorizer_2_mRE2pA/credential'
I0214 13:54:00.417029 27159 slave.cpp:354] Agent using credential for: test-principal
I0214 13:54:00.417047 27159 credentials.hpp:37] Loading credentials for authentication from
'/tmp/Endpoint_SlaveEndpointTest_NoAuthorizer_2_mRE2pA/http_credentials'
I0214 13:54:00.417174 27159 http.cpp:919] Using default 'basic' HTTP authenticator for realm
'mesos-agent-readonly'
I0214 13:54:00.417228 27159 http.cpp:919] Using default 'basic' HTTP authenticator for realm
'mesos-agent-readwrite'
I0214 13:54:00.417630 27159 slave.cpp:541] Agent resources: cpus(*):2; mem(*):1024; disk(*):1024;
ports(*):[31000-32000]
I0214 13:54:00.417682 27159 slave.cpp:549] Agent attributes: [  ]
I0214 13:54:00.417695 27159 slave.cpp:554] Agent hostname: d28ca37380df
I0214 13:54:00.417981 27155 status_update_manager.cpp:177] Pausing sending status updates
I0214 13:54:00.418119 27159 state.cpp:62] Recovering state from '/tmp/Endpoint_SlaveEndpointTest_NoAuthorizer_2_oJBmXI/meta'
I0214 13:54:00.418341 27159 status_update_manager.cpp:203] Recovering status update manager
I0214 13:54:00.418421 27168 containerizer.cpp:599] Recovering containerizer
I0214 13:54:00.418915 27170 provisioner.cpp:410] Provisioner recovery complete
I0214 13:54:00.419035 27170 slave.cpp:5555] Finished recovery
I0214 13:54:00.419322 27170 slave.cpp:5729] Querying resource estimator for oversubscribable
resources
I0214 13:54:00.419929 27170 slave.cpp:5743] Received oversubscribable resources {} from the
resource estimator
I0214 13:54:00.420825 27167 process.cpp:3704] Handling HTTP event for process 'slave(699)'
with path: '/slave(699)/containers'
I0214 13:54:00.421372 27169 http.cpp:871] Authorizing principal 'test-principal' to GET the
'/containers' endpoint
I0214 13:54:00.422864 27167 slave.cpp:803] Agent terminating
[       OK ] Endpoint/SlaveEndpointTest.NoAuthorizer/2 (50 ms)
[----------] 9 tests from Endpoint/SlaveEndpointTest (490 ms total)

[----------] Global test environment tear-down
/mesos/src/tests/environment.cpp:836: Failure
Failed
Tests completed with child processes remaining:
-+- 27154 src/mesos-tests 
 \-+- 30891 /mesos/build/src/mesos-containerizer launch 
   \--- 30892 mesos-executor --launcher_dir=/mesos/build/src 
[==========] 1442 tests from 160 test cases ran. (456946 ms total)
[  PASSED  ] 1440 tests.
[  FAILED  ] 2 tests, listed below:
[  FAILED  ] OversubscriptionTest.RescindRevocableOfferWithIncreasedRevocable
[  FAILED  ] MesosContainerizerSlaveRecoveryTest.ResourceStatistics

 2 FAILED TESTS
  YOU HAVE 12 DISABLED TESTS

I0214 13:54:00.537335 30903 exec.cpp:488] Agent exited, but framework has checkpointing enabled.
Waiting 15mins to reconnect with agent 0b62471b-e8fc-4781-86a3-97f82fc402bd-S0
make[3]: *** [CMakeFiles/check] Error 1
make[3]: Leaving directory `/mesos/build'
make[2]: *** [CMakeFiles/check.dir/all] Error 2
make[2]: Leaving directory `/mesos/build'
make[1]: *** [CMakeFiles/check.dir/rule] Error 2
make[1]: Leaving directory `/mesos/build'
make: *** [check] Error 2
+ docker rmi mesos-1487075472-3195
Untagged: mesos-1487075472-3195:latest
Deleted: sha256:979e2bf91def8be43cf359ffc732a4c4d5494bee270d8eeabd19328dc73ceac5
Deleted: sha256:edc0fcf08b8b6210a271d356e90ce30048e23f8c145219f17a53ee356fa979f6
Deleted: sha256:abb7d09fc7e3a4df8ef61211751e9485a023ff496106836ca77bcd66e5edc145
Deleted: sha256:87b5665c4a182d68582804a2703ad5746f316c50aa5ff4d812ee9fcaac3a2485
Deleted: sha256:61c0c1760f12e2694ea13a144e93916ade99491956166036441f3a460b0d7fd9
Deleted: sha256:4e03cdf945f112a140ab8b7f7d0abad3b251b385c9471371bb4e59010aa53501
Deleted: sha256:5b516e785faaed05cf7dd4abb335d38138e3da7e5d71903cc1ca0786c223342d
Deleted: sha256:cfc813545502534e09b0d945892f5ee6c30eb4c62ea56971ba640a0ff88c0266
Deleted: sha256:171eca1e9325a5e143bd39615fbab985398c135cb558d4e362ab973f7a4384af
Deleted: sha256:0bfd7cb9b1c9c9ff1cd2b344e339588cfeccddf50392d159f0d50df8dda3d994
Deleted: sha256:3ca62f6e3960b46ba4330cc03728cca78246371db6da96ac83b7044f6708864d
Deleted: sha256:a71ef782ac8771a0a067d4e9bbc23edb1927ba12676b9db293432810f3b5024a
Deleted: sha256:230fcc412d65bfafeb6ec2f703ec0701e1d718afb11c33732d667a20f52d45d7
Deleted: sha256:0d89b00858c49518b6c4f84d0e306747bda7489a2aa5267322e90f28f109555f
Deleted: sha256:072b6d082ebb8bde41bea1d51846f25a430f5bdd88225d0c50416bbea0b7cecb
Deleted: sha256:18a154cbec9a2b87ae90a39e35b78feb9cd2b9fa67841f5ba6088430604eb64a
Deleted: sha256:978b2779bddab704810174516859ed1e5da3e174e1c9f606bbc76e9df8fc4a08
Deleted: sha256:77f3477e6cb6490991ee79e870fc34d84ce0306fdc84c432593309ddfc931c06
Deleted: sha256:3f725ba9a254946f0b2b421a3dccda37f397842eac72ab56132d06d44cbbd03f
Deleted: sha256:44cdf2433f0f7a2fbf13f6ad1fe74351df7ea4a04e92df806e14dfeaa45c8edf
Deleted: sha256:15d4474ccb6c60d691d95e87bc313a311a947b2cb7f8de5aaf225f711e25b5de
Deleted: sha256:36dc8589ff5f7d8ce01e5d5550e8ca5d7eed2920302446261ca08db1a5a59740
Deleted: sha256:f1585d2407ff9ff2bcfad24c972fe789fddebc07e76812103b974ea84db450c4
Deleted: sha256:2c719767a6d9ae98928581a4a7d9686d9b9a9f8bd742c24f926eb19f56f00acb
Build step 'Execute shell' marked build as failure

Mime
View raw message