mesos-builds mailing list archives

Site index · List index
Message view « Date » · « Thread »
Top « Date » · « Thread »
From Apache Jenkins Server <jenk...@builds.apache.org>
Subject Build failed in Jenkins: Mesos-Buildbot » cmake,gcc,--verbose --enable-libevent --enable-ssl,GLOG_v=1 MESOS_VERBOSE=1,ubuntu:14.04,(docker||Hadoop)&&(!ubuntu-us1)&&(!ubuntu-eu2) #3311
Date Sat, 25 Feb 2017 05:17:11 GMT
See <https://builds.apache.org/job/Mesos-Buildbot/BUILDTOOL=cmake,COMPILER=gcc,CONFIGURATION=--verbose%20--enable-libevent%20--enable-ssl,ENVIRONMENT=GLOG_v=1%20MESOS_VERBOSE=1,OS=ubuntu%3A14.04,label_exp=(docker%7C%7CHadoop)&&(!ubuntu-us1)&&(!ubuntu-eu2)/3311/display/redirect?page=changes>

Changes:

[benjamin.hindman] Made sure process::Loop instances can only be created as shared_ptrs.

------------------------------------------
[...truncated 24.66 MB...]
I0225 05:16:38.954471 27101 status_update_manager.cpp:177] Pausing sending status updates
I0225 05:16:38.954778 27103 state.cpp:62] Recovering state from '/tmp/Endpoint_SlaveEndpointTest_AuthorizedRequest_1_msAoRD/meta'
I0225 05:16:38.954959 27096 status_update_manager.cpp:203] Recovering status update manager
I0225 05:16:38.955056 27096 containerizer.cpp:599] Recovering containerizer
I0225 05:16:38.955570 27108 provisioner.cpp:410] Provisioner recovery complete
I0225 05:16:38.955723 27096 slave.cpp:5559] Finished recovery
I0225 05:16:38.956012 27096 slave.cpp:5733] Querying resource estimator for oversubscribable
resources
I0225 05:16:38.956115 27102 slave.cpp:5747] Received oversubscribable resources {} from the
resource estimator
I0225 05:16:38.959614 27106 process.cpp:3704] Handling HTTP event for process 'slave(701)'
with path: '/slave(701)/monitor/statistics.json'
I0225 05:16:38.960043 27108 http.cpp:885] Authorizing principal 'test-principal' to GET the
'/monitor/statistics.json' endpoint
I0225 05:16:38.961331 27108 slave.cpp:803] Agent terminating
[       OK ] Endpoint/SlaveEndpointTest.AuthorizedRequest/1 (14 ms)
[ RUN      ] Endpoint/SlaveEndpointTest.AuthorizedRequest/2
I0225 05:16:39.007730 27095 containerizer.cpp:220] Using isolation: posix/cpu,posix/mem,filesystem/posix,network/cni
W0225 05:16:39.008074 27095 backend.cpp:76] Failed to create 'aufs' backend: AufsBackend requires
root privileges
W0225 05:16:39.008122 27095 backend.cpp:76] Failed to create 'bind' backend: BindBackend requires
root privileges
I0225 05:16:39.008141 27095 provisioner.cpp:249] Using default backend 'copy'
I0225 05:16:39.011685 27108 slave.cpp:211] Mesos agent started on (702)@172.17.0.2:57229
I0225 05:16:39.011711 27108 slave.cpp:212] Flags at startup: --acls="" --appc_simple_discovery_uri_prefix="http://"
--appc_store_dir="/tmp/mesos/store/appc" --authenticate_http_readonly="true" --authenticate_http_readwrite="true"
--authenticatee="crammd5" --authentication_backoff_factor="1secs" --authorizer="local" --cgroups_cpu_enable_pids_and_tids_count="false"
--cgroups_enable_cfs="false" --cgroups_hierarchy="/sys/fs/cgroup" --cgroups_limit_swap="false"
--cgroups_root="mesos" --container_disk_watch_interval="15secs" --containerizers="mesos" --credential="/tmp/Endpoint_SlaveEndpointTest_AuthorizedRequest_2_A69bVJ/credential"
--default_role="*" --disk_watch_interval="1mins" --docker="docker" --docker_kill_orphans="true"
--docker_registry="https://registry-1.docker.io" --docker_remove_delay="6hrs" --docker_socket="/var/run/docker.sock"
--docker_stop_timeout="0ns" --docker_store_dir="/tmp/mesos/store/docker" --docker_volume_checkpoint_dir="/var/run/mesos/isolators/docker/volume"
--enforce_container_disk_quota="false" --executor_registration_timeout="1mins" --executor_shutdown_grace_period="5secs"
--fetcher_cache_dir="/tmp/Endpoint_SlaveEndpointTest_AuthorizedRequest_2_A69bVJ/fetch" --fetcher_cache_size="2GB"
--frameworks_home="" --gc_delay="1weeks" --gc_disk_headroom="0.1" --hadoop_home="" --help="false"
--hostname_lookup="true" --http_authenticators="basic" --http_command_executor="false" --http_credentials="/tmp/Endpoint_SlaveEndpointTest_AuthorizedRequest_2_A69bVJ/http_credentials"
--http_heartbeat_interval="30secs" --initialize_driver_logging="true" --isolation="posix/cpu,posix/mem"
--launcher="posix" --launcher_dir="/mesos/build/src" --logbufsecs="0" --logging_level="INFO"
--max_completed_executors_per_framework="150" --oversubscribed_resources_interval="15secs"
--perf_duration="10secs" --perf_interval="1mins" --qos_correction_interval_min="0ns" --quiet="false"
--recover="reconnect" --recovery_timeout="15mins" --registration_backoff_factor="10ms" --resources="cpus:2;gpus:0;mem:1024;disk:1024;ports:[31000-32000]"
--revocable_cpu_low_priority="true" --runtime_dir="/tmp/Endpoint_SlaveEndpointTest_AuthorizedRequest_2_A69bVJ"
--sandbox_directory="/mnt/mesos/sandbox" --strict="true" --switch_user="true" --systemd_enable_support="true"
--systemd_runtime_directory="/run/systemd/system" --version="false" --work_dir="/tmp/Endpoint_SlaveEndpointTest_AuthorizedRequest_2_96V9r7"
I0225 05:16:39.012125 27108 credentials.hpp:86] Loading credential for authentication from
'/tmp/Endpoint_SlaveEndpointTest_AuthorizedRequest_2_A69bVJ/credential'
I0225 05:16:39.012244 27108 slave.cpp:354] Agent using credential for: test-principal
I0225 05:16:39.012256 27108 credentials.hpp:37] Loading credentials for authentication from
'/tmp/Endpoint_SlaveEndpointTest_AuthorizedRequest_2_A69bVJ/http_credentials'
I0225 05:16:39.012372 27108 http.cpp:933] Using default 'basic' HTTP authenticator for realm
'mesos-agent-readonly'
I0225 05:16:39.012420 27108 http.cpp:933] Using default 'basic' HTTP authenticator for realm
'mesos-agent-readwrite'
I0225 05:16:39.012898 27108 slave.cpp:541] Agent resources: cpus(*):2; mem(*):1024; disk(*):1024;
ports(*):[31000-32000]
I0225 05:16:39.012936 27108 slave.cpp:549] Agent attributes: [  ]
I0225 05:16:39.012943 27108 slave.cpp:554] Agent hostname: 660e217cfbc1
I0225 05:16:39.012989 27103 status_update_manager.cpp:177] Pausing sending status updates
I0225 05:16:39.013324 27108 state.cpp:62] Recovering state from '/tmp/Endpoint_SlaveEndpointTest_AuthorizedRequest_2_96V9r7/meta'
I0225 05:16:39.013448 27108 status_update_manager.cpp:203] Recovering status update manager
I0225 05:16:39.013499 27108 containerizer.cpp:599] Recovering containerizer
I0225 05:16:39.013953 27108 provisioner.cpp:410] Provisioner recovery complete
I0225 05:16:39.014066 27108 slave.cpp:5559] Finished recovery
I0225 05:16:39.016244 27108 slave.cpp:5733] Querying resource estimator for oversubscribable
resources
I0225 05:16:39.016515 27099 slave.cpp:5747] Received oversubscribable resources {} from the
resource estimator
I0225 05:16:39.020745 27097 process.cpp:3704] Handling HTTP event for process 'slave(702)'
with path: '/slave(702)/containers'
I0225 05:16:39.021096 27097 http.cpp:885] Authorizing principal 'test-principal' to GET the
'/containers' endpoint
I0225 05:16:39.027930 27109 slave.cpp:803] Agent terminating
[       OK ] Endpoint/SlaveEndpointTest.AuthorizedRequest/2 (26 ms)
[ RUN      ] Endpoint/SlaveEndpointTest.UnauthorizedRequest/0
I0225 05:16:39.032711 27095 containerizer.cpp:220] Using isolation: posix/cpu,posix/mem,filesystem/posix,network/cni
W0225 05:16:39.032995 27095 backend.cpp:76] Failed to create 'aufs' backend: AufsBackend requires
root privileges
W0225 05:16:39.033030 27095 backend.cpp:76] Failed to create 'bind' backend: BindBackend requires
root privileges
I0225 05:16:39.033041 27095 provisioner.cpp:249] Using default backend 'copy'
I0225 05:16:39.034060 27098 slave.cpp:211] Mesos agent started on (703)@172.17.0.2:57229
I0225 05:16:39.034076 27098 slave.cpp:212] Flags at startup: --acls="" --appc_simple_discovery_uri_prefix="http://"
--appc_store_dir="/tmp/mesos/store/appc" --authenticate_http_readonly="true" --authenticate_http_readwrite="true"
--authenticatee="crammd5" --authentication_backoff_factor="1secs" --authorizer="local" --cgroups_cpu_enable_pids_and_tids_count="false"
--cgroups_enable_cfs="false" --cgroups_hierarchy="/sys/fs/cgroup" --cgroups_limit_swap="false"
--cgroups_root="mesos" --container_disk_watch_interval="15secs" --containerizers="mesos" --credential="/tmp/Endpoint_SlaveEndpointTest_UnauthorizedRequest_0_VZT60d/credential"
--default_role="*" --disk_watch_interval="1mins" --docker="docker" --docker_kill_orphans="true"
--docker_registry="https://registry-1.docker.io" --docker_remove_delay="6hrs" --docker_socket="/var/run/docker.sock"
--docker_stop_timeout="0ns" --docker_store_dir="/tmp/mesos/store/docker" --docker_volume_checkpoint_dir="/var/run/mesos/isolators/docker/volume"
--enforce_container_disk_quota="false" --executor_registration_timeout="1mins" --executor_shutdown_grace_period="5secs"
--fetcher_cache_dir="/tmp/Endpoint_SlaveEndpointTest_UnauthorizedRequest_0_VZT60d/fetch" --fetcher_cache_size="2GB"
--frameworks_home="" --gc_delay="1weeks" --gc_disk_headroom="0.1" --hadoop_home="" --help="false"
--hostname_lookup="true" --http_authenticators="basic" --http_command_executor="false" --http_credentials="/tmp/Endpoint_SlaveEndpointTest_UnauthorizedRequest_0_VZT60d/http_credentials"
--http_heartbeat_interval="30secs" --initialize_driver_logging="true" --isolation="posix/cpu,posix/mem"
--launcher="posix" --launcher_dir="/mesos/build/src" --logbufsecs="0" --logging_level="INFO"
--max_completed_executors_per_framework="150" --oversubscribed_resources_interval="15secs"
--perf_duration="10secs" --perf_interval="1mins" --qos_correction_interval_min="0ns" --quiet="false"
--recover="reconnect" --recovery_timeout="15mins" --registration_backoff_factor="10ms" --resources="cpus:2;gpus:0;mem:1024;disk:1024;ports:[31000-32000]"
--revocable_cpu_low_priority="true" --runtime_dir="/tmp/Endpoint_SlaveEndpointTest_UnauthorizedRequest_0_VZT60d"
--sandbox_directory="/mnt/mesos/sandbox" --strict="true" --switch_user="true" --systemd_enable_support="true"
--systemd_runtime_directory="/run/systemd/system" --version="false" --work_dir="/tmp/Endpoint_SlaveEndpointTest_UnauthorizedRequest_0_wUGUtB"
I0225 05:16:39.034344 27098 credentials.hpp:86] Loading credential for authentication from
'/tmp/Endpoint_SlaveEndpointTest_UnauthorizedRequest_0_VZT60d/credential'
I0225 05:16:39.034420 27098 slave.cpp:354] Agent using credential for: test-principal
I0225 05:16:39.034431 27098 credentials.hpp:37] Loading credentials for authentication from
'/tmp/Endpoint_SlaveEndpointTest_UnauthorizedRequest_0_VZT60d/http_credentials'
I0225 05:16:39.034512 27098 http.cpp:933] Using default 'basic' HTTP authenticator for realm
'mesos-agent-readonly'
I0225 05:16:39.034553 27098 http.cpp:933] Using default 'basic' HTTP authenticator for realm
'mesos-agent-readwrite'
I0225 05:16:39.034922 27098 slave.cpp:541] Agent resources: cpus(*):2; mem(*):1024; disk(*):1024;
ports(*):[31000-32000]
I0225 05:16:39.034955 27098 slave.cpp:549] Agent attributes: [  ]
I0225 05:16:39.034961 27098 slave.cpp:554] Agent hostname: 660e217cfbc1
I0225 05:16:39.035025 27106 status_update_manager.cpp:177] Pausing sending status updates
I0225 05:16:39.035315 27100 state.cpp:62] Recovering state from '/tmp/Endpoint_SlaveEndpointTest_UnauthorizedRequest_0_wUGUtB/meta'
I0225 05:16:39.035471 27103 status_update_manager.cpp:203] Recovering status update manager
I0225 05:16:39.035547 27103 containerizer.cpp:599] Recovering containerizer
I0225 05:16:39.036203 27103 provisioner.cpp:410] Provisioner recovery complete
I0225 05:16:39.036353 27103 slave.cpp:5559] Finished recovery
I0225 05:16:39.036728 27103 slave.cpp:5733] Querying resource estimator for oversubscribable
resources
I0225 05:16:39.039465 27098 slave.cpp:5747] Received oversubscribable resources {} from the
resource estimator
I0225 05:16:39.044018 27108 process.cpp:3704] Handling HTTP event for process 'slave(703)'
with path: '/slave(703)/monitor/statistics'
I0225 05:16:39.044443 27108 http.cpp:885] Authorizing principal 'test-principal' to GET the
'/monitor/statistics' endpoint
I0225 05:16:39.045773 27095 slave.cpp:803] Agent terminating
[       OK ] Endpoint/SlaveEndpointTest.UnauthorizedRequest/0 (26 ms)
[ RUN      ] Endpoint/SlaveEndpointTest.UnauthorizedRequest/1
I0225 05:16:39.087512 27095 containerizer.cpp:220] Using isolation: posix/cpu,posix/mem,filesystem/posix,network/cni
W0225 05:16:39.087880 27095 backend.cpp:76] Failed to create 'aufs' backend: AufsBackend requires
root privileges
W0225 05:16:39.087924 27095 backend.cpp:76] Failed to create 'bind' backend: BindBackend requires
root privileges
I0225 05:16:39.087939 27095 provisioner.cpp:249] Using default backend 'copy'
I0225 05:16:39.089067 27100 slave.cpp:211] Mesos agent started on (704)@172.17.0.2:57229
I0225 05:16:39.089085 27100 slave.cpp:212] Flags at startup: --acls="" --appc_simple_discovery_uri_prefix="http://"
--appc_store_dir="/tmp/mesos/store/appc" --authenticate_http_readonly="true" --authenticate_http_readwrite="true"
--authenticatee="crammd5" --authentication_backoff_factor="1secs" --authorizer="local" --cgroups_cpu_enable_pids_and_tids_count="false"
--cgroups_enable_cfs="false" --cgroups_hierarchy="/sys/fs/cgroup" --cgroups_limit_swap="false"
--cgroups_root="mesos" --container_disk_watch_interval="15secs" --containerizers="mesos" --credential="/tmp/Endpoint_SlaveEndpointTest_UnauthorizedRequest_1_NrHWrI/credential"
--default_role="*" --disk_watch_interval="1mins" --docker="docker" --docker_kill_orphans="true"
--docker_registry="https://registry-1.docker.io" --docker_remove_delay="6hrs" --docker_socket="/var/run/docker.sock"
--docker_stop_timeout="0ns" --docker_store_dir="/tmp/mesos/store/docker" --docker_volume_checkpoint_dir="/var/run/mesos/isolators/docker/volume"
--enforce_container_disk_quota="false" --executor_registration_timeout="1mins" --executor_shutdown_grace_period="5secs"
--fetcher_cache_dir="/tmp/Endpoint_SlaveEndpointTest_UnauthorizedRequest_1_NrHWrI/fetch" --fetcher_cache_size="2GB"
--frameworks_home="" --gc_delay="1weeks" --gc_disk_headroom="0.1" --hadoop_home="" --help="false"
--hostname_lookup="true" --http_authenticators="basic" --http_command_executor="false" --http_credentials="/tmp/Endpoint_SlaveEndpointTest_UnauthorizedRequest_1_NrHWrI/http_credentials"
--http_heartbeat_interval="30secs" --initialize_driver_logging="true" --isolation="posix/cpu,posix/mem"
--launcher="posix" --launcher_dir="/mesos/build/src" --logbufsecs="0" --logging_level="INFO"
--max_completed_executors_per_framework="150" --oversubscribed_resources_interval="15secs"
--perf_duration="10secs" --perf_interval="1mins" --qos_correction_interval_min="0ns" --quiet="false"
--recover="reconnect" --recovery_timeout="15mins" --registration_backoff_factor="10ms" --resources="cpus:2;gpus:0;mem:1024;disk:1024;ports:[31000-32000]"
--revocable_cpu_low_priority="true" --runtime_dir="/tmp/Endpoint_SlaveEndpointTest_UnauthorizedRequest_1_NrHWrI"
--sandbox_directory="/mnt/mesos/sandbox" --strict="true" --switch_user="true" --systemd_enable_support="true"
--systemd_runtime_directory="/run/systemd/system" --version="false" --work_dir="/tmp/Endpoint_SlaveEndpointTest_UnauthorizedRequest_1_zPJYL5"
I0225 05:16:39.089371 27100 credentials.hpp:86] Loading credential for authentication from
'/tmp/Endpoint_SlaveEndpointTest_UnauthorizedRequest_1_NrHWrI/credential'
I0225 05:16:39.089458 27100 slave.cpp:354] Agent using credential for: test-principal
I0225 05:16:39.089473 27100 credentials.hpp:37] Loading credentials for authentication from
'/tmp/Endpoint_SlaveEndpointTest_UnauthorizedRequest_1_NrHWrI/http_credentials'
I0225 05:16:39.089589 27100 http.cpp:933] Using default 'basic' HTTP authenticator for realm
'mesos-agent-readonly'
I0225 05:16:39.089639 27100 http.cpp:933] Using default 'basic' HTTP authenticator for realm
'mesos-agent-readwrite'
I0225 05:16:39.090239 27100 slave.cpp:541] Agent resources: cpus(*):2; mem(*):1024; disk(*):1024;
ports(*):[31000-32000]
I0225 05:16:39.090282 27100 slave.cpp:549] Agent attributes: [  ]
I0225 05:16:39.090291 27100 slave.cpp:554] Agent hostname: 660e217cfbc1
I0225 05:16:39.090395 27111 status_update_manager.cpp:177] Pausing sending status updates
I0225 05:16:39.090652 27111 state.cpp:62] Recovering state from '/tmp/Endpoint_SlaveEndpointTest_UnauthorizedRequest_1_zPJYL5/meta'
I0225 05:16:39.090852 27099 status_update_manager.cpp:203] Recovering status update manager
I0225 05:16:39.090966 27098 containerizer.cpp:599] Recovering containerizer
I0225 05:16:39.091496 27111 provisioner.cpp:410] Provisioner recovery complete
I0225 05:16:39.091758 27108 slave.cpp:5559] Finished recovery
I0225 05:16:39.092164 27108 slave.cpp:5733] Querying resource estimator for oversubscribable
resources
I0225 05:16:39.092247 27106 slave.cpp:5747] Received oversubscribable resources {} from the
resource estimator
I0225 05:16:39.093199 27106 process.cpp:3704] Handling HTTP event for process 'slave(704)'
with path: '/slave(704)/monitor/statistics.json'
I0225 05:16:39.093678 27108 http.cpp:885] Authorizing principal 'test-principal' to GET the
'/monitor/statistics.json' endpoint
I0225 05:16:39.094729 27102 slave.cpp:803] Agent terminating
[       OK ] Endpoint/SlaveEndpointTest.UnauthorizedRequest/1 (79 ms)
[ RUN      ] Endpoint/SlaveEndpointTest.UnauthorizedRequest/2
I0225 05:16:39.140110 27095 containerizer.cpp:220] Using isolation: posix/cpu,posix/mem,filesystem/posix,network/cni
W0225 05:16:39.140487 27095 backend.cpp:76] Failed to create 'aufs' backend: AufsBackend requires
root privileges
W0225 05:16:39.140529 27095 backend.cpp:76] Failed to create 'bind' backend: BindBackend requires
root privileges
I0225 05:16:39.140547 27095 provisioner.cpp:249] Using default backend 'copy'
I0225 05:16:39.142076 27105 slave.cpp:211] Mesos agent started on (705)@172.17.0.2:57229
I0225 05:16:39.142093 27105 slave.cpp:212] Flags at startup: --acls="" --appc_simple_discovery_uri_prefix="http://"
--appc_store_dir="/tmp/mesos/store/appc" --authenticate_http_readonly="true" --authenticate_http_readwrite="true"
--authenticatee="crammd5" --authentication_backoff_factor="1secs" --authorizer="local" --cgroups_cpu_enable_pids_and_tids_count="false"
--cgroups_enable_cfs="false" --cgroups_hierarchy="/sys/fs/cgroup" --cgroups_limit_swap="false"
--cgroups_root="mesos" --container_disk_watch_interval="15secs" --containerizers="mesos" --credential="/tmp/Endpoint_SlaveEndpointTest_UnauthorizedRequest_2_uzrjAd/credential"
--default_role="*" --disk_watch_interval="1mins" --docker="docker" --docker_kill_orphans="true"
--docker_registry="https://registry-1.docker.io" --docker_remove_delay="6hrs" --docker_socket="/var/run/docker.sock"
--docker_stop_timeout="0ns" --docker_store_dir="/tmp/mesos/store/docker" --docker_volume_checkpoint_dir="/var/run/mesos/isolators/docker/volume"
--enforce_container_disk_quota="false" --executor_registration_timeout="1mins" --executor_shutdown_grace_period="5secs"
--fetcher_cache_dir="/tmp/Endpoint_SlaveEndpointTest_UnauthorizedRequest_2_uzrjAd/fetch" --fetcher_cache_size="2GB"
--frameworks_home="" --gc_delay="1weeks" --gc_disk_headroom="0.1" --hadoop_home="" --help="false"
--hostname_lookup="true" --http_authenticators="basic" --http_command_executor="false" --http_credentials="/tmp/Endpoint_SlaveEndpointTest_UnauthorizedRequest_2_uzrjAd/http_credentials"
--http_heartbeat_interval="30secs" --initialize_driver_logging="true" --isolation="posix/cpu,posix/mem"
--launcher="posix" --launcher_dir="/mesos/build/src" --logbufsecs="0" --logging_level="INFO"
--max_completed_executors_per_framework="150" --oversubscribed_resources_interval="15secs"
--perf_duration="10secs" --perf_interval="1mins" --qos_correction_interval_min="0ns" --quiet="false"
--recover="reconnect" --recovery_timeout="15mins" --registration_backoff_factor="10ms" --resources="cpus:2;gpus:0;mem:1024;disk:1024;ports:[31000-32000]"
--revocable_cpu_low_priority="true" --runtime_dir="/tmp/Endpoint_SlaveEndpointTest_UnauthorizedRequest_2_uzrjAd"
--sandbox_directory="/mnt/mesos/sandbox" --strict="true" --switch_user="true" --systemd_enable_support="true"
--systemd_runtime_directory="/run/systemd/system" --version="false" --work_dir="/tmp/Endpoint_SlaveEndpointTest_UnauthorizedRequest_2_hwfMLA"
I0225 05:16:39.142446 27105 credentials.hpp:86] Loading credential for authentication from
'/tmp/Endpoint_SlaveEndpointTest_UnauthorizedRequest_2_uzrjAd/credential'
I0225 05:16:39.142563 27105 slave.cpp:354] Agent using credential for: test-principal
I0225 05:16:39.142575 27105 credentials.hpp:37] Loading credentials for authentication from
'/tmp/Endpoint_SlaveEndpointTest_UnauthorizedRequest_2_uzrjAd/http_credentials'
I0225 05:16:39.142693 27105 http.cpp:933] Using default 'basic' HTTP authenticator for realm
'mesos-agent-readonly'
I0225 05:16:39.142734 27105 http.cpp:933] Using default 'basic' HTTP authenticator for realm
'mesos-agent-readwrite'
I0225 05:16:39.143173 27105 slave.cpp:541] Agent resources: cpus(*):2; mem(*):1024; disk(*):1024;
ports(*):[31000-32000]
I0225 05:16:39.143213 27105 slave.cpp:549] Agent attributes: [  ]
I0225 05:16:39.143221 27105 slave.cpp:554] Agent hostname: 660e217cfbc1
I0225 05:16:39.143676 27111 status_update_manager.cpp:177] Pausing sending status updates
I0225 05:16:39.143704 27101 state.cpp:62] Recovering state from '/tmp/Endpoint_SlaveEndpointTest_UnauthorizedRequest_2_hwfMLA/meta'
I0225 05:16:39.143847 27101 status_update_manager.cpp:203] Recovering status update manager
I0225 05:16:39.143903 27101 containerizer.cpp:599] Recovering containerizer
I0225 05:16:39.147208 27100 provisioner.cpp:410] Provisioner recovery complete
I0225 05:16:39.147351 27100 slave.cpp:5559] Finished recovery
I0225 05:16:39.147850 27100 slave.cpp:5733] Querying resource estimator for oversubscribable
resources
I0225 05:16:39.147966 27106 slave.cpp:5747] Received oversubscribable resources {} from the
resource estimator
I0225 05:16:39.150086 27097 process.cpp:3704] Handling HTTP event for process 'slave(705)'
with path: '/slave(705)/containers'
I0225 05:16:39.150439 27097 http.cpp:885] Authorizing principal 'test-principal' to GET the
'/containers' endpoint
I0225 05:16:39.151793 27095 slave.cpp:803] Agent terminating
[       OK ] Endpoint/SlaveEndpointTest.UnauthorizedRequest/2 (17 ms)
[ RUN      ] Endpoint/SlaveEndpointTest.NoAuthorizer/0
I0225 05:16:39.206497 27095 containerizer.cpp:220] Using isolation: posix/cpu,posix/mem,filesystem/posix,network/cni
W0225 05:16:39.206848 27095 backend.cpp:76] Failed to create 'aufs' backend: AufsBackend requires
root privileges
W0225 05:16:39.206890 27095 backend.cpp:76] Failed to create 'bind' backend: BindBackend requires
root privileges
I0225 05:16:39.206907 27095 provisioner.cpp:249] Using default backend 'copy'
I0225 05:16:39.207906 27095 cluster.cpp:446] Creating default 'local' authorizer
I0225 05:16:39.208454 27103 slave.cpp:211] Mesos agent started on (706)@172.17.0.2:57229
I0225 05:16:39.208472 27103 slave.cpp:212] Flags at startup: --acls="" --appc_simple_discovery_uri_prefix="http://"
--appc_store_dir="/tmp/mesos/store/appc" --authenticate_http_readonly="true" --authenticate_http_readwrite="true"
--authenticatee="crammd5" --authentication_backoff_factor="1secs" --authorizer="local" --cgroups_cpu_enable_pids_and_tids_count="false"
--cgroups_enable_cfs="false" --cgroups_hierarchy="/sys/fs/cgroup" --cgroups_limit_swap="false"
--cgroups_root="mesos" --container_disk_watch_interval="15secs" --containerizers="mesos" --credential="/tmp/Endpoint_SlaveEndpointTest_NoAuthorizer_0_cCI5nJ/credential"
--default_role="*" --disk_watch_interval="1mins" --docker="docker" --docker_kill_orphans="true"
--docker_registry="https://registry-1.docker.io" --docker_remove_delay="6hrs" --docker_socket="/var/run/docker.sock"
--docker_stop_timeout="0ns" --docker_store_dir="/tmp/mesos/store/docker" --docker_volume_checkpoint_dir="/var/run/mesos/isolators/docker/volume"
--enforce_container_disk_quota="false" --executor_registration_timeout="1mins" --executor_shutdown_grace_period="5secs"
--fetcher_cache_dir="/tmp/Endpoint_SlaveEndpointTest_NoAuthorizer_0_cCI5nJ/fetch" --fetcher_cache_size="2GB"
--frameworks_home="" --gc_delay="1weeks" --gc_disk_headroom="0.1" --hadoop_home="" --help="false"
--hostname_lookup="true" --http_authenticators="basic" --http_command_executor="false" --http_credentials="/tmp/Endpoint_SlaveEndpointTest_NoAuthorizer_0_cCI5nJ/http_credentials"
--http_heartbeat_interval="30secs" --initialize_driver_logging="true" --isolation="posix/cpu,posix/mem"
--launcher="posix" --launcher_dir="/mesos/build/src" --logbufsecs="0" --logging_level="INFO"
--max_completed_executors_per_framework="150" --oversubscribed_resources_interval="15secs"
--perf_duration="10secs" --perf_interval="1mins" --qos_correction_interval_min="0ns" --quiet="false"
--recover="reconnect" --recovery_timeout="15mins" --registration_backoff_factor="10ms" --resources="cpus:2;gpus:0;mem:1024;disk:1024;ports:[31000-32000]"
--revocable_cpu_low_priority="true" --runtime_dir="/tmp/Endpoint_SlaveEndpointTest_NoAuthorizer_0_cCI5nJ"
--sandbox_directory="/mnt/mesos/sandbox" --strict="true" --switch_user="true" --systemd_enable_support="true"
--systemd_runtime_directory="/run/systemd/system" --version="false" --work_dir="/tmp/Endpoint_SlaveEndpointTest_NoAuthorizer_0_WrSLo6"
I0225 05:16:39.208834 27103 credentials.hpp:86] Loading credential for authentication from
'/tmp/Endpoint_SlaveEndpointTest_NoAuthorizer_0_cCI5nJ/credential'
I0225 05:16:39.259248 27103 slave.cpp:354] Agent using credential for: test-principal
I0225 05:16:39.259286 27103 credentials.hpp:37] Loading credentials for authentication from
'/tmp/Endpoint_SlaveEndpointTest_NoAuthorizer_0_cCI5nJ/http_credentials'
I0225 05:16:39.259440 27103 http.cpp:933] Using default 'basic' HTTP authenticator for realm
'mesos-agent-readonly'
I0225 05:16:39.259522 27103 http.cpp:933] Using default 'basic' HTTP authenticator for realm
'mesos-agent-readwrite'
I0225 05:16:39.260105 27103 slave.cpp:541] Agent resources: cpus(*):2; mem(*):1024; disk(*):1024;
ports(*):[31000-32000]
I0225 05:16:39.260169 27103 slave.cpp:549] Agent attributes: [  ]
I0225 05:16:39.260177 27103 slave.cpp:554] Agent hostname: 660e217cfbc1
I0225 05:16:39.260259 27106 status_update_manager.cpp:177] Pausing sending status updates
I0225 05:16:39.260675 27105 state.cpp:62] Recovering state from '/tmp/Endpoint_SlaveEndpointTest_NoAuthorizer_0_WrSLo6/meta'
I0225 05:16:39.260845 27103 status_update_manager.cpp:203] Recovering status update manager
I0225 05:16:39.260946 27099 containerizer.cpp:599] Recovering containerizer
I0225 05:16:39.261548 27101 provisioner.cpp:410] Provisioner recovery complete
I0225 05:16:39.261719 27111 slave.cpp:5559] Finished recovery
I0225 05:16:39.262133 27111 slave.cpp:5733] Querying resource estimator for oversubscribable
resources
I0225 05:16:39.262214 27111 slave.cpp:5747] Received oversubscribable resources {} from the
resource estimator
I0225 05:16:39.263161 27097 process.cpp:3704] Handling HTTP event for process 'slave(706)'
with path: '/slave(706)/monitor/statistics'
I0225 05:16:39.263638 27110 http.cpp:885] Authorizing principal 'test-principal' to GET the
'/monitor/statistics' endpoint
I0225 05:16:39.265156 27106 slave.cpp:803] Agent terminating
[       OK ] Endpoint/SlaveEndpointTest.NoAuthorizer/0 (64 ms)
[ RUN      ] Endpoint/SlaveEndpointTest.NoAuthorizer/1
I0225 05:16:39.312654 27095 containerizer.cpp:220] Using isolation: posix/cpu,posix/mem,filesystem/posix,network/cni
W0225 05:16:39.312917 27095 backend.cpp:76] Failed to create 'aufs' backend: AufsBackend requires
root privileges
W0225 05:16:39.312952 27095 backend.cpp:76] Failed to create 'bind' backend: BindBackend requires
root privileges
I0225 05:16:39.312968 27095 provisioner.cpp:249] Using default backend 'copy'
I0225 05:16:39.313513 27095 cluster.cpp:446] Creating default 'local' authorizer
I0225 05:16:39.314209 27098 slave.cpp:211] Mesos agent started on (707)@172.17.0.2:57229
I0225 05:16:39.314229 27098 slave.cpp:212] Flags at startup: --acls="" --appc_simple_discovery_uri_prefix="http://"
--appc_store_dir="/tmp/mesos/store/appc" --authenticate_http_readonly="true" --authenticate_http_readwrite="true"
--authenticatee="crammd5" --authentication_backoff_factor="1secs" --authorizer="local" --cgroups_cpu_enable_pids_and_tids_count="false"
--cgroups_enable_cfs="false" --cgroups_hierarchy="/sys/fs/cgroup" --cgroups_limit_swap="false"
--cgroups_root="mesos" --container_disk_watch_interval="15secs" --containerizers="mesos" --credential="/tmp/Endpoint_SlaveEndpointTest_NoAuthorizer_1_WKrnkg/credential"
--default_role="*" --disk_watch_interval="1mins" --docker="docker" --docker_kill_orphans="true"
--docker_registry="https://registry-1.docker.io" --docker_remove_delay="6hrs" --docker_socket="/var/run/docker.sock"
--docker_stop_timeout="0ns" --docker_store_dir="/tmp/mesos/store/docker" --docker_volume_checkpoint_dir="/var/run/mesos/isolators/docker/volume"
--enforce_container_disk_quota="false" --executor_registration_timeout="1mins" --executor_shutdown_grace_period="5secs"
--fetcher_cache_dir="/tmp/Endpoint_SlaveEndpointTest_NoAuthorizer_1_WKrnkg/fetch" --fetcher_cache_size="2GB"
--frameworks_home="" --gc_delay="1weeks" --gc_disk_headroom="0.1" --hadoop_home="" --help="false"
--hostname_lookup="true" --http_authenticators="basic" --http_command_executor="false" --http_credentials="/tmp/Endpoint_SlaveEndpointTest_NoAuthorizer_1_WKrnkg/http_credentials"
--http_heartbeat_interval="30secs" --initialize_driver_logging="true" --isolation="posix/cpu,posix/mem"
--launcher="posix" --launcher_dir="/mesos/build/src" --logbufsecs="0" --logging_level="INFO"
--max_completed_executors_per_framework="150" --oversubscribed_resources_interval="15secs"
--perf_duration="10secs" --perf_interval="1mins" --qos_correction_interval_min="0ns" --quiet="false"
--recover="reconnect" --recovery_timeout="15mins" --registration_backoff_factor="10ms" --resources="cpus:2;gpus:0;mem:1024;disk:1024;ports:[31000-32000]"
--revocable_cpu_low_priority="true" --runtime_dir="/tmp/Endpoint_SlaveEndpointTest_NoAuthorizer_1_WKrnkg"
--sandbox_directory="/mnt/mesos/sandbox" --strict="true" --switch_user="true" --systemd_enable_support="true"
--systemd_runtime_directory="/run/systemd/system" --version="false" --work_dir="/tmp/Endpoint_SlaveEndpointTest_NoAuthorizer_1_GScL3C"
I0225 05:16:39.314610 27098 credentials.hpp:86] Loading credential for authentication from
'/tmp/Endpoint_SlaveEndpointTest_NoAuthorizer_1_WKrnkg/credential'
I0225 05:16:39.314723 27098 slave.cpp:354] Agent using credential for: test-principal
I0225 05:16:39.314736 27098 credentials.hpp:37] Loading credentials for authentication from
'/tmp/Endpoint_SlaveEndpointTest_NoAuthorizer_1_WKrnkg/http_credentials'
I0225 05:16:39.314857 27098 http.cpp:933] Using default 'basic' HTTP authenticator for realm
'mesos-agent-readonly'
I0225 05:16:39.314924 27098 http.cpp:933] Using default 'basic' HTTP authenticator for realm
'mesos-agent-readwrite'
I0225 05:16:39.315323 27098 slave.cpp:541] Agent resources: cpus(*):2; mem(*):1024; disk(*):1024;
ports(*):[31000-32000]
I0225 05:16:39.315358 27098 slave.cpp:549] Agent attributes: [  ]
I0225 05:16:39.315364 27098 slave.cpp:554] Agent hostname: 660e217cfbc1
I0225 05:16:39.315417 27106 status_update_manager.cpp:177] Pausing sending status updates
I0225 05:16:39.315804 27101 state.cpp:62] Recovering state from '/tmp/Endpoint_SlaveEndpointTest_NoAuthorizer_1_GScL3C/meta'
I0225 05:16:39.316004 27096 status_update_manager.cpp:203] Recovering status update manager
I0225 05:16:39.316236 27101 containerizer.cpp:599] Recovering containerizer
I0225 05:16:39.316831 27097 provisioner.cpp:410] Provisioner recovery complete
I0225 05:16:39.317023 27104 slave.cpp:5559] Finished recovery
I0225 05:16:39.317417 27104 slave.cpp:5733] Querying resource estimator for oversubscribable
resources
I0225 05:16:39.317592 27108 slave.cpp:5747] Received oversubscribable resources {} from the
resource estimator
I0225 05:16:39.318321 27105 process.cpp:3704] Handling HTTP event for process 'slave(707)'
with path: '/slave(707)/monitor/statistics.json'
I0225 05:16:39.318768 27100 http.cpp:885] Authorizing principal 'test-principal' to GET the
'/monitor/statistics.json' endpoint
I0225 05:16:39.320406 27111 slave.cpp:803] Agent terminating
[       OK ] Endpoint/SlaveEndpointTest.NoAuthorizer/1 (12 ms)
[ RUN      ] Endpoint/SlaveEndpointTest.NoAuthorizer/2
I0225 05:16:39.365528 27095 containerizer.cpp:220] Using isolation: posix/cpu,posix/mem,filesystem/posix,network/cni
W0225 05:16:39.365839 27095 backend.cpp:76] Failed to create 'aufs' backend: AufsBackend requires
root privileges
W0225 05:16:39.365878 27095 backend.cpp:76] Failed to create 'bind' backend: BindBackend requires
root privileges
I0225 05:16:39.365896 27095 provisioner.cpp:249] Using default backend 'copy'
I0225 05:16:39.366493 27095 cluster.cpp:446] Creating default 'local' authorizer
I0225 05:16:39.367135 27097 slave.cpp:211] Mesos agent started on (708)@172.17.0.2:57229
I0225 05:16:39.367172 27097 slave.cpp:212] Flags at startup: --acls="" --appc_simple_discovery_uri_prefix="http://"
--appc_store_dir="/tmp/mesos/store/appc" --authenticate_http_readonly="true" --authenticate_http_readwrite="true"
--authenticatee="crammd5" --authentication_backoff_factor="1secs" --authorizer="local" --cgroups_cpu_enable_pids_and_tids_count="false"
--cgroups_enable_cfs="false" --cgroups_hierarchy="/sys/fs/cgroup" --cgroups_limit_swap="false"
--cgroups_root="mesos" --container_disk_watch_interval="15secs" --containerizers="mesos" --credential="/tmp/Endpoint_SlaveEndpointTest_NoAuthorizer_2_q4BfPN/credential"
--default_role="*" --disk_watch_interval="1mins" --docker="docker" --docker_kill_orphans="true"
--docker_registry="https://registry-1.docker.io" --docker_remove_delay="6hrs" --docker_socket="/var/run/docker.sock"
--docker_stop_timeout="0ns" --docker_store_dir="/tmp/mesos/store/docker" --docker_volume_checkpoint_dir="/var/run/mesos/isolators/docker/volume"
--enforce_container_disk_quota="false" --executor_registration_timeout="1mins" --executor_shutdown_grace_period="5secs"
--fetcher_cache_dir="/tmp/Endpoint_SlaveEndpointTest_NoAuthorizer_2_q4BfPN/fetch" --fetcher_cache_size="2GB"
--frameworks_home="" --gc_delay="1weeks" --gc_disk_headroom="0.1" --hadoop_home="" --help="false"
--hostname_lookup="true" --http_authenticators="basic" --http_command_executor="false" --http_credentials="/tmp/Endpoint_SlaveEndpointTest_NoAuthorizer_2_q4BfPN/http_credentials"
--http_heartbeat_interval="30secs" --initialize_driver_logging="true" --isolation="posix/cpu,posix/mem"
--launcher="posix" --launcher_dir="/mesos/build/src" --logbufsecs="0" --logging_level="INFO"
--max_completed_executors_per_framework="150" --oversubscribed_resources_interval="15secs"
--perf_duration="10secs" --perf_interval="1mins" --qos_correction_interval_min="0ns" --quiet="false"
--recover="reconnect" --recovery_timeout="15mins" --registration_backoff_factor="10ms" --resources="cpus:2;gpus:0;mem:1024;disk:1024;ports:[31000-32000]"
--revocable_cpu_low_priority="true" --runtime_dir="/tmp/Endpoint_SlaveEndpointTest_NoAuthorizer_2_q4BfPN"
--sandbox_directory="/mnt/mesos/sandbox" --strict="true" --switch_user="true" --systemd_enable_support="true"
--systemd_runtime_directory="/run/systemd/system" --version="false" --work_dir="/tmp/Endpoint_SlaveEndpointTest_NoAuthorizer_2_vHY4pa"
I0225 05:16:39.367447 27097 credentials.hpp:86] Loading credential for authentication from
'/tmp/Endpoint_SlaveEndpointTest_NoAuthorizer_2_q4BfPN/credential'
I0225 05:16:39.367561 27097 slave.cpp:354] Agent using credential for: test-principal
I0225 05:16:39.367609 27097 credentials.hpp:37] Loading credentials for authentication from
'/tmp/Endpoint_SlaveEndpointTest_NoAuthorizer_2_q4BfPN/http_credentials'
I0225 05:16:39.367761 27097 http.cpp:933] Using default 'basic' HTTP authenticator for realm
'mesos-agent-readonly'
I0225 05:16:39.367831 27097 http.cpp:933] Using default 'basic' HTTP authenticator for realm
'mesos-agent-readwrite'
I0225 05:16:39.368299 27097 slave.cpp:541] Agent resources: cpus(*):2; mem(*):1024; disk(*):1024;
ports(*):[31000-32000]
I0225 05:16:39.368341 27097 slave.cpp:549] Agent attributes: [  ]
I0225 05:16:39.368350 27097 slave.cpp:554] Agent hostname: 660e217cfbc1
I0225 05:16:39.368459 27111 status_update_manager.cpp:177] Pausing sending status updates
I0225 05:16:39.368796 27108 state.cpp:62] Recovering state from '/tmp/Endpoint_SlaveEndpointTest_NoAuthorizer_2_vHY4pa/meta'
I0225 05:16:39.369052 27105 status_update_manager.cpp:203] Recovering status update manager
I0225 05:16:39.369146 27104 containerizer.cpp:599] Recovering containerizer
I0225 05:16:39.369726 27104 provisioner.cpp:410] Provisioner recovery complete
I0225 05:16:39.369948 27109 slave.cpp:5559] Finished recovery
I0225 05:16:39.370390 27109 slave.cpp:5733] Querying resource estimator for oversubscribable
resources
I0225 05:16:39.370494 27099 slave.cpp:5747] Received oversubscribable resources {} from the
resource estimator
I0225 05:16:39.371274 27097 process.cpp:3704] Handling HTTP event for process 'slave(708)'
with path: '/slave(708)/containers'
I0225 05:16:39.371803 27101 http.cpp:885] Authorizing principal 'test-principal' to GET the
'/containers' endpoint
I0225 05:16:39.373193 27103 slave.cpp:803] Agent terminating
[       OK ] Endpoint/SlaveEndpointTest.NoAuthorizer/2 (42 ms)
[----------] 9 tests from Endpoint/SlaveEndpointTest (515 ms total)

[----------] Global test environment tear-down
[==========] 1461 tests from 161 test cases ran. (580247 ms total)
[  PASSED  ] 1460 tests.
[  FAILED  ] 1 test, listed below:
[  FAILED  ] ContentType/AgentAPITest.LaunchNestedContainerSession/0, where GetParam() = application/x-protobuf

 1 FAILED TEST
  YOU HAVE 12 DISABLED TESTS

make[3]: *** [CMakeFiles/check] Error 1
make[3]: Leaving directory `/mesos/build'
make[2]: Leaving directory `/mesos/build'
make[2]: *** [CMakeFiles/check.dir/all] Error 2
make[1]: *** [CMakeFiles/check.dir/rule] Error 2
make[1]: Leaving directory `/mesos/build'
make: *** [check] Error 2
+ docker rmi mesos-1487994448-12222
Untagged: mesos-1487994448-12222:latest
Deleted: sha256:835154d930d87598c2846bc77ebd57b148fa8a1cebf6ab7653354c7e3a51beb9
Deleted: sha256:ba43cceda592bb04ad38c3989d7e4bdbf098aa90a0d4b51367207397021889ab
Deleted: sha256:a4637ce87f370f34589004b4736e3db8e22627c2506c49c8ea555c68463e33c4
Deleted: sha256:aa4dbde89e72ce376742a745b4c839ea5cf593b0e6d5d106173d71aa08786079
Deleted: sha256:01fefe0f79d4c71ff6de9a4a29ad5e830f7472d19e2a73a6335b6a29204a71f2
Deleted: sha256:26cf6b4b019eb7c29166163cab310776b0b11ed2f53ef881c179f13db59c51b6
Deleted: sha256:43c48448042f3ce5b8dd1b43e1deecd35b8922d060a05bb4ae9301a759225e77
Deleted: sha256:a6288d2177f3192f12c05aae00b133eb3090939faac546b5683fb3ffde3af24b
Deleted: sha256:08be2755859f2d2991793dfb75d9131e681e5eaf0a999c6f8b44e3aef6f1873a
Deleted: sha256:6f416ecfaa145cb6517954db5663a3007c236ce12fd2b88edd868e48361dcae8
Deleted: sha256:4c77af9aeb36a095864b585fdcdbdba26170e66548236f03b60a3d9ec9793da0
Deleted: sha256:c0ee44b5715fc16e18666b1c35f12cba2b85d9daa68e93699396bb3d5180ecba
Deleted: sha256:0fe8742fcdc9dce5350f154525794ad55708372a3f1166db52d36a4b17d97aae
Deleted: sha256:c49ce7aaaaa2413e75a7a6982afa8ef94a5da546aaac2aeebee4500848a230c3
Deleted: sha256:db0097f6395dcb5cc001cebfe99b1636b510152dbf308811a84e96405ce9be5b
Deleted: sha256:ab965a96cfadc6ab266f3ea4766a51088ced328423e7273f875c340bfbc69cb8
Deleted: sha256:ae7c8d46cf5588486767462b890479a87b3958c15002fb833e41353d1662ae95
Deleted: sha256:11ae979a21d2c04154975a1bd997fdf20e738f8bd948aabb240addba8f0a35b3
Deleted: sha256:c0406b7d5d51e31ad68508f06a6e54a52a7695cb3f775f8428c93cfd62a09d04
Deleted: sha256:6f4dd7a562eca20b8b8a8d77da60cea2d572f3316397d2e7e733b6bc320c0017
Deleted: sha256:2f35ee07383a19974e63bf392f8951438654eea2fca6127ca4170981bdad0289
Deleted: sha256:25c23f163f9493de91b5e62638a8be93ddbbe915aaf019c107461cd4330293ed
Deleted: sha256:a844ab784d08f8f007877ca2abe4aec121af6a60979541a1f606577b55e09dd6
Deleted: sha256:5cfb62df38c8f0446eb1a06b9afb0bcb677850a82fcf968c8b185e0450d656ee
Build step 'Execute shell' marked build as failure

Mime
View raw message