mesos-builds mailing list archives

Site index · List index
Message view « Date » · « Thread »
Top « Date » · « Thread »
From Apache Jenkins Server <jenk...@builds.apache.org>
Subject Build failed in Jenkins: Mesos-Buildbot » cmake,gcc,--verbose,GLOG_v=1 MESOS_VERBOSE=1,centos:7,(docker||Hadoop)&&(!ubuntu-us1)&&(!ubuntu-eu2) #3223
Date Sun, 05 Feb 2017 00:05:24 GMT
See <https://builds.apache.org/job/Mesos-Buildbot/BUILDTOOL=cmake,COMPILER=gcc,CONFIGURATION=--verbose,ENVIRONMENT=GLOG_v=1%20MESOS_VERBOSE=1,OS=centos%3A7,label_exp=(docker%7C%7CHadoop)&&(!ubuntu-us1)&&(!ubuntu-eu2)/3223/changes>

Changes:

[bmahler] Fixed a regression in the balloon framework test.

------------------------------------------
[...truncated 165712 lines...]
I0205 00:04:47.484529 25456 state.cpp:60] Recovering state from '/tmp/Endpoint_SlaveEndpointTest_AuthorizedRequest_1_Wu7IFJ/meta'
I0205 00:04:47.484894 25456 status_update_manager.cpp:203] Recovering status update manager
I0205 00:04:47.485055 25454 containerizer.cpp:599] Recovering containerizer
I0205 00:04:47.485667 25460 provisioner.cpp:410] Provisioner recovery complete
I0205 00:04:47.485956 25455 slave.cpp:5499] Finished recovery
I0205 00:04:47.486416 25455 slave.cpp:5673] Querying resource estimator for oversubscribable
resources
I0205 00:04:47.486598 25458 slave.cpp:5687] Received oversubscribable resources {} from the
resource estimator
I0205 00:04:47.487404 25467 process.cpp:3697] Handling HTTP event for process 'slave(687)'
with path: '/slave(687)/monitor/statistics.json'
I0205 00:04:47.487889 25457 http.cpp:871] Authorizing principal 'test-principal' to GET the
'/monitor/statistics.json' endpoint
I0205 00:04:47.489671 25456 slave.cpp:803] Agent terminating
[       OK ] Endpoint/SlaveEndpointTest.AuthorizedRequest/1 (14 ms)
[ RUN      ] Endpoint/SlaveEndpointTest.AuthorizedRequest/2
I0205 00:04:47.495712 25453 containerizer.cpp:220] Using isolation: posix/cpu,posix/mem,filesystem/posix,network/cni
W0205 00:04:47.496059 25453 backend.cpp:76] Failed to create 'aufs' backend: AufsBackend requires
root privileges
W0205 00:04:47.496101 25453 backend.cpp:76] Failed to create 'bind' backend: BindBackend requires
root privileges
I0205 00:04:47.496130 25453 provisioner.cpp:249] Using default backend 'copy'
I0205 00:04:47.497383 25455 slave.cpp:211] Mesos agent started on (688)@172.17.0.2:52435
I0205 00:04:47.497404 25455 slave.cpp:212] Flags at startup: --acls="" --appc_simple_discovery_uri_prefix="http://"
--appc_store_dir="/tmp/mesos/store/appc" --authenticate_http_readonly="true" --authenticate_http_readwrite="true"
--authenticatee="crammd5" --authentication_backoff_factor="1secs" --authorizer="local" --cgroups_cpu_enable_pids_and_tids_count="false"
--cgroups_enable_cfs="false" --cgroups_hierarchy="/sys/fs/cgroup" --cgroups_limit_swap="false"
--cgroups_root="mesos" --container_disk_watch_interval="15secs" --containerizers="mesos" --credential="/tmp/Endpoint_SlaveEndpointTest_AuthorizedRequest_2_Nbegcd/credential"
--default_role="*" --disk_watch_interval="1mins" --docker="docker" --docker_kill_orphans="true"
--docker_registry="https://registry-1.docker.io" --docker_remove_delay="6hrs" --docker_socket="/var/run/docker.sock"
--docker_stop_timeout="0ns" --docker_store_dir="/tmp/mesos/store/docker" --docker_volume_checkpoint_dir="/var/run/mesos/isolators/docker/volume"
--enforce_container_disk_quota="false" --executor_registration_timeout="1mins" --executor_shutdown_grace_period="5secs"
--fetcher_cache_dir="/tmp/Endpoint_SlaveEndpointTest_AuthorizedRequest_2_Nbegcd/fetch" --fetcher_cache_size="2GB"
--frameworks_home="" --gc_delay="1weeks" --gc_disk_headroom="0.1" --hadoop_home="" --help="false"
--hostname_lookup="true" --http_authenticators="basic" --http_command_executor="false" --http_credentials="/tmp/Endpoint_SlaveEndpointTest_AuthorizedRequest_2_Nbegcd/http_credentials"
--http_heartbeat_interval="30secs" --initialize_driver_logging="true" --isolation="posix/cpu,posix/mem"
--launcher="posix" --launcher_dir="/mesos/build/src" --logbufsecs="0" --logging_level="INFO"
--max_completed_executors_per_framework="150" --oversubscribed_resources_interval="15secs"
--perf_duration="10secs" --perf_interval="1mins" --qos_correction_interval_min="0ns" --quiet="false"
--recover="reconnect" --recovery_timeout="15mins" --registration_backoff_factor="10ms" --resources="cpus:2;gpus:0;mem:1024;disk:1024;ports:[31000-32000]"
--revocable_cpu_low_priority="true" --runtime_dir="/tmp/Endpoint_SlaveEndpointTest_AuthorizedRequest_2_Nbegcd"
--sandbox_directory="/mnt/mesos/sandbox" --strict="true" --switch_user="true" --systemd_enable_support="true"
--systemd_runtime_directory="/run/systemd/system" --version="false" --work_dir="/tmp/Endpoint_SlaveEndpointTest_AuthorizedRequest_2_K0xbGj"
I0205 00:04:47.497818 25455 credentials.hpp:86] Loading credential for authentication from
'/tmp/Endpoint_SlaveEndpointTest_AuthorizedRequest_2_Nbegcd/credential'
I0205 00:04:47.497920 25455 slave.cpp:354] Agent using credential for: test-principal
I0205 00:04:47.497937 25455 credentials.hpp:37] Loading credentials for authentication from
'/tmp/Endpoint_SlaveEndpointTest_AuthorizedRequest_2_Nbegcd/http_credentials'
I0205 00:04:47.498049 25455 http.cpp:919] Using default 'basic' HTTP authenticator for realm
'mesos-agent-readonly'
I0205 00:04:47.498101 25455 http.cpp:919] Using default 'basic' HTTP authenticator for realm
'mesos-agent-readwrite'
I0205 00:04:47.498559 25455 slave.cpp:541] Agent resources: cpus(*):2; mem(*):1024; disk(*):1024;
ports(*):[31000-32000]
I0205 00:04:47.498601 25455 slave.cpp:549] Agent attributes: [  ]
I0205 00:04:47.498610 25455 slave.cpp:554] Agent hostname: 035a7ef6de02
I0205 00:04:47.498697 25469 status_update_manager.cpp:177] Pausing sending status updates
I0205 00:04:47.499030 25465 state.cpp:60] Recovering state from '/tmp/Endpoint_SlaveEndpointTest_AuthorizedRequest_2_K0xbGj/meta'
I0205 00:04:47.499339 25468 status_update_manager.cpp:203] Recovering status update manager
I0205 00:04:47.499480 25463 containerizer.cpp:599] Recovering containerizer
I0205 00:04:47.500336 25463 provisioner.cpp:410] Provisioner recovery complete
I0205 00:04:47.500624 25465 slave.cpp:5499] Finished recovery
I0205 00:04:47.501128 25465 slave.cpp:5673] Querying resource estimator for oversubscribable
resources
I0205 00:04:47.501277 25455 slave.cpp:5687] Received oversubscribable resources {} from the
resource estimator
I0205 00:04:47.502020 25454 process.cpp:3697] Handling HTTP event for process 'slave(688)'
with path: '/slave(688)/containers'
I0205 00:04:47.502486 25466 http.cpp:871] Authorizing principal 'test-principal' to GET the
'/containers' endpoint
I0205 00:04:47.503432 25458 slave.cpp:803] Agent terminating
[       OK ] Endpoint/SlaveEndpointTest.AuthorizedRequest/2 (12 ms)
[ RUN      ] Endpoint/SlaveEndpointTest.UnauthorizedRequest/0
I0205 00:04:47.507369 25453 containerizer.cpp:220] Using isolation: posix/cpu,posix/mem,filesystem/posix,network/cni
W0205 00:04:47.507694 25453 backend.cpp:76] Failed to create 'aufs' backend: AufsBackend requires
root privileges
W0205 00:04:47.507735 25453 backend.cpp:76] Failed to create 'bind' backend: BindBackend requires
root privileges
I0205 00:04:47.507751 25453 provisioner.cpp:249] Using default backend 'copy'
I0205 00:04:47.509177 25464 slave.cpp:211] Mesos agent started on (689)@172.17.0.2:52435
I0205 00:04:47.509196 25464 slave.cpp:212] Flags at startup: --acls="" --appc_simple_discovery_uri_prefix="http://"
--appc_store_dir="/tmp/mesos/store/appc" --authenticate_http_readonly="true" --authenticate_http_readwrite="true"
--authenticatee="crammd5" --authentication_backoff_factor="1secs" --authorizer="local" --cgroups_cpu_enable_pids_and_tids_count="false"
--cgroups_enable_cfs="false" --cgroups_hierarchy="/sys/fs/cgroup" --cgroups_limit_swap="false"
--cgroups_root="mesos" --container_disk_watch_interval="15secs" --containerizers="mesos" --credential="/tmp/Endpoint_SlaveEndpointTest_UnauthorizedRequest_0_XWulnN/credential"
--default_role="*" --disk_watch_interval="1mins" --docker="docker" --docker_kill_orphans="true"
--docker_registry="https://registry-1.docker.io" --docker_remove_delay="6hrs" --docker_socket="/var/run/docker.sock"
--docker_stop_timeout="0ns" --docker_store_dir="/tmp/mesos/store/docker" --docker_volume_checkpoint_dir="/var/run/mesos/isolators/docker/volume"
--enforce_container_disk_quota="false" --executor_registration_timeout="1mins" --executor_shutdown_grace_period="5secs"
--fetcher_cache_dir="/tmp/Endpoint_SlaveEndpointTest_UnauthorizedRequest_0_XWulnN/fetch" --fetcher_cache_size="2GB"
--frameworks_home="" --gc_delay="1weeks" --gc_disk_headroom="0.1" --hadoop_home="" --help="false"
--hostname_lookup="true" --http_authenticators="basic" --http_command_executor="false" --http_credentials="/tmp/Endpoint_SlaveEndpointTest_UnauthorizedRequest_0_XWulnN/http_credentials"
--http_heartbeat_interval="30secs" --initialize_driver_logging="true" --isolation="posix/cpu,posix/mem"
--launcher="posix" --launcher_dir="/mesos/build/src" --logbufsecs="0" --logging_level="INFO"
--max_completed_executors_per_framework="150" --oversubscribed_resources_interval="15secs"
--perf_duration="10secs" --perf_interval="1mins" --qos_correction_interval_min="0ns" --quiet="false"
--recover="reconnect" --recovery_timeout="15mins" --registration_backoff_factor="10ms" --resources="cpus:2;gpus:0;mem:1024;disk:1024;ports:[31000-32000]"
--revocable_cpu_low_priority="true" --runtime_dir="/tmp/Endpoint_SlaveEndpointTest_UnauthorizedRequest_0_XWulnN"
--sandbox_directory="/mnt/mesos/sandbox" --strict="true" --switch_user="true" --systemd_enable_support="true"
--systemd_runtime_directory="/run/systemd/system" --version="false" --work_dir="/tmp/Endpoint_SlaveEndpointTest_UnauthorizedRequest_0_KM1jPT"
I0205 00:04:47.509459 25464 credentials.hpp:86] Loading credential for authentication from
'/tmp/Endpoint_SlaveEndpointTest_UnauthorizedRequest_0_XWulnN/credential'
I0205 00:04:47.509529 25464 slave.cpp:354] Agent using credential for: test-principal
I0205 00:04:47.509541 25464 credentials.hpp:37] Loading credentials for authentication from
'/tmp/Endpoint_SlaveEndpointTest_UnauthorizedRequest_0_XWulnN/http_credentials'
I0205 00:04:47.509620 25464 http.cpp:919] Using default 'basic' HTTP authenticator for realm
'mesos-agent-readonly'
I0205 00:04:47.509656 25464 http.cpp:919] Using default 'basic' HTTP authenticator for realm
'mesos-agent-readwrite'
I0205 00:04:47.509990 25464 slave.cpp:541] Agent resources: cpus(*):2; mem(*):1024; disk(*):1024;
ports(*):[31000-32000]
I0205 00:04:47.510023 25464 slave.cpp:549] Agent attributes: [  ]
I0205 00:04:47.510030 25464 slave.cpp:554] Agent hostname: 035a7ef6de02
I0205 00:04:47.510145 25463 status_update_manager.cpp:177] Pausing sending status updates
I0205 00:04:47.510375 25464 state.cpp:60] Recovering state from '/tmp/Endpoint_SlaveEndpointTest_UnauthorizedRequest_0_KM1jPT/meta'
I0205 00:04:47.510618 25464 status_update_manager.cpp:203] Recovering status update manager
I0205 00:04:47.510665 25464 containerizer.cpp:599] Recovering containerizer
I0205 00:04:47.511266 25460 provisioner.cpp:410] Provisioner recovery complete
I0205 00:04:47.511473 25455 slave.cpp:5499] Finished recovery
I0205 00:04:47.511873 25455 slave.cpp:5673] Querying resource estimator for oversubscribable
resources
I0205 00:04:47.511992 25463 slave.cpp:5687] Received oversubscribable resources {} from the
resource estimator
I0205 00:04:47.512708 25462 process.cpp:3697] Handling HTTP event for process 'slave(689)'
with path: '/slave(689)/monitor/statistics'
I0205 00:04:47.513164 25469 http.cpp:871] Authorizing principal 'test-principal' to GET the
'/monitor/statistics' endpoint
I0205 00:04:47.514204 25456 slave.cpp:803] Agent terminating
[       OK ] Endpoint/SlaveEndpointTest.UnauthorizedRequest/0 (11 ms)
[ RUN      ] Endpoint/SlaveEndpointTest.UnauthorizedRequest/1
I0205 00:04:47.518746 25453 containerizer.cpp:220] Using isolation: posix/cpu,posix/mem,filesystem/posix,network/cni
W0205 00:04:47.519096 25453 backend.cpp:76] Failed to create 'aufs' backend: AufsBackend requires
root privileges
W0205 00:04:47.519137 25453 backend.cpp:76] Failed to create 'bind' backend: BindBackend requires
root privileges
I0205 00:04:47.519153 25453 provisioner.cpp:249] Using default backend 'copy'
I0205 00:04:47.520089 25461 slave.cpp:211] Mesos agent started on (690)@172.17.0.2:52435
I0205 00:04:47.520107 25461 slave.cpp:212] Flags at startup: --acls="" --appc_simple_discovery_uri_prefix="http://"
--appc_store_dir="/tmp/mesos/store/appc" --authenticate_http_readonly="true" --authenticate_http_readwrite="true"
--authenticatee="crammd5" --authentication_backoff_factor="1secs" --authorizer="local" --cgroups_cpu_enable_pids_and_tids_count="false"
--cgroups_enable_cfs="false" --cgroups_hierarchy="/sys/fs/cgroup" --cgroups_limit_swap="false"
--cgroups_root="mesos" --container_disk_watch_interval="15secs" --containerizers="mesos" --credential="/tmp/Endpoint_SlaveEndpointTest_UnauthorizedRequest_1_z6zxFn/credential"
--default_role="*" --disk_watch_interval="1mins" --docker="docker" --docker_kill_orphans="true"
--docker_registry="https://registry-1.docker.io" --docker_remove_delay="6hrs" --docker_socket="/var/run/docker.sock"
--docker_stop_timeout="0ns" --docker_store_dir="/tmp/mesos/store/docker" --docker_volume_checkpoint_dir="/var/run/mesos/isolators/docker/volume"
--enforce_container_disk_quota="false" --executor_registration_timeout="1mins" --executor_shutdown_grace_period="5secs"
--fetcher_cache_dir="/tmp/Endpoint_SlaveEndpointTest_UnauthorizedRequest_1_z6zxFn/fetch" --fetcher_cache_size="2GB"
--frameworks_home="" --gc_delay="1weeks" --gc_disk_headroom="0.1" --hadoop_home="" --help="false"
--hostname_lookup="true" --http_authenticators="basic" --http_command_executor="false" --http_credentials="/tmp/Endpoint_SlaveEndpointTest_UnauthorizedRequest_1_z6zxFn/http_credentials"
--http_heartbeat_interval="30secs" --initialize_driver_logging="true" --isolation="posix/cpu,posix/mem"
--launcher="posix" --launcher_dir="/mesos/build/src" --logbufsecs="0" --logging_level="INFO"
--max_completed_executors_per_framework="150" --oversubscribed_resources_interval="15secs"
--perf_duration="10secs" --perf_interval="1mins" --qos_correction_interval_min="0ns" --quiet="false"
--recover="reconnect" --recovery_timeout="15mins" --registration_backoff_factor="10ms" --resources="cpus:2;gpus:0;mem:1024;disk:1024;ports:[31000-32000]"
--revocable_cpu_low_priority="true" --runtime_dir="/tmp/Endpoint_SlaveEndpointTest_UnauthorizedRequest_1_z6zxFn"
--sandbox_directory="/mnt/mesos/sandbox" --strict="true" --switch_user="true" --systemd_enable_support="true"
--systemd_runtime_directory="/run/systemd/system" --version="false" --work_dir="/tmp/Endpoint_SlaveEndpointTest_UnauthorizedRequest_1_0GAI5t"
I0205 00:04:47.520418 25461 credentials.hpp:86] Loading credential for authentication from
'/tmp/Endpoint_SlaveEndpointTest_UnauthorizedRequest_1_z6zxFn/credential'
I0205 00:04:47.520506 25461 slave.cpp:354] Agent using credential for: test-principal
I0205 00:04:47.520525 25461 credentials.hpp:37] Loading credentials for authentication from
'/tmp/Endpoint_SlaveEndpointTest_UnauthorizedRequest_1_z6zxFn/http_credentials'
I0205 00:04:47.520624 25461 http.cpp:919] Using default 'basic' HTTP authenticator for realm
'mesos-agent-readonly'
I0205 00:04:47.520696 25461 http.cpp:919] Using default 'basic' HTTP authenticator for realm
'mesos-agent-readwrite'
I0205 00:04:47.521103 25461 slave.cpp:541] Agent resources: cpus(*):2; mem(*):1024; disk(*):1024;
ports(*):[31000-32000]
I0205 00:04:47.521136 25461 slave.cpp:549] Agent attributes: [  ]
I0205 00:04:47.521145 25461 slave.cpp:554] Agent hostname: 035a7ef6de02
I0205 00:04:47.521205 25463 status_update_manager.cpp:177] Pausing sending status updates
I0205 00:04:47.521493 25460 state.cpp:60] Recovering state from '/tmp/Endpoint_SlaveEndpointTest_UnauthorizedRequest_1_0GAI5t/meta'
I0205 00:04:47.521596 25469 status_update_manager.cpp:203] Recovering status update manager
I0205 00:04:47.521924 25457 containerizer.cpp:599] Recovering containerizer
I0205 00:04:47.522581 25466 provisioner.cpp:410] Provisioner recovery complete
I0205 00:04:47.522802 25466 slave.cpp:5499] Finished recovery
I0205 00:04:47.523206 25466 slave.cpp:5673] Querying resource estimator for oversubscribable
resources
I0205 00:04:47.523365 25455 slave.cpp:5687] Received oversubscribable resources {} from the
resource estimator
I0205 00:04:47.524055 25463 process.cpp:3697] Handling HTTP event for process 'slave(690)'
with path: '/slave(690)/monitor/statistics.json'
I0205 00:04:47.524497 25460 http.cpp:871] Authorizing principal 'test-principal' to GET the
'/monitor/statistics.json' endpoint
I0205 00:04:47.525598 25458 slave.cpp:803] Agent terminating
[       OK ] Endpoint/SlaveEndpointTest.UnauthorizedRequest/1 (11 ms)
[ RUN      ] Endpoint/SlaveEndpointTest.UnauthorizedRequest/2
I0205 00:04:47.531054 25453 containerizer.cpp:220] Using isolation: posix/cpu,posix/mem,filesystem/posix,network/cni
W0205 00:04:47.531381 25453 backend.cpp:76] Failed to create 'aufs' backend: AufsBackend requires
root privileges
W0205 00:04:47.531424 25453 backend.cpp:76] Failed to create 'bind' backend: BindBackend requires
root privileges
I0205 00:04:47.531438 25453 provisioner.cpp:249] Using default backend 'copy'
I0205 00:04:47.532510 25463 slave.cpp:211] Mesos agent started on (691)@172.17.0.2:52435
I0205 00:04:47.532529 25463 slave.cpp:212] Flags at startup: --acls="" --appc_simple_discovery_uri_prefix="http://"
--appc_store_dir="/tmp/mesos/store/appc" --authenticate_http_readonly="true" --authenticate_http_readwrite="true"
--authenticatee="crammd5" --authentication_backoff_factor="1secs" --authorizer="local" --cgroups_cpu_enable_pids_and_tids_count="false"
--cgroups_enable_cfs="false" --cgroups_hierarchy="/sys/fs/cgroup" --cgroups_limit_swap="false"
--cgroups_root="mesos" --container_disk_watch_interval="15secs" --containerizers="mesos" --credential="/tmp/Endpoint_SlaveEndpointTest_UnauthorizedRequest_2_bJLv5X/credential"
--default_role="*" --disk_watch_interval="1mins" --docker="docker" --docker_kill_orphans="true"
--docker_registry="https://registry-1.docker.io" --docker_remove_delay="6hrs" --docker_socket="/var/run/docker.sock"
--docker_stop_timeout="0ns" --docker_store_dir="/tmp/mesos/store/docker" --docker_volume_checkpoint_dir="/var/run/mesos/isolators/docker/volume"
--enforce_container_disk_quota="false" --executor_registration_timeout="1mins" --executor_shutdown_grace_period="5secs"
--fetcher_cache_dir="/tmp/Endpoint_SlaveEndpointTest_UnauthorizedRequest_2_bJLv5X/fetch" --fetcher_cache_size="2GB"
--frameworks_home="" --gc_delay="1weeks" --gc_disk_headroom="0.1" --hadoop_home="" --help="false"
--hostname_lookup="true" --http_authenticators="basic" --http_command_executor="false" --http_credentials="/tmp/Endpoint_SlaveEndpointTest_UnauthorizedRequest_2_bJLv5X/http_credentials"
--http_heartbeat_interval="30secs" --initialize_driver_logging="true" --isolation="posix/cpu,posix/mem"
--launcher="posix" --launcher_dir="/mesos/build/src" --logbufsecs="0" --logging_level="INFO"
--max_completed_executors_per_framework="150" --oversubscribed_resources_interval="15secs"
--perf_duration="10secs" --perf_interval="1mins" --qos_correction_interval_min="0ns" --quiet="false"
--recover="reconnect" --recovery_timeout="15mins" --registration_backoff_factor="10ms" --resources="cpus:2;gpus:0;mem:1024;disk:1024;ports:[31000-32000]"
--revocable_cpu_low_priority="true" --runtime_dir="/tmp/Endpoint_SlaveEndpointTest_UnauthorizedRequest_2_bJLv5X"
--sandbox_directory="/mnt/mesos/sandbox" --strict="true" --switch_user="true" --systemd_enable_support="true"
--systemd_runtime_directory="/run/systemd/system" --version="false" --work_dir="/tmp/Endpoint_SlaveEndpointTest_UnauthorizedRequest_2_QvGHt4"
I0205 00:04:47.532951 25463 credentials.hpp:86] Loading credential for authentication from
'/tmp/Endpoint_SlaveEndpointTest_UnauthorizedRequest_2_bJLv5X/credential'
I0205 00:04:47.533043 25463 slave.cpp:354] Agent using credential for: test-principal
I0205 00:04:47.533061 25463 credentials.hpp:37] Loading credentials for authentication from
'/tmp/Endpoint_SlaveEndpointTest_UnauthorizedRequest_2_bJLv5X/http_credentials'
I0205 00:04:47.533167 25463 http.cpp:919] Using default 'basic' HTTP authenticator for realm
'mesos-agent-readonly'
I0205 00:04:47.533219 25463 http.cpp:919] Using default 'basic' HTTP authenticator for realm
'mesos-agent-readwrite'
I0205 00:04:47.533599 25463 slave.cpp:541] Agent resources: cpus(*):2; mem(*):1024; disk(*):1024;
ports(*):[31000-32000]
I0205 00:04:47.533637 25463 slave.cpp:549] Agent attributes: [  ]
I0205 00:04:47.533644 25463 slave.cpp:554] Agent hostname: 035a7ef6de02
I0205 00:04:47.533725 25468 status_update_manager.cpp:177] Pausing sending status updates
I0205 00:04:47.534111 25469 state.cpp:60] Recovering state from '/tmp/Endpoint_SlaveEndpointTest_UnauthorizedRequest_2_QvGHt4/meta'
I0205 00:04:47.534451 25462 status_update_manager.cpp:203] Recovering status update manager
I0205 00:04:47.534638 25460 containerizer.cpp:599] Recovering containerizer
I0205 00:04:47.535289 25468 provisioner.cpp:410] Provisioner recovery complete
I0205 00:04:47.535512 25463 slave.cpp:5499] Finished recovery
I0205 00:04:47.535912 25463 slave.cpp:5673] Querying resource estimator for oversubscribable
resources
I0205 00:04:47.536046 25459 slave.cpp:5687] Received oversubscribable resources {} from the
resource estimator
I0205 00:04:47.536736 25468 process.cpp:3697] Handling HTTP event for process 'slave(691)'
with path: '/slave(691)/containers'
I0205 00:04:47.537199 25456 http.cpp:871] Authorizing principal 'test-principal' to GET the
'/containers' endpoint
I0205 00:04:47.538261 25464 slave.cpp:803] Agent terminating
[       OK ] Endpoint/SlaveEndpointTest.UnauthorizedRequest/2 (13 ms)
[ RUN      ] Endpoint/SlaveEndpointTest.NoAuthorizer/0
I0205 00:04:47.543992 25453 containerizer.cpp:220] Using isolation: posix/cpu,posix/mem,filesystem/posix,network/cni
W0205 00:04:47.544272 25453 backend.cpp:76] Failed to create 'aufs' backend: AufsBackend requires
root privileges
W0205 00:04:47.544308 25453 backend.cpp:76] Failed to create 'bind' backend: BindBackend requires
root privileges
I0205 00:04:47.544320 25453 provisioner.cpp:249] Using default backend 'copy'
I0205 00:04:47.544837 25453 cluster.cpp:446] Creating default 'local' authorizer
I0205 00:04:47.545362 25466 slave.cpp:211] Mesos agent started on (692)@172.17.0.2:52435
I0205 00:04:47.545382 25466 slave.cpp:212] Flags at startup: --acls="" --appc_simple_discovery_uri_prefix="http://"
--appc_store_dir="/tmp/mesos/store/appc" --authenticate_http_readonly="true" --authenticate_http_readwrite="true"
--authenticatee="crammd5" --authentication_backoff_factor="1secs" --authorizer="local" --cgroups_cpu_enable_pids_and_tids_count="false"
--cgroups_enable_cfs="false" --cgroups_hierarchy="/sys/fs/cgroup" --cgroups_limit_swap="false"
--cgroups_root="mesos" --container_disk_watch_interval="15secs" --containerizers="mesos" --credential="/tmp/Endpoint_SlaveEndpointTest_NoAuthorizer_0_CmIYDy/credential"
--default_role="*" --disk_watch_interval="1mins" --docker="docker" --docker_kill_orphans="true"
--docker_registry="https://registry-1.docker.io" --docker_remove_delay="6hrs" --docker_socket="/var/run/docker.sock"
--docker_stop_timeout="0ns" --docker_store_dir="/tmp/mesos/store/docker" --docker_volume_checkpoint_dir="/var/run/mesos/isolators/docker/volume"
--enforce_container_disk_quota="false" --executor_registration_timeout="1mins" --executor_shutdown_grace_period="5secs"
--fetcher_cache_dir="/tmp/Endpoint_SlaveEndpointTest_NoAuthorizer_0_CmIYDy/fetch" --fetcher_cache_size="2GB"
--frameworks_home="" --gc_delay="1weeks" --gc_disk_headroom="0.1" --hadoop_home="" --help="false"
--hostname_lookup="true" --http_authenticators="basic" --http_command_executor="false" --http_credentials="/tmp/Endpoint_SlaveEndpointTest_NoAuthorizer_0_CmIYDy/http_credentials"
--http_heartbeat_interval="30secs" --initialize_driver_logging="true" --isolation="posix/cpu,posix/mem"
--launcher="posix" --launcher_dir="/mesos/build/src" --logbufsecs="0" --logging_level="INFO"
--max_completed_executors_per_framework="150" --oversubscribed_resources_interval="15secs"
--perf_duration="10secs" --perf_interval="1mins" --qos_correction_interval_min="0ns" --quiet="false"
--recover="reconnect" --recovery_timeout="15mins" --registration_backoff_factor="10ms" --resources="cpus:2;gpus:0;mem:1024;disk:1024;ports:[31000-32000]"
--revocable_cpu_low_priority="true" --runtime_dir="/tmp/Endpoint_SlaveEndpointTest_NoAuthorizer_0_CmIYDy"
--sandbox_directory="/mnt/mesos/sandbox" --strict="true" --switch_user="true" --systemd_enable_support="true"
--systemd_runtime_directory="/run/systemd/system" --version="false" --work_dir="/tmp/Endpoint_SlaveEndpointTest_NoAuthorizer_0_mmA2ZE"
I0205 00:04:47.545769 25466 credentials.hpp:86] Loading credential for authentication from
'/tmp/Endpoint_SlaveEndpointTest_NoAuthorizer_0_CmIYDy/credential'
I0205 00:04:47.545876 25466 slave.cpp:354] Agent using credential for: test-principal
I0205 00:04:47.545894 25466 credentials.hpp:37] Loading credentials for authentication from
'/tmp/Endpoint_SlaveEndpointTest_NoAuthorizer_0_CmIYDy/http_credentials'
I0205 00:04:47.546042 25466 http.cpp:919] Using default 'basic' HTTP authenticator for realm
'mesos-agent-readonly'
I0205 00:04:47.546102 25466 http.cpp:919] Using default 'basic' HTTP authenticator for realm
'mesos-agent-readwrite'
I0205 00:04:47.546530 25466 slave.cpp:541] Agent resources: cpus(*):2; mem(*):1024; disk(*):1024;
ports(*):[31000-32000]
I0205 00:04:47.546574 25466 slave.cpp:549] Agent attributes: [  ]
I0205 00:04:47.546586 25466 slave.cpp:554] Agent hostname: 035a7ef6de02
I0205 00:04:47.546701 25459 status_update_manager.cpp:177] Pausing sending status updates
I0205 00:04:47.546975 25468 state.cpp:60] Recovering state from '/tmp/Endpoint_SlaveEndpointTest_NoAuthorizer_0_mmA2ZE/meta'
I0205 00:04:47.547194 25454 status_update_manager.cpp:203] Recovering status update manager
I0205 00:04:47.547386 25464 containerizer.cpp:599] Recovering containerizer
I0205 00:04:47.548077 25466 provisioner.cpp:410] Provisioner recovery complete
I0205 00:04:47.548415 25461 slave.cpp:5499] Finished recovery
I0205 00:04:47.548872 25461 slave.cpp:5673] Querying resource estimator for oversubscribable
resources
I0205 00:04:47.549088 25459 slave.cpp:5687] Received oversubscribable resources {} from the
resource estimator
I0205 00:04:47.549710 25454 process.cpp:3697] Handling HTTP event for process 'slave(692)'
with path: '/slave(692)/monitor/statistics'
I0205 00:04:47.550380 25467 http.cpp:871] Authorizing principal 'test-principal' to GET the
'/monitor/statistics' endpoint
I0205 00:04:47.552043 25467 slave.cpp:803] Agent terminating
[       OK ] Endpoint/SlaveEndpointTest.NoAuthorizer/0 (13 ms)
[ RUN      ] Endpoint/SlaveEndpointTest.NoAuthorizer/1
I0205 00:04:47.557631 25453 containerizer.cpp:220] Using isolation: posix/cpu,posix/mem,filesystem/posix,network/cni
W0205 00:04:47.557968 25453 backend.cpp:76] Failed to create 'aufs' backend: AufsBackend requires
root privileges
W0205 00:04:47.558012 25453 backend.cpp:76] Failed to create 'bind' backend: BindBackend requires
root privileges
I0205 00:04:47.558028 25453 provisioner.cpp:249] Using default backend 'copy'
I0205 00:04:47.558657 25453 cluster.cpp:446] Creating default 'local' authorizer
I0205 00:04:47.559329 25460 slave.cpp:211] Mesos agent started on (693)@172.17.0.2:52435
I0205 00:04:47.559348 25460 slave.cpp:212] Flags at startup: --acls="" --appc_simple_discovery_uri_prefix="http://"
--appc_store_dir="/tmp/mesos/store/appc" --authenticate_http_readonly="true" --authenticate_http_readwrite="true"
--authenticatee="crammd5" --authentication_backoff_factor="1secs" --authorizer="local" --cgroups_cpu_enable_pids_and_tids_count="false"
--cgroups_enable_cfs="false" --cgroups_hierarchy="/sys/fs/cgroup" --cgroups_limit_swap="false"
--cgroups_root="mesos" --container_disk_watch_interval="15secs" --containerizers="mesos" --credential="/tmp/Endpoint_SlaveEndpointTest_NoAuthorizer_1_c7j0k9/credential"
--default_role="*" --disk_watch_interval="1mins" --docker="docker" --docker_kill_orphans="true"
--docker_registry="https://registry-1.docker.io" --docker_remove_delay="6hrs" --docker_socket="/var/run/docker.sock"
--docker_stop_timeout="0ns" --docker_store_dir="/tmp/mesos/store/docker" --docker_volume_checkpoint_dir="/var/run/mesos/isolators/docker/volume"
--enforce_container_disk_quota="false" --executor_registration_timeout="1mins" --executor_shutdown_grace_period="5secs"
--fetcher_cache_dir="/tmp/Endpoint_SlaveEndpointTest_NoAuthorizer_1_c7j0k9/fetch" --fetcher_cache_size="2GB"
--frameworks_home="" --gc_delay="1weeks" --gc_disk_headroom="0.1" --hadoop_home="" --help="false"
--hostname_lookup="true" --http_authenticators="basic" --http_command_executor="false" --http_credentials="/tmp/Endpoint_SlaveEndpointTest_NoAuthorizer_1_c7j0k9/http_credentials"
--http_heartbeat_interval="30secs" --initialize_driver_logging="true" --isolation="posix/cpu,posix/mem"
--launcher="posix" --launcher_dir="/mesos/build/src" --logbufsecs="0" --logging_level="INFO"
--max_completed_executors_per_framework="150" --oversubscribed_resources_interval="15secs"
--perf_duration="10secs" --perf_interval="1mins" --qos_correction_interval_min="0ns" --quiet="false"
--recover="reconnect" --recovery_timeout="15mins" --registration_backoff_factor="10ms" --resources="cpus:2;gpus:0;mem:1024;disk:1024;ports:[31000-32000]"
--revocable_cpu_low_priority="true" --runtime_dir="/tmp/Endpoint_SlaveEndpointTest_NoAuthorizer_1_c7j0k9"
--sandbox_directory="/mnt/mesos/sandbox" --strict="true" --switch_user="true" --systemd_enable_support="true"
--systemd_runtime_directory="/run/systemd/system" --version="false" --work_dir="/tmp/Endpoint_SlaveEndpointTest_NoAuthorizer_1_TFiUEf"
I0205 00:04:47.559790 25460 credentials.hpp:86] Loading credential for authentication from
'/tmp/Endpoint_SlaveEndpointTest_NoAuthorizer_1_c7j0k9/credential'
I0205 00:04:47.559918 25460 slave.cpp:354] Agent using credential for: test-principal
I0205 00:04:47.559936 25460 credentials.hpp:37] Loading credentials for authentication from
'/tmp/Endpoint_SlaveEndpointTest_NoAuthorizer_1_c7j0k9/http_credentials'
I0205 00:04:47.560046 25460 http.cpp:919] Using default 'basic' HTTP authenticator for realm
'mesos-agent-readonly'
I0205 00:04:47.560096 25460 http.cpp:919] Using default 'basic' HTTP authenticator for realm
'mesos-agent-readwrite'
I0205 00:04:47.560503 25460 slave.cpp:541] Agent resources: cpus(*):2; mem(*):1024; disk(*):1024;
ports(*):[31000-32000]
I0205 00:04:47.560545 25460 slave.cpp:549] Agent attributes: [  ]
I0205 00:04:47.560556 25460 slave.cpp:554] Agent hostname: 035a7ef6de02
I0205 00:04:47.560771 25468 status_update_manager.cpp:177] Pausing sending status updates
I0205 00:04:47.561084 25464 state.cpp:60] Recovering state from '/tmp/Endpoint_SlaveEndpointTest_NoAuthorizer_1_TFiUEf/meta'
I0205 00:04:47.561269 25458 status_update_manager.cpp:203] Recovering status update manager
I0205 00:04:47.561365 25469 containerizer.cpp:599] Recovering containerizer
I0205 00:04:47.562219 25469 provisioner.cpp:410] Provisioner recovery complete
I0205 00:04:47.562508 25456 slave.cpp:5499] Finished recovery
I0205 00:04:47.562980 25456 slave.cpp:5673] Querying resource estimator for oversubscribable
resources
I0205 00:04:47.563158 25467 slave.cpp:5687] Received oversubscribable resources {} from the
resource estimator
I0205 00:04:47.563879 25465 process.cpp:3697] Handling HTTP event for process 'slave(693)'
with path: '/slave(693)/monitor/statistics.json'
I0205 00:04:47.564498 25463 http.cpp:871] Authorizing principal 'test-principal' to GET the
'/monitor/statistics.json' endpoint
I0205 00:04:47.566807 25459 slave.cpp:803] Agent terminating
[       OK ] Endpoint/SlaveEndpointTest.NoAuthorizer/1 (14 ms)
[ RUN      ] Endpoint/SlaveEndpointTest.NoAuthorizer/2
I0205 00:04:47.572494 25453 containerizer.cpp:220] Using isolation: posix/cpu,posix/mem,filesystem/posix,network/cni
W0205 00:04:47.572844 25453 backend.cpp:76] Failed to create 'aufs' backend: AufsBackend requires
root privileges
W0205 00:04:47.572888 25453 backend.cpp:76] Failed to create 'bind' backend: BindBackend requires
root privileges
I0205 00:04:47.572906 25453 provisioner.cpp:249] Using default backend 'copy'
I0205 00:04:47.573868 25453 cluster.cpp:446] Creating default 'local' authorizer
I0205 00:04:47.574609 25456 slave.cpp:211] Mesos agent started on (694)@172.17.0.2:52435
I0205 00:04:47.574630 25456 slave.cpp:212] Flags at startup: --acls="" --appc_simple_discovery_uri_prefix="http://"
--appc_store_dir="/tmp/mesos/store/appc" --authenticate_http_readonly="true" --authenticate_http_readwrite="true"
--authenticatee="crammd5" --authentication_backoff_factor="1secs" --authorizer="local" --cgroups_cpu_enable_pids_and_tids_count="false"
--cgroups_enable_cfs="false" --cgroups_hierarchy="/sys/fs/cgroup" --cgroups_limit_swap="false"
--cgroups_root="mesos" --container_disk_watch_interval="15secs" --containerizers="mesos" --credential="/tmp/Endpoint_SlaveEndpointTest_NoAuthorizer_2_ANeDbK/credential"
--default_role="*" --disk_watch_interval="1mins" --docker="docker" --docker_kill_orphans="true"
--docker_registry="https://registry-1.docker.io" --docker_remove_delay="6hrs" --docker_socket="/var/run/docker.sock"
--docker_stop_timeout="0ns" --docker_store_dir="/tmp/mesos/store/docker" --docker_volume_checkpoint_dir="/var/run/mesos/isolators/docker/volume"
--enforce_container_disk_quota="false" --executor_registration_timeout="1mins" --executor_shutdown_grace_period="5secs"
--fetcher_cache_dir="/tmp/Endpoint_SlaveEndpointTest_NoAuthorizer_2_ANeDbK/fetch" --fetcher_cache_size="2GB"
--frameworks_home="" --gc_delay="1weeks" --gc_disk_headroom="0.1" --hadoop_home="" --help="false"
--hostname_lookup="true" --http_authenticators="basic" --http_command_executor="false" --http_credentials="/tmp/Endpoint_SlaveEndpointTest_NoAuthorizer_2_ANeDbK/http_credentials"
--http_heartbeat_interval="30secs" --initialize_driver_logging="true" --isolation="posix/cpu,posix/mem"
--launcher="posix" --launcher_dir="/mesos/build/src" --logbufsecs="0" --logging_level="INFO"
--max_completed_executors_per_framework="150" --oversubscribed_resources_interval="15secs"
--perf_duration="10secs" --perf_interval="1mins" --qos_correction_interval_min="0ns" --quiet="false"
--recover="reconnect" --recovery_timeout="15mins" --registration_backoff_factor="10ms" --resources="cpus:2;gpus:0;mem:1024;disk:1024;ports:[31000-32000]"
--revocable_cpu_low_priority="true" --runtime_dir="/tmp/Endpoint_SlaveEndpointTest_NoAuthorizer_2_ANeDbK"
--sandbox_directory="/mnt/mesos/sandbox" --strict="true" --switch_user="true" --systemd_enable_support="true"
--systemd_runtime_directory="/run/systemd/system" --version="false" --work_dir="/tmp/Endpoint_SlaveEndpointTest_NoAuthorizer_2_tyV5sQ"
I0205 00:04:47.575049 25456 credentials.hpp:86] Loading credential for authentication from
'/tmp/Endpoint_SlaveEndpointTest_NoAuthorizer_2_ANeDbK/credential'
I0205 00:04:47.575163 25456 slave.cpp:354] Agent using credential for: test-principal
I0205 00:04:47.575182 25456 credentials.hpp:37] Loading credentials for authentication from
'/tmp/Endpoint_SlaveEndpointTest_NoAuthorizer_2_ANeDbK/http_credentials'
I0205 00:04:47.575309 25456 http.cpp:919] Using default 'basic' HTTP authenticator for realm
'mesos-agent-readonly'
I0205 00:04:47.575368 25456 http.cpp:919] Using default 'basic' HTTP authenticator for realm
'mesos-agent-readwrite'
I0205 00:04:47.575872 25456 slave.cpp:541] Agent resources: cpus(*):2; mem(*):1024; disk(*):1024;
ports(*):[31000-32000]
I0205 00:04:47.575917 25456 slave.cpp:549] Agent attributes: [  ]
I0205 00:04:47.575929 25456 slave.cpp:554] Agent hostname: 035a7ef6de02
I0205 00:04:47.576020 25467 status_update_manager.cpp:177] Pausing sending status updates
I0205 00:04:47.576352 25454 state.cpp:60] Recovering state from '/tmp/Endpoint_SlaveEndpointTest_NoAuthorizer_2_tyV5sQ/meta'
I0205 00:04:47.576519 25456 status_update_manager.cpp:203] Recovering status update manager
I0205 00:04:47.576709 25459 containerizer.cpp:599] Recovering containerizer
I0205 00:04:47.577360 25462 provisioner.cpp:410] Provisioner recovery complete
I0205 00:04:47.577599 25462 slave.cpp:5499] Finished recovery
I0205 00:04:47.578008 25462 slave.cpp:5673] Querying resource estimator for oversubscribable
resources
I0205 00:04:47.578136 25461 slave.cpp:5687] Received oversubscribable resources {} from the
resource estimator
I0205 00:04:47.578913 25462 process.cpp:3697] Handling HTTP event for process 'slave(694)'
with path: '/slave(694)/containers'
I0205 00:04:47.579408 25465 http.cpp:871] Authorizing principal 'test-principal' to GET the
'/containers' endpoint
I0205 00:04:47.580818 25458 slave.cpp:803] Agent terminating
[       OK ] Endpoint/SlaveEndpointTest.NoAuthorizer/2 (13 ms)
[----------] 9 tests from Endpoint/SlaveEndpointTest (115 ms total)

[----------] Global test environment tear-down
[==========] 1427 tests from 159 test cases ran. (338505 ms total)
[  PASSED  ] 1426 tests.
[  FAILED  ] 1 test, listed below:
[  FAILED  ] MasterTest.SlavesEndpointTwoSlaves

 1 FAILED TEST
  YOU HAVE 11 DISABLED TESTS

make[3]: *** [CMakeFiles/check] Error 1
make[3]: Leaving directory `/mesos/build'
make[2]: *** [CMakeFiles/check.dir/all] Error 2
make[2]: Leaving directory `/mesos/build'
make[1]: *** [CMakeFiles/check.dir/rule] Error 2
make[1]: Leaving directory `/mesos/build'
make: *** [check] Error 2
+ docker rmi mesos-1486250208-8481
Untagged: mesos-1486250208-8481:latest
Deleted: sha256:e65d9488b69bb0a4860292bad791547bc1f6a004c06479af40431f8b9c7a3041
Deleted: sha256:e930e88c7b34d4605ab5da9b867b4ea62d6985097fd4bedfb1bb1e49230dde5b
Deleted: sha256:a4923bd90c7827b2d6e8fe2a7cf95e3bee19ef1ca0ea45fafe493dc79d0a15ab
Deleted: sha256:e0287e44ed71226ddc84a968aa66b3da9076bfb4d4b1cd49e1b18b98d8f2e500
Deleted: sha256:357a27c8fbaea9106c976011db2cecc94640103eb3845cbb555e4b66c3bacfd3
Deleted: sha256:ae5ada9cf4774d15c64c70c71ad9a57de652736a7bf3115014efc060fe8ea649
Deleted: sha256:7fbdacd8eb0fc7f12767fffbcbae719fd905c8c55569bbb65398b210ddab421b
Deleted: sha256:965ecf7abe3829b002e05e4bfedfa6f39396ff2963c7644328c0a193bb4a2814
Deleted: sha256:415e3baed86520272449e41130223c135f7f0e31852e33c603e260ee1aecb4c2
Deleted: sha256:c2307f2cfd721319b7176a45f910b8cd11698377a290356d89f65b38c9088adf
Deleted: sha256:9df9f0e7acc8b0111c2670c1f9c18d0cf4af3071fe9673c4be280a04ddcb76e1
Deleted: sha256:05d46b25f7dabddc05ad745690996cad4d89cfe3615bf21e80d43d8b5ba27693
Deleted: sha256:ed5a26798350a28d07bfa3b42b61aa88df4265d68112cd7078f83a5a2b2ba6fa
Deleted: sha256:5f1564efc82d692a8ab469c10a22bdfdcbff1edc3d821d4429a720ab78df72f3
Deleted: sha256:1c3443f2361789fd62b9a5a3e8455ed008e4adb8359c62bc9fe45a471f2081ba
Deleted: sha256:1fd64c96d54184f8ec9eadfe8cf5a80fb703182bebe4f9d58e8e7fd1933d1e4c
Deleted: sha256:7e067860ed098bbc0c9b934fd54cc2e2e5f6e3f2676e97ddc0ad31f08dd319d4
Deleted: sha256:b9535407b6402b2b454ace1d242e7f7ab795a0810809f1352cfe3d9675f649da
Deleted: sha256:d4f1236a814f3ea9cdbbf870c049fdd495914b902afc8eb41722ae755262be3d
Deleted: sha256:09e65777e40d9b2a434e15ad099f2046c44c064f44e212dbb68d42abe0ef2ad3
Deleted: sha256:06b00e97cd62bd3630e1b80245bf461bc3ffb04beed7309f9f2fc22c9bcf1cd7
Deleted: sha256:37960841b57baaedb32244f30376ba3282571655af1b9e8d6ff9a5144f68b51a
Deleted: sha256:92fc94e29ed88d840c64dda55bd0d9f45899ca9bea2b2e9dceb6aa6fbd0f99b8
Deleted: sha256:348881cf271f3f0dd6ca247e05eaf1e171af129691bb95d5871d4e767e498b82
Deleted: sha256:6dc4b36a5a936ece8b088ef0be139436107162c53e133caf6e0259e50875e86d
Build step 'Execute shell' marked build as failure

Mime
View raw message