mesos-builds mailing list archives

Site index · List index
Message view « Date » · « Thread »
Top « Date » · « Thread »
From Apache Jenkins Server <jenk...@builds.apache.org>
Subject Build failed in Jenkins: Mesos-Buildbot » cmake,clang,--verbose --enable-libevent --enable-ssl,GLOG_v=1 MESOS_VERBOSE=1,ubuntu:14.04,(docker||Hadoop)&&(!ubuntu-us1)&&(!ubuntu-eu2) #3284
Date Sat, 18 Feb 2017 11:15:20 GMT
See <https://builds.apache.org/job/Mesos-Buildbot/BUILDTOOL=cmake,COMPILER=clang,CONFIGURATION=--verbose%20--enable-libevent%20--enable-ssl,ENVIRONMENT=GLOG_v=1%20MESOS_VERBOSE=1,OS=ubuntu%3A14.04,label_exp=(docker%7C%7CHadoop)&&(!ubuntu-us1)&&(!ubuntu-eu2)/3284/changes>

Changes:

[haosdent] Refactored `Docker::run` to make it only aware of docker cli options.

------------------------------------------
[...truncated 184708 lines...]
I0218 11:15:12.641057 25367 status_update_manager.cpp:177] Pausing sending status updates
I0218 11:15:12.641400 25376 state.cpp:62] Recovering state from '/tmp/Endpoint_SlaveEndpointTest_AuthorizedRequest_1_aGCA0S/meta'
I0218 11:15:12.641630 25361 status_update_manager.cpp:203] Recovering status update manager
I0218 11:15:12.641757 25367 containerizer.cpp:599] Recovering containerizer
I0218 11:15:12.642366 25362 provisioner.cpp:410] Provisioner recovery complete
I0218 11:15:12.642639 25367 slave.cpp:5558] Finished recovery
I0218 11:15:12.642976 25367 slave.cpp:5732] Querying resource estimator for oversubscribable
resources
I0218 11:15:12.643074 25374 slave.cpp:5746] Received oversubscribable resources {} from the
resource estimator
I0218 11:15:12.643682 25367 process.cpp:3704] Handling HTTP event for process 'slave(694)'
with path: '/slave(694)/monitor/statistics.json'
I0218 11:15:12.644214 25367 http.cpp:871] Authorizing principal 'test-principal' to GET the
'/monitor/statistics.json' endpoint
I0218 11:15:12.645462 25366 slave.cpp:803] Agent terminating
[       OK ] Endpoint/SlaveEndpointTest.AuthorizedRequest/1 (12 ms)
[ RUN      ] Endpoint/SlaveEndpointTest.AuthorizedRequest/2
I0218 11:15:12.685245 25360 containerizer.cpp:220] Using isolation: posix/cpu,posix/mem,filesystem/posix,network/cni
W0218 11:15:12.685603 25360 backend.cpp:76] Failed to create 'aufs' backend: AufsBackend requires
root privileges
W0218 11:15:12.685654 25360 backend.cpp:76] Failed to create 'bind' backend: BindBackend requires
root privileges
I0218 11:15:12.685677 25360 provisioner.cpp:249] Using default backend 'copy'
I0218 11:15:12.687402 25365 slave.cpp:211] Mesos agent started on (695)@172.17.0.2:34963
I0218 11:15:12.687438 25365 slave.cpp:212] Flags at startup: --acls="" --appc_simple_discovery_uri_prefix="http://"
--appc_store_dir="/tmp/mesos/store/appc" --authenticate_http_readonly="true" --authenticate_http_readwrite="true"
--authenticatee="crammd5" --authentication_backoff_factor="1secs" --authorizer="local" --cgroups_cpu_enable_pids_and_tids_count="false"
--cgroups_enable_cfs="false" --cgroups_hierarchy="/sys/fs/cgroup" --cgroups_limit_swap="false"
--cgroups_root="mesos" --container_disk_watch_interval="15secs" --containerizers="mesos" --credential="/tmp/Endpoint_SlaveEndpointTest_AuthorizedRequest_2_APnZr6/credential"
--default_role="*" --disk_watch_interval="1mins" --docker="docker" --docker_kill_orphans="true"
--docker_registry="https://registry-1.docker.io" --docker_remove_delay="6hrs" --docker_socket="/var/run/docker.sock"
--docker_stop_timeout="0ns" --docker_store_dir="/tmp/mesos/store/docker" --docker_volume_checkpoint_dir="/var/run/mesos/isolators/docker/volume"
--enforce_container_disk_quota="false" --executor_registration_timeout="1mins" --executor_shutdown_grace_period="5secs"
--fetcher_cache_dir="/tmp/Endpoint_SlaveEndpointTest_AuthorizedRequest_2_APnZr6/fetch" --fetcher_cache_size="2GB"
--frameworks_home="" --gc_delay="1weeks" --gc_disk_headroom="0.1" --hadoop_home="" --help="false"
--hostname_lookup="true" --http_authenticators="basic" --http_command_executor="false" --http_credentials="/tmp/Endpoint_SlaveEndpointTest_AuthorizedRequest_2_APnZr6/http_credentials"
--http_heartbeat_interval="30secs" --initialize_driver_logging="true" --isolation="posix/cpu,posix/mem"
--launcher="posix" --launcher_dir="/mesos/build/src" --logbufsecs="0" --logging_level="INFO"
--max_completed_executors_per_framework="150" --oversubscribed_resources_interval="15secs"
--perf_duration="10secs" --perf_interval="1mins" --qos_correction_interval_min="0ns" --quiet="false"
--recover="reconnect" --recovery_timeout="15mins" --registration_backoff_factor="10ms" --resources="cpus:2;gpus:0;mem:1024;disk:1024;ports:[31000-32000]"
--revocable_cpu_low_priority="true" --runtime_dir="/tmp/Endpoint_SlaveEndpointTest_AuthorizedRequest_2_APnZr6"
--sandbox_directory="/mnt/mesos/sandbox" --strict="true" --switch_user="true" --systemd_enable_support="true"
--systemd_runtime_directory="/run/systemd/system" --version="false" --work_dir="/tmp/Endpoint_SlaveEndpointTest_AuthorizedRequest_2_sEYBjR"
I0218 11:15:12.687824 25365 credentials.hpp:86] Loading credential for authentication from
'/tmp/Endpoint_SlaveEndpointTest_AuthorizedRequest_2_APnZr6/credential'
I0218 11:15:12.687922 25365 slave.cpp:354] Agent using credential for: test-principal
I0218 11:15:12.687937 25365 credentials.hpp:37] Loading credentials for authentication from
'/tmp/Endpoint_SlaveEndpointTest_AuthorizedRequest_2_APnZr6/http_credentials'
I0218 11:15:12.688047 25365 http.cpp:919] Using default 'basic' HTTP authenticator for realm
'mesos-agent-readonly'
I0218 11:15:12.688097 25365 http.cpp:919] Using default 'basic' HTTP authenticator for realm
'mesos-agent-readwrite'
I0218 11:15:12.688607 25365 slave.cpp:541] Agent resources: cpus(*):2; mem(*):1024; disk(*):1024;
ports(*):[31000-32000]
I0218 11:15:12.688650 25365 slave.cpp:549] Agent attributes: [  ]
I0218 11:15:12.688661 25365 slave.cpp:554] Agent hostname: 4181adda1077
I0218 11:15:12.688737 25370 status_update_manager.cpp:177] Pausing sending status updates
I0218 11:15:12.689163 25369 state.cpp:62] Recovering state from '/tmp/Endpoint_SlaveEndpointTest_AuthorizedRequest_2_sEYBjR/meta'
I0218 11:15:12.689327 25370 status_update_manager.cpp:203] Recovering status update manager
I0218 11:15:12.689416 25376 containerizer.cpp:599] Recovering containerizer
I0218 11:15:12.690016 25376 provisioner.cpp:410] Provisioner recovery complete
I0218 11:15:12.690258 25361 slave.cpp:5558] Finished recovery
I0218 11:15:12.690673 25361 slave.cpp:5732] Querying resource estimator for oversubscribable
resources
I0218 11:15:12.690845 25369 slave.cpp:5746] Received oversubscribable resources {} from the
resource estimator
I0218 11:15:12.691748 25366 process.cpp:3704] Handling HTTP event for process 'slave(695)'
with path: '/slave(695)/containers'
I0218 11:15:12.692420 25361 http.cpp:871] Authorizing principal 'test-principal' to GET the
'/containers' endpoint
I0218 11:15:12.694394 25360 slave.cpp:803] Agent terminating
[       OK ] Endpoint/SlaveEndpointTest.AuthorizedRequest/2 (15 ms)
[ RUN      ] Endpoint/SlaveEndpointTest.UnauthorizedRequest/0
I0218 11:15:12.727187 25360 containerizer.cpp:220] Using isolation: posix/cpu,posix/mem,filesystem/posix,network/cni
W0218 11:15:12.727473 25360 backend.cpp:76] Failed to create 'aufs' backend: AufsBackend requires
root privileges
W0218 11:15:12.727509 25360 backend.cpp:76] Failed to create 'bind' backend: BindBackend requires
root privileges
I0218 11:15:12.727521 25360 provisioner.cpp:249] Using default backend 'copy'
I0218 11:15:12.728742 25373 slave.cpp:211] Mesos agent started on (696)@172.17.0.2:34963
I0218 11:15:12.728767 25373 slave.cpp:212] Flags at startup: --acls="" --appc_simple_discovery_uri_prefix="http://"
--appc_store_dir="/tmp/mesos/store/appc" --authenticate_http_readonly="true" --authenticate_http_readwrite="true"
--authenticatee="crammd5" --authentication_backoff_factor="1secs" --authorizer="local" --cgroups_cpu_enable_pids_and_tids_count="false"
--cgroups_enable_cfs="false" --cgroups_hierarchy="/sys/fs/cgroup" --cgroups_limit_swap="false"
--cgroups_root="mesos" --container_disk_watch_interval="15secs" --containerizers="mesos" --credential="/tmp/Endpoint_SlaveEndpointTest_UnauthorizedRequest_0_wnUVk5/credential"
--default_role="*" --disk_watch_interval="1mins" --docker="docker" --docker_kill_orphans="true"
--docker_registry="https://registry-1.docker.io" --docker_remove_delay="6hrs" --docker_socket="/var/run/docker.sock"
--docker_stop_timeout="0ns" --docker_store_dir="/tmp/mesos/store/docker" --docker_volume_checkpoint_dir="/var/run/mesos/isolators/docker/volume"
--enforce_container_disk_quota="false" --executor_registration_timeout="1mins" --executor_shutdown_grace_period="5secs"
--fetcher_cache_dir="/tmp/Endpoint_SlaveEndpointTest_UnauthorizedRequest_0_wnUVk5/fetch" --fetcher_cache_size="2GB"
--frameworks_home="" --gc_delay="1weeks" --gc_disk_headroom="0.1" --hadoop_home="" --help="false"
--hostname_lookup="true" --http_authenticators="basic" --http_command_executor="false" --http_credentials="/tmp/Endpoint_SlaveEndpointTest_UnauthorizedRequest_0_wnUVk5/http_credentials"
--http_heartbeat_interval="30secs" --initialize_driver_logging="true" --isolation="posix/cpu,posix/mem"
--launcher="posix" --launcher_dir="/mesos/build/src" --logbufsecs="0" --logging_level="INFO"
--max_completed_executors_per_framework="150" --oversubscribed_resources_interval="15secs"
--perf_duration="10secs" --perf_interval="1mins" --qos_correction_interval_min="0ns" --quiet="false"
--recover="reconnect" --recovery_timeout="15mins" --registration_backoff_factor="10ms" --resources="cpus:2;gpus:0;mem:1024;disk:1024;ports:[31000-32000]"
--revocable_cpu_low_priority="true" --runtime_dir="/tmp/Endpoint_SlaveEndpointTest_UnauthorizedRequest_0_wnUVk5"
--sandbox_directory="/mnt/mesos/sandbox" --strict="true" --switch_user="true" --systemd_enable_support="true"
--systemd_runtime_directory="/run/systemd/system" --version="false" --work_dir="/tmp/Endpoint_SlaveEndpointTest_UnauthorizedRequest_0_4sMI5P"
I0218 11:15:12.729084 25373 credentials.hpp:86] Loading credential for authentication from
'/tmp/Endpoint_SlaveEndpointTest_UnauthorizedRequest_0_wnUVk5/credential'
I0218 11:15:12.729166 25373 slave.cpp:354] Agent using credential for: test-principal
I0218 11:15:12.729178 25373 credentials.hpp:37] Loading credentials for authentication from
'/tmp/Endpoint_SlaveEndpointTest_UnauthorizedRequest_0_wnUVk5/http_credentials'
I0218 11:15:12.729279 25373 http.cpp:919] Using default 'basic' HTTP authenticator for realm
'mesos-agent-readonly'
I0218 11:15:12.729336 25373 http.cpp:919] Using default 'basic' HTTP authenticator for realm
'mesos-agent-readwrite'
I0218 11:15:12.730175 25373 slave.cpp:541] Agent resources: cpus(*):2; mem(*):1024; disk(*):1024;
ports(*):[31000-32000]
I0218 11:15:12.730268 25373 slave.cpp:549] Agent attributes: [  ]
I0218 11:15:12.730276 25373 slave.cpp:554] Agent hostname: 4181adda1077
I0218 11:15:12.730340 25372 status_update_manager.cpp:177] Pausing sending status updates
I0218 11:15:12.730690 25373 state.cpp:62] Recovering state from '/tmp/Endpoint_SlaveEndpointTest_UnauthorizedRequest_0_4sMI5P/meta'
I0218 11:15:12.731020 25365 status_update_manager.cpp:203] Recovering status update manager
I0218 11:15:12.731129 25363 containerizer.cpp:599] Recovering containerizer
I0218 11:15:12.731809 25361 provisioner.cpp:410] Provisioner recovery complete
I0218 11:15:12.732029 25363 slave.cpp:5558] Finished recovery
I0218 11:15:12.732461 25363 slave.cpp:5732] Querying resource estimator for oversubscribable
resources
I0218 11:15:12.732617 25368 slave.cpp:5746] Received oversubscribable resources {} from the
resource estimator
I0218 11:15:12.733456 25369 process.cpp:3704] Handling HTTP event for process 'slave(696)'
with path: '/slave(696)/monitor/statistics'
I0218 11:15:12.733953 25372 http.cpp:871] Authorizing principal 'test-principal' to GET the
'/monitor/statistics' endpoint
I0218 11:15:12.735563 25361 slave.cpp:803] Agent terminating
[       OK ] Endpoint/SlaveEndpointTest.UnauthorizedRequest/0 (13 ms)
[ RUN      ] Endpoint/SlaveEndpointTest.UnauthorizedRequest/1
I0218 11:15:12.744184 25360 containerizer.cpp:220] Using isolation: posix/cpu,posix/mem,filesystem/posix,network/cni
W0218 11:15:12.744547 25360 backend.cpp:76] Failed to create 'aufs' backend: AufsBackend requires
root privileges
W0218 11:15:12.744591 25360 backend.cpp:76] Failed to create 'bind' backend: BindBackend requires
root privileges
I0218 11:15:12.744609 25360 provisioner.cpp:249] Using default backend 'copy'
I0218 11:15:12.745934 25373 slave.cpp:211] Mesos agent started on (697)@172.17.0.2:34963
I0218 11:15:12.745990 25373 slave.cpp:212] Flags at startup: --acls="" --appc_simple_discovery_uri_prefix="http://"
--appc_store_dir="/tmp/mesos/store/appc" --authenticate_http_readonly="true" --authenticate_http_readwrite="true"
--authenticatee="crammd5" --authentication_backoff_factor="1secs" --authorizer="local" --cgroups_cpu_enable_pids_and_tids_count="false"
--cgroups_enable_cfs="false" --cgroups_hierarchy="/sys/fs/cgroup" --cgroups_limit_swap="false"
--cgroups_root="mesos" --container_disk_watch_interval="15secs" --containerizers="mesos" --credential="/tmp/Endpoint_SlaveEndpointTest_UnauthorizedRequest_1_szWTs4/credential"
--default_role="*" --disk_watch_interval="1mins" --docker="docker" --docker_kill_orphans="true"
--docker_registry="https://registry-1.docker.io" --docker_remove_delay="6hrs" --docker_socket="/var/run/docker.sock"
--docker_stop_timeout="0ns" --docker_store_dir="/tmp/mesos/store/docker" --docker_volume_checkpoint_dir="/var/run/mesos/isolators/docker/volume"
--enforce_container_disk_quota="false" --executor_registration_timeout="1mins" --executor_shutdown_grace_period="5secs"
--fetcher_cache_dir="/tmp/Endpoint_SlaveEndpointTest_UnauthorizedRequest_1_szWTs4/fetch" --fetcher_cache_size="2GB"
--frameworks_home="" --gc_delay="1weeks" --gc_disk_headroom="0.1" --hadoop_home="" --help="false"
--hostname_lookup="true" --http_authenticators="basic" --http_command_executor="false" --http_credentials="/tmp/Endpoint_SlaveEndpointTest_UnauthorizedRequest_1_szWTs4/http_credentials"
--http_heartbeat_interval="30secs" --initialize_driver_logging="true" --isolation="posix/cpu,posix/mem"
--launcher="posix" --launcher_dir="/mesos/build/src" --logbufsecs="0" --logging_level="INFO"
--max_completed_executors_per_framework="150" --oversubscribed_resources_interval="15secs"
--perf_duration="10secs" --perf_interval="1mins" --qos_correction_interval_min="0ns" --quiet="false"
--recover="reconnect" --recovery_timeout="15mins" --registration_backoff_factor="10ms" --resources="cpus:2;gpus:0;mem:1024;disk:1024;ports:[31000-32000]"
--revocable_cpu_low_priority="true" --runtime_dir="/tmp/Endpoint_SlaveEndpointTest_UnauthorizedRequest_1_szWTs4"
--sandbox_directory="/mnt/mesos/sandbox" --strict="true" --switch_user="true" --systemd_enable_support="true"
--systemd_runtime_directory="/run/systemd/system" --version="false" --work_dir="/tmp/Endpoint_SlaveEndpointTest_UnauthorizedRequest_1_6aiWaP"
I0218 11:15:12.746435 25373 credentials.hpp:86] Loading credential for authentication from
'/tmp/Endpoint_SlaveEndpointTest_UnauthorizedRequest_1_szWTs4/credential'
I0218 11:15:12.746539 25373 slave.cpp:354] Agent using credential for: test-principal
I0218 11:15:12.746554 25373 credentials.hpp:37] Loading credentials for authentication from
'/tmp/Endpoint_SlaveEndpointTest_UnauthorizedRequest_1_szWTs4/http_credentials'
I0218 11:15:12.746677 25373 http.cpp:919] Using default 'basic' HTTP authenticator for realm
'mesos-agent-readonly'
I0218 11:15:12.746727 25373 http.cpp:919] Using default 'basic' HTTP authenticator for realm
'mesos-agent-readwrite'
I0218 11:15:12.747269 25373 slave.cpp:541] Agent resources: cpus(*):2; mem(*):1024; disk(*):1024;
ports(*):[31000-32000]
I0218 11:15:12.747310 25373 slave.cpp:549] Agent attributes: [  ]
I0218 11:15:12.747319 25373 slave.cpp:554] Agent hostname: 4181adda1077
I0218 11:15:12.747411 25362 status_update_manager.cpp:177] Pausing sending status updates
I0218 11:15:12.747722 25368 state.cpp:62] Recovering state from '/tmp/Endpoint_SlaveEndpointTest_UnauthorizedRequest_1_6aiWaP/meta'
I0218 11:15:12.747926 25370 status_update_manager.cpp:203] Recovering status update manager
I0218 11:15:12.748077 25361 containerizer.cpp:599] Recovering containerizer
I0218 11:15:12.748721 25376 provisioner.cpp:410] Provisioner recovery complete
I0218 11:15:12.748965 25370 slave.cpp:5558] Finished recovery
I0218 11:15:12.758659 25370 slave.cpp:5732] Querying resource estimator for oversubscribable
resources
I0218 11:15:12.758754 25368 slave.cpp:5746] Received oversubscribable resources {} from the
resource estimator
I0218 11:15:12.759536 25367 process.cpp:3704] Handling HTTP event for process 'slave(697)'
with path: '/slave(697)/monitor/statistics.json'
I0218 11:15:12.760010 25371 http.cpp:871] Authorizing principal 'test-principal' to GET the
'/monitor/statistics.json' endpoint
I0218 11:15:12.762420 25364 slave.cpp:803] Agent terminating
[       OK ] Endpoint/SlaveEndpointTest.UnauthorizedRequest/1 (23 ms)
[ RUN      ] Endpoint/SlaveEndpointTest.UnauthorizedRequest/2
I0218 11:15:12.767484 25360 containerizer.cpp:220] Using isolation: posix/cpu,posix/mem,filesystem/posix,network/cni
W0218 11:15:12.767809 25360 backend.cpp:76] Failed to create 'aufs' backend: AufsBackend requires
root privileges
W0218 11:15:12.767855 25360 backend.cpp:76] Failed to create 'bind' backend: BindBackend requires
root privileges
I0218 11:15:12.767868 25360 provisioner.cpp:249] Using default backend 'copy'
I0218 11:15:12.769186 25361 slave.cpp:211] Mesos agent started on (698)@172.17.0.2:34963
I0218 11:15:12.769222 25361 slave.cpp:212] Flags at startup: --acls="" --appc_simple_discovery_uri_prefix="http://"
--appc_store_dir="/tmp/mesos/store/appc" --authenticate_http_readonly="true" --authenticate_http_readwrite="true"
--authenticatee="crammd5" --authentication_backoff_factor="1secs" --authorizer="local" --cgroups_cpu_enable_pids_and_tids_count="false"
--cgroups_enable_cfs="false" --cgroups_hierarchy="/sys/fs/cgroup" --cgroups_limit_swap="false"
--cgroups_root="mesos" --container_disk_watch_interval="15secs" --containerizers="mesos" --credential="/tmp/Endpoint_SlaveEndpointTest_UnauthorizedRequest_2_UGSzQ3/credential"
--default_role="*" --disk_watch_interval="1mins" --docker="docker" --docker_kill_orphans="true"
--docker_registry="https://registry-1.docker.io" --docker_remove_delay="6hrs" --docker_socket="/var/run/docker.sock"
--docker_stop_timeout="0ns" --docker_store_dir="/tmp/mesos/store/docker" --docker_volume_checkpoint_dir="/var/run/mesos/isolators/docker/volume"
--enforce_container_disk_quota="false" --executor_registration_timeout="1mins" --executor_shutdown_grace_period="5secs"
--fetcher_cache_dir="/tmp/Endpoint_SlaveEndpointTest_UnauthorizedRequest_2_UGSzQ3/fetch" --fetcher_cache_size="2GB"
--frameworks_home="" --gc_delay="1weeks" --gc_disk_headroom="0.1" --hadoop_home="" --help="false"
--hostname_lookup="true" --http_authenticators="basic" --http_command_executor="false" --http_credentials="/tmp/Endpoint_SlaveEndpointTest_UnauthorizedRequest_2_UGSzQ3/http_credentials"
--http_heartbeat_interval="30secs" --initialize_driver_logging="true" --isolation="posix/cpu,posix/mem"
--launcher="posix" --launcher_dir="/mesos/build/src" --logbufsecs="0" --logging_level="INFO"
--max_completed_executors_per_framework="150" --oversubscribed_resources_interval="15secs"
--perf_duration="10secs" --perf_interval="1mins" --qos_correction_interval_min="0ns" --quiet="false"
--recover="reconnect" --recovery_timeout="15mins" --registration_backoff_factor="10ms" --resources="cpus:2;gpus:0;mem:1024;disk:1024;ports:[31000-32000]"
--revocable_cpu_low_priority="true" --runtime_dir="/tmp/Endpoint_SlaveEndpointTest_UnauthorizedRequest_2_UGSzQ3"
--sandbox_directory="/mnt/mesos/sandbox" --strict="true" --switch_user="true" --systemd_enable_support="true"
--systemd_runtime_directory="/run/systemd/system" --version="false" --work_dir="/tmp/Endpoint_SlaveEndpointTest_UnauthorizedRequest_2_yInOuO"
I0218 11:15:12.769645 25361 credentials.hpp:86] Loading credential for authentication from
'/tmp/Endpoint_SlaveEndpointTest_UnauthorizedRequest_2_UGSzQ3/credential'
I0218 11:15:12.769755 25361 slave.cpp:354] Agent using credential for: test-principal
I0218 11:15:12.769773 25361 credentials.hpp:37] Loading credentials for authentication from
'/tmp/Endpoint_SlaveEndpointTest_UnauthorizedRequest_2_UGSzQ3/http_credentials'
I0218 11:15:12.769901 25361 http.cpp:919] Using default 'basic' HTTP authenticator for realm
'mesos-agent-readonly'
I0218 11:15:12.769965 25361 http.cpp:919] Using default 'basic' HTTP authenticator for realm
'mesos-agent-readwrite'
I0218 11:15:12.770483 25361 slave.cpp:541] Agent resources: cpus(*):2; mem(*):1024; disk(*):1024;
ports(*):[31000-32000]
I0218 11:15:12.770524 25361 slave.cpp:549] Agent attributes: [  ]
I0218 11:15:12.770529 25361 slave.cpp:554] Agent hostname: 4181adda1077
I0218 11:15:12.770679 25366 status_update_manager.cpp:177] Pausing sending status updates
I0218 11:15:12.770900 25365 state.cpp:62] Recovering state from '/tmp/Endpoint_SlaveEndpointTest_UnauthorizedRequest_2_yInOuO/meta'
I0218 11:15:12.771266 25371 status_update_manager.cpp:203] Recovering status update manager
I0218 11:15:12.771364 25372 containerizer.cpp:599] Recovering containerizer
I0218 11:15:12.771857 25364 provisioner.cpp:410] Provisioner recovery complete
I0218 11:15:12.772148 25370 slave.cpp:5558] Finished recovery
I0218 11:15:12.772418 25370 slave.cpp:5732] Querying resource estimator for oversubscribable
resources
I0218 11:15:12.772506 25365 slave.cpp:5746] Received oversubscribable resources {} from the
resource estimator
I0218 11:15:12.773238 25363 process.cpp:3704] Handling HTTP event for process 'slave(698)'
with path: '/slave(698)/containers'
I0218 11:15:12.773808 25375 http.cpp:871] Authorizing principal 'test-principal' to GET the
'/containers' endpoint
I0218 11:15:12.775156 25361 slave.cpp:803] Agent terminating
[       OK ] Endpoint/SlaveEndpointTest.UnauthorizedRequest/2 (12 ms)
[ RUN      ] Endpoint/SlaveEndpointTest.NoAuthorizer/0
I0218 11:15:12.802669 25360 containerizer.cpp:220] Using isolation: posix/cpu,posix/mem,filesystem/posix,network/cni
W0218 11:15:12.802992 25360 backend.cpp:76] Failed to create 'aufs' backend: AufsBackend requires
root privileges
W0218 11:15:12.803036 25360 backend.cpp:76] Failed to create 'bind' backend: BindBackend requires
root privileges
I0218 11:15:12.803051 25360 provisioner.cpp:249] Using default backend 'copy'
I0218 11:15:12.803649 25360 cluster.cpp:446] Creating default 'local' authorizer
I0218 11:15:12.804383 25362 slave.cpp:211] Mesos agent started on (699)@172.17.0.2:34963
I0218 11:15:12.804414 25362 slave.cpp:212] Flags at startup: --acls="" --appc_simple_discovery_uri_prefix="http://"
--appc_store_dir="/tmp/mesos/store/appc" --authenticate_http_readonly="true" --authenticate_http_readwrite="true"
--authenticatee="crammd5" --authentication_backoff_factor="1secs" --authorizer="local" --cgroups_cpu_enable_pids_and_tids_count="false"
--cgroups_enable_cfs="false" --cgroups_hierarchy="/sys/fs/cgroup" --cgroups_limit_swap="false"
--cgroups_root="mesos" --container_disk_watch_interval="15secs" --containerizers="mesos" --credential="/tmp/Endpoint_SlaveEndpointTest_NoAuthorizer_0_4l5yx3/credential"
--default_role="*" --disk_watch_interval="1mins" --docker="docker" --docker_kill_orphans="true"
--docker_registry="https://registry-1.docker.io" --docker_remove_delay="6hrs" --docker_socket="/var/run/docker.sock"
--docker_stop_timeout="0ns" --docker_store_dir="/tmp/mesos/store/docker" --docker_volume_checkpoint_dir="/var/run/mesos/isolators/docker/volume"
--enforce_container_disk_quota="false" --executor_registration_timeout="1mins" --executor_shutdown_grace_period="5secs"
--fetcher_cache_dir="/tmp/Endpoint_SlaveEndpointTest_NoAuthorizer_0_4l5yx3/fetch" --fetcher_cache_size="2GB"
--frameworks_home="" --gc_delay="1weeks" --gc_disk_headroom="0.1" --hadoop_home="" --help="false"
--hostname_lookup="true" --http_authenticators="basic" --http_command_executor="false" --http_credentials="/tmp/Endpoint_SlaveEndpointTest_NoAuthorizer_0_4l5yx3/http_credentials"
--http_heartbeat_interval="30secs" --initialize_driver_logging="true" --isolation="posix/cpu,posix/mem"
--launcher="posix" --launcher_dir="/mesos/build/src" --logbufsecs="0" --logging_level="INFO"
--max_completed_executors_per_framework="150" --oversubscribed_resources_interval="15secs"
--perf_duration="10secs" --perf_interval="1mins" --qos_correction_interval_min="0ns" --quiet="false"
--recover="reconnect" --recovery_timeout="15mins" --registration_backoff_factor="10ms" --resources="cpus:2;gpus:0;mem:1024;disk:1024;ports:[31000-32000]"
--revocable_cpu_low_priority="true" --runtime_dir="/tmp/Endpoint_SlaveEndpointTest_NoAuthorizer_0_4l5yx3"
--sandbox_directory="/mnt/mesos/sandbox" --strict="true" --switch_user="true" --systemd_enable_support="true"
--systemd_runtime_directory="/run/systemd/system" --version="false" --work_dir="/tmp/Endpoint_SlaveEndpointTest_NoAuthorizer_0_eUz65N"
I0218 11:15:12.804859 25362 credentials.hpp:86] Loading credential for authentication from
'/tmp/Endpoint_SlaveEndpointTest_NoAuthorizer_0_4l5yx3/credential'
I0218 11:15:12.804961 25362 slave.cpp:354] Agent using credential for: test-principal
I0218 11:15:12.804976 25362 credentials.hpp:37] Loading credentials for authentication from
'/tmp/Endpoint_SlaveEndpointTest_NoAuthorizer_0_4l5yx3/http_credentials'
I0218 11:15:12.805088 25362 http.cpp:919] Using default 'basic' HTTP authenticator for realm
'mesos-agent-readonly'
I0218 11:15:12.805137 25362 http.cpp:919] Using default 'basic' HTTP authenticator for realm
'mesos-agent-readwrite'
I0218 11:15:12.805642 25362 slave.cpp:541] Agent resources: cpus(*):2; mem(*):1024; disk(*):1024;
ports(*):[31000-32000]
I0218 11:15:12.805683 25362 slave.cpp:549] Agent attributes: [  ]
I0218 11:15:12.805691 25362 slave.cpp:554] Agent hostname: 4181adda1077
I0218 11:15:12.805749 25371 status_update_manager.cpp:177] Pausing sending status updates
I0218 11:15:12.806089 25363 state.cpp:62] Recovering state from '/tmp/Endpoint_SlaveEndpointTest_NoAuthorizer_0_eUz65N/meta'
I0218 11:15:12.806284 25372 status_update_manager.cpp:203] Recovering status update manager
I0218 11:15:12.806435 25361 containerizer.cpp:599] Recovering containerizer
I0218 11:15:12.807126 25368 provisioner.cpp:410] Provisioner recovery complete
I0218 11:15:12.807416 25362 slave.cpp:5558] Finished recovery
I0218 11:15:12.807867 25362 slave.cpp:5732] Querying resource estimator for oversubscribable
resources
I0218 11:15:12.808092 25372 slave.cpp:5746] Received oversubscribable resources {} from the
resource estimator
I0218 11:15:12.808841 25373 process.cpp:3704] Handling HTTP event for process 'slave(699)'
with path: '/slave(699)/monitor/statistics'
I0218 11:15:12.809453 25363 http.cpp:871] Authorizing principal 'test-principal' to GET the
'/monitor/statistics' endpoint
I0218 11:15:12.811182 25367 slave.cpp:803] Agent terminating
[       OK ] Endpoint/SlaveEndpointTest.NoAuthorizer/0 (14 ms)
[ RUN      ] Endpoint/SlaveEndpointTest.NoAuthorizer/1
I0218 11:15:12.826753 25360 containerizer.cpp:220] Using isolation: posix/cpu,posix/mem,filesystem/posix,network/cni
W0218 11:15:12.827080 25360 backend.cpp:76] Failed to create 'aufs' backend: AufsBackend requires
root privileges
W0218 11:15:12.827126 25360 backend.cpp:76] Failed to create 'bind' backend: BindBackend requires
root privileges
I0218 11:15:12.827148 25360 provisioner.cpp:249] Using default backend 'copy'
I0218 11:15:12.828102 25360 cluster.cpp:446] Creating default 'local' authorizer
I0218 11:15:12.828758 25372 slave.cpp:211] Mesos agent started on (700)@172.17.0.2:34963
I0218 11:15:12.828794 25372 slave.cpp:212] Flags at startup: --acls="" --appc_simple_discovery_uri_prefix="http://"
--appc_store_dir="/tmp/mesos/store/appc" --authenticate_http_readonly="true" --authenticate_http_readwrite="true"
--authenticatee="crammd5" --authentication_backoff_factor="1secs" --authorizer="local" --cgroups_cpu_enable_pids_and_tids_count="false"
--cgroups_enable_cfs="false" --cgroups_hierarchy="/sys/fs/cgroup" --cgroups_limit_swap="false"
--cgroups_root="mesos" --container_disk_watch_interval="15secs" --containerizers="mesos" --credential="/tmp/Endpoint_SlaveEndpointTest_NoAuthorizer_1_Ict1v3/credential"
--default_role="*" --disk_watch_interval="1mins" --docker="docker" --docker_kill_orphans="true"
--docker_registry="https://registry-1.docker.io" --docker_remove_delay="6hrs" --docker_socket="/var/run/docker.sock"
--docker_stop_timeout="0ns" --docker_store_dir="/tmp/mesos/store/docker" --docker_volume_checkpoint_dir="/var/run/mesos/isolators/docker/volume"
--enforce_container_disk_quota="false" --executor_registration_timeout="1mins" --executor_shutdown_grace_period="5secs"
--fetcher_cache_dir="/tmp/Endpoint_SlaveEndpointTest_NoAuthorizer_1_Ict1v3/fetch" --fetcher_cache_size="2GB"
--frameworks_home="" --gc_delay="1weeks" --gc_disk_headroom="0.1" --hadoop_home="" --help="false"
--hostname_lookup="true" --http_authenticators="basic" --http_command_executor="false" --http_credentials="/tmp/Endpoint_SlaveEndpointTest_NoAuthorizer_1_Ict1v3/http_credentials"
--http_heartbeat_interval="30secs" --initialize_driver_logging="true" --isolation="posix/cpu,posix/mem"
--launcher="posix" --launcher_dir="/mesos/build/src" --logbufsecs="0" --logging_level="INFO"
--max_completed_executors_per_framework="150" --oversubscribed_resources_interval="15secs"
--perf_duration="10secs" --perf_interval="1mins" --qos_correction_interval_min="0ns" --quiet="false"
--recover="reconnect" --recovery_timeout="15mins" --registration_backoff_factor="10ms" --resources="cpus:2;gpus:0;mem:1024;disk:1024;ports:[31000-32000]"
--revocable_cpu_low_priority="true" --runtime_dir="/tmp/Endpoint_SlaveEndpointTest_NoAuthorizer_1_Ict1v3"
--sandbox_directory="/mnt/mesos/sandbox" --strict="true" --switch_user="true" --systemd_enable_support="true"
--systemd_runtime_directory="/run/systemd/system" --version="false" --work_dir="/tmp/Endpoint_SlaveEndpointTest_NoAuthorizer_1_6RIE0N"
I0218 11:15:12.829183 25372 credentials.hpp:86] Loading credential for authentication from
'/tmp/Endpoint_SlaveEndpointTest_NoAuthorizer_1_Ict1v3/credential'
I0218 11:15:12.829270 25372 slave.cpp:354] Agent using credential for: test-principal
I0218 11:15:12.829285 25372 credentials.hpp:37] Loading credentials for authentication from
'/tmp/Endpoint_SlaveEndpointTest_NoAuthorizer_1_Ict1v3/http_credentials'
I0218 11:15:12.829396 25372 http.cpp:919] Using default 'basic' HTTP authenticator for realm
'mesos-agent-readonly'
I0218 11:15:12.829443 25372 http.cpp:919] Using default 'basic' HTTP authenticator for realm
'mesos-agent-readwrite'
I0218 11:15:12.829841 25372 slave.cpp:541] Agent resources: cpus(*):2; mem(*):1024; disk(*):1024;
ports(*):[31000-32000]
I0218 11:15:12.829882 25372 slave.cpp:549] Agent attributes: [  ]
I0218 11:15:12.829890 25372 slave.cpp:554] Agent hostname: 4181adda1077
I0218 11:15:12.829955 25374 status_update_manager.cpp:177] Pausing sending status updates
I0218 11:15:12.830309 25374 state.cpp:62] Recovering state from '/tmp/Endpoint_SlaveEndpointTest_NoAuthorizer_1_6RIE0N/meta'
I0218 11:15:12.830515 25368 status_update_manager.cpp:203] Recovering status update manager
I0218 11:15:12.830579 25368 containerizer.cpp:599] Recovering containerizer
I0218 11:15:12.831218 25364 provisioner.cpp:410] Provisioner recovery complete
I0218 11:15:12.831413 25365 slave.cpp:5558] Finished recovery
I0218 11:15:12.837990 25365 slave.cpp:5732] Querying resource estimator for oversubscribable
resources
I0218 11:15:12.838150 25376 slave.cpp:5746] Received oversubscribable resources {} from the
resource estimator
I0218 11:15:12.843076 25361 process.cpp:3704] Handling HTTP event for process 'slave(700)'
with path: '/slave(700)/monitor/statistics.json'
I0218 11:15:12.843650 25362 http.cpp:871] Authorizing principal 'test-principal' to GET the
'/monitor/statistics.json' endpoint
I0218 11:15:12.845252 25368 slave.cpp:803] Agent terminating
[       OK ] Endpoint/SlaveEndpointTest.NoAuthorizer/1 (23 ms)
[ RUN      ] Endpoint/SlaveEndpointTest.NoAuthorizer/2
I0218 11:15:12.877887 25360 containerizer.cpp:220] Using isolation: posix/cpu,posix/mem,filesystem/posix,network/cni
W0218 11:15:12.878257 25360 backend.cpp:76] Failed to create 'aufs' backend: AufsBackend requires
root privileges
W0218 11:15:12.878304 25360 backend.cpp:76] Failed to create 'bind' backend: BindBackend requires
root privileges
I0218 11:15:12.878319 25360 provisioner.cpp:249] Using default backend 'copy'
I0218 11:15:12.879078 25360 cluster.cpp:446] Creating default 'local' authorizer
I0218 11:15:12.879761 25370 slave.cpp:211] Mesos agent started on (701)@172.17.0.2:34963
I0218 11:15:12.879786 25370 slave.cpp:212] Flags at startup: --acls="" --appc_simple_discovery_uri_prefix="http://"
--appc_store_dir="/tmp/mesos/store/appc" --authenticate_http_readonly="true" --authenticate_http_readwrite="true"
--authenticatee="crammd5" --authentication_backoff_factor="1secs" --authorizer="local" --cgroups_cpu_enable_pids_and_tids_count="false"
--cgroups_enable_cfs="false" --cgroups_hierarchy="/sys/fs/cgroup" --cgroups_limit_swap="false"
--cgroups_root="mesos" --container_disk_watch_interval="15secs" --containerizers="mesos" --credential="/tmp/Endpoint_SlaveEndpointTest_NoAuthorizer_2_S6DbY3/credential"
--default_role="*" --disk_watch_interval="1mins" --docker="docker" --docker_kill_orphans="true"
--docker_registry="https://registry-1.docker.io" --docker_remove_delay="6hrs" --docker_socket="/var/run/docker.sock"
--docker_stop_timeout="0ns" --docker_store_dir="/tmp/mesos/store/docker" --docker_volume_checkpoint_dir="/var/run/mesos/isolators/docker/volume"
--enforce_container_disk_quota="false" --executor_registration_timeout="1mins" --executor_shutdown_grace_period="5secs"
--fetcher_cache_dir="/tmp/Endpoint_SlaveEndpointTest_NoAuthorizer_2_S6DbY3/fetch" --fetcher_cache_size="2GB"
--frameworks_home="" --gc_delay="1weeks" --gc_disk_headroom="0.1" --hadoop_home="" --help="false"
--hostname_lookup="true" --http_authenticators="basic" --http_command_executor="false" --http_credentials="/tmp/Endpoint_SlaveEndpointTest_NoAuthorizer_2_S6DbY3/http_credentials"
--http_heartbeat_interval="30secs" --initialize_driver_logging="true" --isolation="posix/cpu,posix/mem"
--launcher="posix" --launcher_dir="/mesos/build/src" --logbufsecs="0" --logging_level="INFO"
--max_completed_executors_per_framework="150" --oversubscribed_resources_interval="15secs"
--perf_duration="10secs" --perf_interval="1mins" --qos_correction_interval_min="0ns" --quiet="false"
--recover="reconnect" --recovery_timeout="15mins" --registration_backoff_factor="10ms" --resources="cpus:2;gpus:0;mem:1024;disk:1024;ports:[31000-32000]"
--revocable_cpu_low_priority="true" --runtime_dir="/tmp/Endpoint_SlaveEndpointTest_NoAuthorizer_2_S6DbY3"
--sandbox_directory="/mnt/mesos/sandbox" --strict="true" --switch_user="true" --systemd_enable_support="true"
--systemd_runtime_directory="/run/systemd/system" --version="false" --work_dir="/tmp/Endpoint_SlaveEndpointTest_NoAuthorizer_2_ePoxkO"
I0218 11:15:12.880163 25370 credentials.hpp:86] Loading credential for authentication from
'/tmp/Endpoint_SlaveEndpointTest_NoAuthorizer_2_S6DbY3/credential'
I0218 11:15:12.880264 25370 slave.cpp:354] Agent using credential for: test-principal
I0218 11:15:12.880280 25370 credentials.hpp:37] Loading credentials for authentication from
'/tmp/Endpoint_SlaveEndpointTest_NoAuthorizer_2_S6DbY3/http_credentials'
I0218 11:15:12.880398 25370 http.cpp:919] Using default 'basic' HTTP authenticator for realm
'mesos-agent-readonly'
I0218 11:15:12.880457 25370 http.cpp:919] Using default 'basic' HTTP authenticator for realm
'mesos-agent-readwrite'
I0218 11:15:12.881080 25370 slave.cpp:541] Agent resources: cpus(*):2; mem(*):1024; disk(*):1024;
ports(*):[31000-32000]
I0218 11:15:12.881119 25370 slave.cpp:549] Agent attributes: [  ]
I0218 11:15:12.881125 25370 slave.cpp:554] Agent hostname: 4181adda1077
I0218 11:15:12.881237 25372 status_update_manager.cpp:177] Pausing sending status updates
I0218 11:15:12.881572 25363 state.cpp:62] Recovering state from '/tmp/Endpoint_SlaveEndpointTest_NoAuthorizer_2_ePoxkO/meta'
I0218 11:15:12.881762 25366 status_update_manager.cpp:203] Recovering status update manager
I0218 11:15:12.882105 25363 containerizer.cpp:599] Recovering containerizer
I0218 11:15:12.882766 25363 provisioner.cpp:410] Provisioner recovery complete
I0218 11:15:12.883044 25367 slave.cpp:5558] Finished recovery
I0218 11:15:12.883410 25367 slave.cpp:5732] Querying resource estimator for oversubscribable
resources
I0218 11:15:12.883585 25372 slave.cpp:5746] Received oversubscribable resources {} from the
resource estimator
I0218 11:15:12.884308 25372 process.cpp:3704] Handling HTTP event for process 'slave(701)'
with path: '/slave(701)/containers'
I0218 11:15:12.884845 25371 http.cpp:871] Authorizing principal 'test-principal' to GET the
'/containers' endpoint
I0218 11:15:12.886538 25376 slave.cpp:803] Agent terminating
[       OK ] Endpoint/SlaveEndpointTest.NoAuthorizer/2 (14 ms)
[----------] 9 tests from Endpoint/SlaveEndpointTest (282 ms total)

[----------] Global test environment tear-down
[==========] 1449 tests from 160 test cases ran. (306196 ms total)
[  PASSED  ] 1448 tests.
[  FAILED  ] 1 test, listed below:
[  FAILED  ] ContainerLoggerTest.LOGROTATE_RotateInSandbox

 1 FAILED TEST
  YOU HAVE 12 DISABLED TESTS

make[3]: *** [CMakeFiles/check] Error 1
make[3]: Leaving directory `/mesos/build'
make[2]: *** [CMakeFiles/check.dir/all] Error 2
make[2]: Leaving directory `/mesos/build'
make[1]: *** [CMakeFiles/check.dir/rule] Error 2
make[1]: Leaving directory `/mesos/build'
make: *** [check] Error 2
+ docker rmi mesos-1487413665-1969
Untagged: mesos-1487413665-1969:latest
Deleted: sha256:d6378d2aefec009ee803364d4363ae8888234a1095e2d055db4e9cfa3b0de6cb
Deleted: sha256:4a6ef1e2fd230d7b9d3327c7bad46e7507d69d9824f01a84eb19577615161836
Deleted: sha256:43c3d3d0c38030920ffcc99c851039c1b1e699a67936f59662a6d8b54ae50c3c
Deleted: sha256:c2fc548ab3341c1286cce0f8883ae0f5907e92effde49fea6e50fc0333bb67f9
Deleted: sha256:938bc3e1c73d77c414607ddbfb8def9f2d745565daf752433bea7c28eaa56c4e
Deleted: sha256:4fec08053af2b3e12af91f6500568a29d369eafe973b791fd5c374c75e4e6582
Deleted: sha256:1de66f9ed5ae13b26ad3038ceb6de90af98350c749ff4844d8ed1c0a6e68a7f1
Deleted: sha256:035d529503a4c32654a6224f9ea30d880960f2d0f0bf0c1f637a7ffa78b847c1
Deleted: sha256:c1bfc1247a046df30582c64269d28c22e9ca27051a33d404d081d9b6130ab5d1
Deleted: sha256:2c4d85be3777f913d8b979bf544365ee28f2565fd5cfec9c4ddd9df67cf761ef
Deleted: sha256:8394009f338d23fa58631bee7705f9b4f1a0157ccf807da09e83ff80c161bd77
Deleted: sha256:6d59497ea2a5cd2e57c3850bb29e0648efcd8b926c0c75845b1ffeb51527a9f1
Deleted: sha256:e61c5bb433e0a279f8da66c7b519b6ab8dcd1d0f7792c4f1d00c5b594acf3b12
Deleted: sha256:1ee07b1b2a210e137051aabcadb4c817a593d299d958721f20a3925c0a1bdcf1
Deleted: sha256:e3f46f7ed62ae0aa7be77c3121e5684c1652e75eb188aa636fa2ed1b46484810
Deleted: sha256:01eae17704c0afe7ea993bff51c9e86b55bfdec2d62234845ba9409ead64cbca
Deleted: sha256:4dc7f4232de821e2b7d1c36ae1ca42197d5019304951e9e9446ed2441395a078
Deleted: sha256:e7d5e3911b5d8fde9a0728e7f610ce8343bb83a288fccdb5c8bf187054113bee
Deleted: sha256:f99d10c11c2e1173f54cdc86b66fd6d8218fef7f314870232567b4fafac00aa3
Deleted: sha256:3221027970e2eec463db31a87fde370beefdf19b2c1625099ca42bdc6cb7eb0b
Deleted: sha256:b988ae6f65c1ef0b6b2139e974739ad9f2fd43f350b9a0acbf743a3b834e401e
Deleted: sha256:2864831d507327da1d9662dd133843c55f04fa093dac880b46a57a16725aace2
Deleted: sha256:ce2de699380ea343a2e0a50165a8ed375a1274eafcc914b5a5ff220b4da282ba
Deleted: sha256:24913e2df26cf4c7dcaa9a6016991bbe8df9590c5395966cc0814915847bfd83
Build step 'Execute shell' marked build as failure

Mime
View raw message