mesos-builds mailing list archives

Site index · List index
Message view « Date » · « Thread »
Top « Date » · « Thread »
From Apache Jenkins Server <jenk...@builds.apache.org>
Subject Build failed in Jenkins: Mesos-Buildbot » cmake,gcc,--verbose --enable-libevent --enable-ssl,GLOG_v=1 MESOS_VERBOSE=1,ubuntu:14.04,(docker||Hadoop)&&(!ubuntu-us1)&&(!ubuntu-eu2) #3306
Date Fri, 24 Feb 2017 07:47:34 GMT
See <https://builds.apache.org/job/Mesos-Buildbot/BUILDTOOL=cmake,COMPILER=gcc,CONFIGURATION=--verbose%20--enable-libevent%20--enable-ssl,ENVIRONMENT=GLOG_v=1%20MESOS_VERBOSE=1,OS=ubuntu%3A14.04,label_exp=(docker%7C%7CHadoop)&&(!ubuntu-us1)&&(!ubuntu-eu2)/3306/display/redirect?page=changes>

Changes:

[yujie.jay] Changed the http::Headers to be a derived class from Hashmap.

[yujie.jay] Renamed http::Headers get() to header() due to the libprocess change.

[yujie.jay] Documented provisioner auto backend semantic.

[yujie.jay] Fixed a formatting issue in container-image.md.

[yujie.jay] Renamed 'Headers' class templete method to 'get()'.

[yujie.jay] Updated docker fetcher pluggin corresponding to the former commit.

[adam] Updated configuration.md for --http_heartbeat_interval.

[adam] Added upgrade guide for 1.2.x.

[adam] Updated CHANGELOG for Mesos 1.2.0 release.

[adam] Wrapped IOSwitchboard.connect() in a dispatch.

[adam] Update changelog for 1.2.0-rc2.

------------------------------------------
[...truncated 24.59 MB...]
I0224 07:47:19.421926 27174 status_update_manager.cpp:177] Pausing sending status updates
I0224 07:47:19.422183 27169 state.cpp:62] Recovering state from '/tmp/Endpoint_SlaveEndpointTest_AuthorizedRequest_1_qS7GtZ/meta'
I0224 07:47:19.422442 27170 status_update_manager.cpp:203] Recovering status update manager
I0224 07:47:19.422581 27168 containerizer.cpp:599] Recovering containerizer
I0224 07:47:19.423069 27162 provisioner.cpp:410] Provisioner recovery complete
I0224 07:47:19.423259 27173 slave.cpp:5558] Finished recovery
I0224 07:47:19.423755 27173 slave.cpp:5732] Querying resource estimator for oversubscribable
resources
I0224 07:47:19.423892 27172 slave.cpp:5746] Received oversubscribable resources {} from the
resource estimator
I0224 07:47:19.424582 27162 process.cpp:3704] Handling HTTP event for process 'slave(693)'
with path: '/slave(693)/monitor/statistics.json'
I0224 07:47:19.425050 27162 http.cpp:871] Authorizing principal 'test-principal' to GET the
'/monitor/statistics.json' endpoint
I0224 07:47:19.426257 27166 slave.cpp:803] Agent terminating
[       OK ] Endpoint/SlaveEndpointTest.AuthorizedRequest/1 (20 ms)
[ RUN      ] Endpoint/SlaveEndpointTest.AuthorizedRequest/2
I0224 07:47:19.450706 27159 containerizer.cpp:220] Using isolation: posix/cpu,posix/mem,filesystem/posix,network/cni
W0224 07:47:19.451177 27159 backend.cpp:76] Failed to create 'aufs' backend: AufsBackend requires
root privileges
W0224 07:47:19.451272 27159 backend.cpp:76] Failed to create 'bind' backend: BindBackend requires
root privileges
I0224 07:47:19.451401 27159 provisioner.cpp:249] Using default backend 'copy'
I0224 07:47:19.453096 27162 slave.cpp:211] Mesos agent started on (694)@172.17.0.3:40389
I0224 07:47:19.453114 27162 slave.cpp:212] Flags at startup: --acls="" --appc_simple_discovery_uri_prefix="http://"
--appc_store_dir="/tmp/mesos/store/appc" --authenticate_http_readonly="true" --authenticate_http_readwrite="true"
--authenticatee="crammd5" --authentication_backoff_factor="1secs" --authorizer="local" --cgroups_cpu_enable_pids_and_tids_count="false"
--cgroups_enable_cfs="false" --cgroups_hierarchy="/sys/fs/cgroup" --cgroups_limit_swap="false"
--cgroups_root="mesos" --container_disk_watch_interval="15secs" --containerizers="mesos" --credential="/tmp/Endpoint_SlaveEndpointTest_AuthorizedRequest_2_Jg1Idg/credential"
--default_role="*" --disk_watch_interval="1mins" --docker="docker" --docker_kill_orphans="true"
--docker_registry="https://registry-1.docker.io" --docker_remove_delay="6hrs" --docker_socket="/var/run/docker.sock"
--docker_stop_timeout="0ns" --docker_store_dir="/tmp/mesos/store/docker" --docker_volume_checkpoint_dir="/var/run/mesos/isolators/docker/volume"
--enforce_container_disk_quota="false" --executor_registration_timeout="1mins" --executor_shutdown_grace_period="5secs"
--fetcher_cache_dir="/tmp/Endpoint_SlaveEndpointTest_AuthorizedRequest_2_Jg1Idg/fetch" --fetcher_cache_size="2GB"
--frameworks_home="" --gc_delay="1weeks" --gc_disk_headroom="0.1" --hadoop_home="" --help="false"
--hostname_lookup="true" --http_authenticators="basic" --http_command_executor="false" --http_credentials="/tmp/Endpoint_SlaveEndpointTest_AuthorizedRequest_2_Jg1Idg/http_credentials"
--http_heartbeat_interval="30secs" --initialize_driver_logging="true" --isolation="posix/cpu,posix/mem"
--launcher="posix" --launcher_dir="/mesos/build/src" --logbufsecs="0" --logging_level="INFO"
--max_completed_executors_per_framework="150" --oversubscribed_resources_interval="15secs"
--perf_duration="10secs" --perf_interval="1mins" --qos_correction_interval_min="0ns" --quiet="false"
--recover="reconnect" --recovery_timeout="15mins" --registration_backoff_factor="10ms" --resources="cpus:2;gpus:0;mem:1024;disk:1024;ports:[31000-32000]"
--revocable_cpu_low_priority="true" --runtime_dir="/tmp/Endpoint_SlaveEndpointTest_AuthorizedRequest_2_Jg1Idg"
--sandbox_directory="/mnt/mesos/sandbox" --strict="true" --switch_user="true" --systemd_enable_support="true"
--systemd_runtime_directory="/run/systemd/system" --version="false" --work_dir="/tmp/Endpoint_SlaveEndpointTest_AuthorizedRequest_2_QjL2ep"
I0224 07:47:19.453482 27162 credentials.hpp:86] Loading credential for authentication from
'/tmp/Endpoint_SlaveEndpointTest_AuthorizedRequest_2_Jg1Idg/credential'
I0224 07:47:19.453574 27162 slave.cpp:354] Agent using credential for: test-principal
I0224 07:47:19.453588 27162 credentials.hpp:37] Loading credentials for authentication from
'/tmp/Endpoint_SlaveEndpointTest_AuthorizedRequest_2_Jg1Idg/http_credentials'
I0224 07:47:19.453702 27162 http.cpp:919] Using default 'basic' HTTP authenticator for realm
'mesos-agent-readonly'
I0224 07:47:19.453753 27162 http.cpp:919] Using default 'basic' HTTP authenticator for realm
'mesos-agent-readwrite'
I0224 07:47:19.454216 27162 slave.cpp:541] Agent resources: cpus(*):2; mem(*):1024; disk(*):1024;
ports(*):[31000-32000]
I0224 07:47:19.454258 27162 slave.cpp:549] Agent attributes: [  ]
I0224 07:47:19.454267 27162 slave.cpp:554] Agent hostname: 83ceb4629b8f
I0224 07:47:19.454349 27165 status_update_manager.cpp:177] Pausing sending status updates
I0224 07:47:19.454747 27174 state.cpp:62] Recovering state from '/tmp/Endpoint_SlaveEndpointTest_AuthorizedRequest_2_QjL2ep/meta'
I0224 07:47:19.454993 27174 status_update_manager.cpp:203] Recovering status update manager
I0224 07:47:19.455106 27174 containerizer.cpp:599] Recovering containerizer
I0224 07:47:19.455621 27174 provisioner.cpp:410] Provisioner recovery complete
I0224 07:47:19.455803 27174 slave.cpp:5558] Finished recovery
I0224 07:47:19.456233 27174 slave.cpp:5732] Querying resource estimator for oversubscribable
resources
I0224 07:47:19.456426 27174 slave.cpp:5746] Received oversubscribable resources {} from the
resource estimator
I0224 07:47:19.457422 27173 process.cpp:3704] Handling HTTP event for process 'slave(694)'
with path: '/slave(694)/containers'
I0224 07:47:19.457968 27170 http.cpp:871] Authorizing principal 'test-principal' to GET the
'/containers' endpoint
I0224 07:47:19.459538 27175 slave.cpp:803] Agent terminating
[       OK ] Endpoint/SlaveEndpointTest.AuthorizedRequest/2 (14 ms)
[ RUN      ] Endpoint/SlaveEndpointTest.UnauthorizedRequest/0
I0224 07:47:19.511867 27159 containerizer.cpp:220] Using isolation: posix/cpu,posix/mem,filesystem/posix,network/cni
W0224 07:47:19.512238 27159 backend.cpp:76] Failed to create 'aufs' backend: AufsBackend requires
root privileges
W0224 07:47:19.512338 27159 backend.cpp:76] Failed to create 'bind' backend: BindBackend requires
root privileges
I0224 07:47:19.512404 27159 provisioner.cpp:249] Using default backend 'copy'
I0224 07:47:19.513535 27160 slave.cpp:211] Mesos agent started on (695)@172.17.0.3:40389
I0224 07:47:19.513553 27160 slave.cpp:212] Flags at startup: --acls="" --appc_simple_discovery_uri_prefix="http://"
--appc_store_dir="/tmp/mesos/store/appc" --authenticate_http_readonly="true" --authenticate_http_readwrite="true"
--authenticatee="crammd5" --authentication_backoff_factor="1secs" --authorizer="local" --cgroups_cpu_enable_pids_and_tids_count="false"
--cgroups_enable_cfs="false" --cgroups_hierarchy="/sys/fs/cgroup" --cgroups_limit_swap="false"
--cgroups_root="mesos" --container_disk_watch_interval="15secs" --containerizers="mesos" --credential="/tmp/Endpoint_SlaveEndpointTest_UnauthorizedRequest_0_lhUlDG/credential"
--default_role="*" --disk_watch_interval="1mins" --docker="docker" --docker_kill_orphans="true"
--docker_registry="https://registry-1.docker.io" --docker_remove_delay="6hrs" --docker_socket="/var/run/docker.sock"
--docker_stop_timeout="0ns" --docker_store_dir="/tmp/mesos/store/docker" --docker_volume_checkpoint_dir="/var/run/mesos/isolators/docker/volume"
--enforce_container_disk_quota="false" --executor_registration_timeout="1mins" --executor_shutdown_grace_period="5secs"
--fetcher_cache_dir="/tmp/Endpoint_SlaveEndpointTest_UnauthorizedRequest_0_lhUlDG/fetch" --fetcher_cache_size="2GB"
--frameworks_home="" --gc_delay="1weeks" --gc_disk_headroom="0.1" --hadoop_home="" --help="false"
--hostname_lookup="true" --http_authenticators="basic" --http_command_executor="false" --http_credentials="/tmp/Endpoint_SlaveEndpointTest_UnauthorizedRequest_0_lhUlDG/http_credentials"
--http_heartbeat_interval="30secs" --initialize_driver_logging="true" --isolation="posix/cpu,posix/mem"
--launcher="posix" --launcher_dir="/mesos/build/src" --logbufsecs="0" --logging_level="INFO"
--max_completed_executors_per_framework="150" --oversubscribed_resources_interval="15secs"
--perf_duration="10secs" --perf_interval="1mins" --qos_correction_interval_min="0ns" --quiet="false"
--recover="reconnect" --recovery_timeout="15mins" --registration_backoff_factor="10ms" --resources="cpus:2;gpus:0;mem:1024;disk:1024;ports:[31000-32000]"
--revocable_cpu_low_priority="true" --runtime_dir="/tmp/Endpoint_SlaveEndpointTest_UnauthorizedRequest_0_lhUlDG"
--sandbox_directory="/mnt/mesos/sandbox" --strict="true" --switch_user="true" --systemd_enable_support="true"
--systemd_runtime_directory="/run/systemd/system" --version="false" --work_dir="/tmp/Endpoint_SlaveEndpointTest_UnauthorizedRequest_0_CCJGuP"
I0224 07:47:19.513931 27160 credentials.hpp:86] Loading credential for authentication from
'/tmp/Endpoint_SlaveEndpointTest_UnauthorizedRequest_0_lhUlDG/credential'
I0224 07:47:19.514034 27160 slave.cpp:354] Agent using credential for: test-principal
I0224 07:47:19.514048 27160 credentials.hpp:37] Loading credentials for authentication from
'/tmp/Endpoint_SlaveEndpointTest_UnauthorizedRequest_0_lhUlDG/http_credentials'
I0224 07:47:19.514163 27160 http.cpp:919] Using default 'basic' HTTP authenticator for realm
'mesos-agent-readonly'
I0224 07:47:19.514256 27160 http.cpp:919] Using default 'basic' HTTP authenticator for realm
'mesos-agent-readwrite'
I0224 07:47:19.514721 27160 slave.cpp:541] Agent resources: cpus(*):2; mem(*):1024; disk(*):1024;
ports(*):[31000-32000]
I0224 07:47:19.514766 27160 slave.cpp:549] Agent attributes: [  ]
I0224 07:47:19.514776 27160 slave.cpp:554] Agent hostname: 83ceb4629b8f
I0224 07:47:19.515192 27160 status_update_manager.cpp:177] Pausing sending status updates
I0224 07:47:19.515465 27160 state.cpp:62] Recovering state from '/tmp/Endpoint_SlaveEndpointTest_UnauthorizedRequest_0_CCJGuP/meta'
I0224 07:47:19.515617 27160 status_update_manager.cpp:203] Recovering status update manager
I0224 07:47:19.515676 27160 containerizer.cpp:599] Recovering containerizer
I0224 07:47:19.516166 27160 provisioner.cpp:410] Provisioner recovery complete
I0224 07:47:19.516302 27160 slave.cpp:5558] Finished recovery
I0224 07:47:19.516696 27160 slave.cpp:5732] Querying resource estimator for oversubscribable
resources
I0224 07:47:19.516841 27160 slave.cpp:5746] Received oversubscribable resources {} from the
resource estimator
I0224 07:47:19.520200 27164 process.cpp:3704] Handling HTTP event for process 'slave(695)'
with path: '/slave(695)/monitor/statistics'
I0224 07:47:19.520510 27164 http.cpp:871] Authorizing principal 'test-principal' to GET the
'/monitor/statistics' endpoint
I0224 07:47:19.521570 27159 slave.cpp:803] Agent terminating
[       OK ] Endpoint/SlaveEndpointTest.UnauthorizedRequest/0 (13 ms)
[ RUN      ] Endpoint/SlaveEndpointTest.UnauthorizedRequest/1
I0224 07:47:19.582486 27159 containerizer.cpp:220] Using isolation: posix/cpu,posix/mem,filesystem/posix,network/cni
W0224 07:47:19.582751 27159 backend.cpp:76] Failed to create 'aufs' backend: AufsBackend requires
root privileges
W0224 07:47:19.582785 27159 backend.cpp:76] Failed to create 'bind' backend: BindBackend requires
root privileges
I0224 07:47:19.582801 27159 provisioner.cpp:249] Using default backend 'copy'
I0224 07:47:19.583767 27166 slave.cpp:211] Mesos agent started on (696)@172.17.0.3:40389
I0224 07:47:19.583784 27166 slave.cpp:212] Flags at startup: --acls="" --appc_simple_discovery_uri_prefix="http://"
--appc_store_dir="/tmp/mesos/store/appc" --authenticate_http_readonly="true" --authenticate_http_readwrite="true"
--authenticatee="crammd5" --authentication_backoff_factor="1secs" --authorizer="local" --cgroups_cpu_enable_pids_and_tids_count="false"
--cgroups_enable_cfs="false" --cgroups_hierarchy="/sys/fs/cgroup" --cgroups_limit_swap="false"
--cgroups_root="mesos" --container_disk_watch_interval="15secs" --containerizers="mesos" --credential="/tmp/Endpoint_SlaveEndpointTest_UnauthorizedRequest_1_3sXhL7/credential"
--default_role="*" --disk_watch_interval="1mins" --docker="docker" --docker_kill_orphans="true"
--docker_registry="https://registry-1.docker.io" --docker_remove_delay="6hrs" --docker_socket="/var/run/docker.sock"
--docker_stop_timeout="0ns" --docker_store_dir="/tmp/mesos/store/docker" --docker_volume_checkpoint_dir="/var/run/mesos/isolators/docker/volume"
--enforce_container_disk_quota="false" --executor_registration_timeout="1mins" --executor_shutdown_grace_period="5secs"
--fetcher_cache_dir="/tmp/Endpoint_SlaveEndpointTest_UnauthorizedRequest_1_3sXhL7/fetch" --fetcher_cache_size="2GB"
--frameworks_home="" --gc_delay="1weeks" --gc_disk_headroom="0.1" --hadoop_home="" --help="false"
--hostname_lookup="true" --http_authenticators="basic" --http_command_executor="false" --http_credentials="/tmp/Endpoint_SlaveEndpointTest_UnauthorizedRequest_1_3sXhL7/http_credentials"
--http_heartbeat_interval="30secs" --initialize_driver_logging="true" --isolation="posix/cpu,posix/mem"
--launcher="posix" --launcher_dir="/mesos/build/src" --logbufsecs="0" --logging_level="INFO"
--max_completed_executors_per_framework="150" --oversubscribed_resources_interval="15secs"
--perf_duration="10secs" --perf_interval="1mins" --qos_correction_interval_min="0ns" --quiet="false"
--recover="reconnect" --recovery_timeout="15mins" --registration_backoff_factor="10ms" --resources="cpus:2;gpus:0;mem:1024;disk:1024;ports:[31000-32000]"
--revocable_cpu_low_priority="true" --runtime_dir="/tmp/Endpoint_SlaveEndpointTest_UnauthorizedRequest_1_3sXhL7"
--sandbox_directory="/mnt/mesos/sandbox" --strict="true" --switch_user="true" --systemd_enable_support="true"
--systemd_runtime_directory="/run/systemd/system" --version="false" --work_dir="/tmp/Endpoint_SlaveEndpointTest_UnauthorizedRequest_1_Wt47qg"
I0224 07:47:19.584156 27166 credentials.hpp:86] Loading credential for authentication from
'/tmp/Endpoint_SlaveEndpointTest_UnauthorizedRequest_1_3sXhL7/credential'
I0224 07:47:19.584231 27166 slave.cpp:354] Agent using credential for: test-principal
I0224 07:47:19.584244 27166 credentials.hpp:37] Loading credentials for authentication from
'/tmp/Endpoint_SlaveEndpointTest_UnauthorizedRequest_1_3sXhL7/http_credentials'
I0224 07:47:19.584327 27166 http.cpp:919] Using default 'basic' HTTP authenticator for realm
'mesos-agent-readonly'
I0224 07:47:19.584367 27166 http.cpp:919] Using default 'basic' HTTP authenticator for realm
'mesos-agent-readwrite'
I0224 07:47:19.584734 27166 slave.cpp:541] Agent resources: cpus(*):2; mem(*):1024; disk(*):1024;
ports(*):[31000-32000]
I0224 07:47:19.584779 27166 slave.cpp:549] Agent attributes: [  ]
I0224 07:47:19.584789 27166 slave.cpp:554] Agent hostname: 83ceb4629b8f
I0224 07:47:19.584868 27173 status_update_manager.cpp:177] Pausing sending status updates
I0224 07:47:19.585211 27162 state.cpp:62] Recovering state from '/tmp/Endpoint_SlaveEndpointTest_UnauthorizedRequest_1_Wt47qg/meta'
I0224 07:47:19.585371 27173 status_update_manager.cpp:203] Recovering status update manager
I0224 07:47:19.585484 27172 containerizer.cpp:599] Recovering containerizer
I0224 07:47:19.586009 27168 provisioner.cpp:410] Provisioner recovery complete
I0224 07:47:19.586194 27163 slave.cpp:5558] Finished recovery
I0224 07:47:19.586524 27163 slave.cpp:5732] Querying resource estimator for oversubscribable
resources
I0224 07:47:19.586601 27174 slave.cpp:5746] Received oversubscribable resources {} from the
resource estimator
I0224 07:47:19.587258 27162 process.cpp:3704] Handling HTTP event for process 'slave(696)'
with path: '/slave(696)/monitor/statistics.json'
I0224 07:47:19.587690 27168 http.cpp:871] Authorizing principal 'test-principal' to GET the
'/monitor/statistics.json' endpoint
I0224 07:47:19.588549 27159 slave.cpp:803] Agent terminating
[       OK ] Endpoint/SlaveEndpointTest.UnauthorizedRequest/1 (10 ms)
[ RUN      ] Endpoint/SlaveEndpointTest.UnauthorizedRequest/2
I0224 07:47:19.611133 27159 containerizer.cpp:220] Using isolation: posix/cpu,posix/mem,filesystem/posix,network/cni
W0224 07:47:19.611371 27159 backend.cpp:76] Failed to create 'aufs' backend: AufsBackend requires
root privileges
W0224 07:47:19.611421 27159 backend.cpp:76] Failed to create 'bind' backend: BindBackend requires
root privileges
I0224 07:47:19.611439 27159 provisioner.cpp:249] Using default backend 'copy'
I0224 07:47:19.612365 27174 slave.cpp:211] Mesos agent started on (697)@172.17.0.3:40389
I0224 07:47:19.612392 27174 slave.cpp:212] Flags at startup: --acls="" --appc_simple_discovery_uri_prefix="http://"
--appc_store_dir="/tmp/mesos/store/appc" --authenticate_http_readonly="true" --authenticate_http_readwrite="true"
--authenticatee="crammd5" --authentication_backoff_factor="1secs" --authorizer="local" --cgroups_cpu_enable_pids_and_tids_count="false"
--cgroups_enable_cfs="false" --cgroups_hierarchy="/sys/fs/cgroup" --cgroups_limit_swap="false"
--cgroups_root="mesos" --container_disk_watch_interval="15secs" --containerizers="mesos" --credential="/tmp/Endpoint_SlaveEndpointTest_UnauthorizedRequest_2_lNaCiz/credential"
--default_role="*" --disk_watch_interval="1mins" --docker="docker" --docker_kill_orphans="true"
--docker_registry="https://registry-1.docker.io" --docker_remove_delay="6hrs" --docker_socket="/var/run/docker.sock"
--docker_stop_timeout="0ns" --docker_store_dir="/tmp/mesos/store/docker" --docker_volume_checkpoint_dir="/var/run/mesos/isolators/docker/volume"
--enforce_container_disk_quota="false" --executor_registration_timeout="1mins" --executor_shutdown_grace_period="5secs"
--fetcher_cache_dir="/tmp/Endpoint_SlaveEndpointTest_UnauthorizedRequest_2_lNaCiz/fetch" --fetcher_cache_size="2GB"
--frameworks_home="" --gc_delay="1weeks" --gc_disk_headroom="0.1" --hadoop_home="" --help="false"
--hostname_lookup="true" --http_authenticators="basic" --http_command_executor="false" --http_credentials="/tmp/Endpoint_SlaveEndpointTest_UnauthorizedRequest_2_lNaCiz/http_credentials"
--http_heartbeat_interval="30secs" --initialize_driver_logging="true" --isolation="posix/cpu,posix/mem"
--launcher="posix" --launcher_dir="/mesos/build/src" --logbufsecs="0" --logging_level="INFO"
--max_completed_executors_per_framework="150" --oversubscribed_resources_interval="15secs"
--perf_duration="10secs" --perf_interval="1mins" --qos_correction_interval_min="0ns" --quiet="false"
--recover="reconnect" --recovery_timeout="15mins" --registration_backoff_factor="10ms" --resources="cpus:2;gpus:0;mem:1024;disk:1024;ports:[31000-32000]"
--revocable_cpu_low_priority="true" --runtime_dir="/tmp/Endpoint_SlaveEndpointTest_UnauthorizedRequest_2_lNaCiz"
--sandbox_directory="/mnt/mesos/sandbox" --strict="true" --switch_user="true" --systemd_enable_support="true"
--systemd_runtime_directory="/run/systemd/system" --version="false" --work_dir="/tmp/Endpoint_SlaveEndpointTest_UnauthorizedRequest_2_SILMTH"
I0224 07:47:19.612723 27174 credentials.hpp:86] Loading credential for authentication from
'/tmp/Endpoint_SlaveEndpointTest_UnauthorizedRequest_2_lNaCiz/credential'
I0224 07:47:19.635488 27174 slave.cpp:354] Agent using credential for: test-principal
I0224 07:47:19.635525 27174 credentials.hpp:37] Loading credentials for authentication from
'/tmp/Endpoint_SlaveEndpointTest_UnauthorizedRequest_2_lNaCiz/http_credentials'
I0224 07:47:19.635685 27174 http.cpp:919] Using default 'basic' HTTP authenticator for realm
'mesos-agent-readonly'
I0224 07:47:19.635777 27174 http.cpp:919] Using default 'basic' HTTP authenticator for realm
'mesos-agent-readwrite'
I0224 07:47:19.636299 27174 slave.cpp:541] Agent resources: cpus(*):2; mem(*):1024; disk(*):1024;
ports(*):[31000-32000]
I0224 07:47:19.636358 27174 slave.cpp:549] Agent attributes: [  ]
I0224 07:47:19.636368 27174 slave.cpp:554] Agent hostname: 83ceb4629b8f
I0224 07:47:19.636456 27166 status_update_manager.cpp:177] Pausing sending status updates
I0224 07:47:19.636822 27171 state.cpp:62] Recovering state from '/tmp/Endpoint_SlaveEndpointTest_UnauthorizedRequest_2_SILMTH/meta'
I0224 07:47:19.636947 27171 status_update_manager.cpp:203] Recovering status update manager
I0224 07:47:19.636997 27171 containerizer.cpp:599] Recovering containerizer
I0224 07:47:19.637434 27171 provisioner.cpp:410] Provisioner recovery complete
I0224 07:47:19.637544 27171 slave.cpp:5558] Finished recovery
I0224 07:47:19.637905 27171 slave.cpp:5732] Querying resource estimator for oversubscribable
resources
I0224 07:47:19.638037 27171 slave.cpp:5746] Received oversubscribable resources {} from the
resource estimator
I0224 07:47:19.639302 27175 process.cpp:3704] Handling HTTP event for process 'slave(697)'
with path: '/slave(697)/containers'
I0224 07:47:19.639628 27175 http.cpp:871] Authorizing principal 'test-principal' to GET the
'/containers' endpoint
I0224 07:47:19.640967 27159 slave.cpp:803] Agent terminating
[       OK ] Endpoint/SlaveEndpointTest.UnauthorizedRequest/2 (35 ms)
[ RUN      ] Endpoint/SlaveEndpointTest.NoAuthorizer/0
I0224 07:47:19.684223 27159 containerizer.cpp:220] Using isolation: posix/cpu,posix/mem,filesystem/posix,network/cni
W0224 07:47:19.684594 27159 backend.cpp:76] Failed to create 'aufs' backend: AufsBackend requires
root privileges
W0224 07:47:19.684640 27159 backend.cpp:76] Failed to create 'bind' backend: BindBackend requires
root privileges
I0224 07:47:19.684656 27159 provisioner.cpp:249] Using default backend 'copy'
I0224 07:47:19.685256 27159 cluster.cpp:446] Creating default 'local' authorizer
I0224 07:47:19.685858 27160 slave.cpp:211] Mesos agent started on (698)@172.17.0.3:40389
I0224 07:47:19.685876 27160 slave.cpp:212] Flags at startup: --acls="" --appc_simple_discovery_uri_prefix="http://"
--appc_store_dir="/tmp/mesos/store/appc" --authenticate_http_readonly="true" --authenticate_http_readwrite="true"
--authenticatee="crammd5" --authentication_backoff_factor="1secs" --authorizer="local" --cgroups_cpu_enable_pids_and_tids_count="false"
--cgroups_enable_cfs="false" --cgroups_hierarchy="/sys/fs/cgroup" --cgroups_limit_swap="false"
--cgroups_root="mesos" --container_disk_watch_interval="15secs" --containerizers="mesos" --credential="/tmp/Endpoint_SlaveEndpointTest_NoAuthorizer_0_tGtxx1/credential"
--default_role="*" --disk_watch_interval="1mins" --docker="docker" --docker_kill_orphans="true"
--docker_registry="https://registry-1.docker.io" --docker_remove_delay="6hrs" --docker_socket="/var/run/docker.sock"
--docker_stop_timeout="0ns" --docker_store_dir="/tmp/mesos/store/docker" --docker_volume_checkpoint_dir="/var/run/mesos/isolators/docker/volume"
--enforce_container_disk_quota="false" --executor_registration_timeout="1mins" --executor_shutdown_grace_period="5secs"
--fetcher_cache_dir="/tmp/Endpoint_SlaveEndpointTest_NoAuthorizer_0_tGtxx1/fetch" --fetcher_cache_size="2GB"
--frameworks_home="" --gc_delay="1weeks" --gc_disk_headroom="0.1" --hadoop_home="" --help="false"
--hostname_lookup="true" --http_authenticators="basic" --http_command_executor="false" --http_credentials="/tmp/Endpoint_SlaveEndpointTest_NoAuthorizer_0_tGtxx1/http_credentials"
--http_heartbeat_interval="30secs" --initialize_driver_logging="true" --isolation="posix/cpu,posix/mem"
--launcher="posix" --launcher_dir="/mesos/build/src" --logbufsecs="0" --logging_level="INFO"
--max_completed_executors_per_framework="150" --oversubscribed_resources_interval="15secs"
--perf_duration="10secs" --perf_interval="1mins" --qos_correction_interval_min="0ns" --quiet="false"
--recover="reconnect" --recovery_timeout="15mins" --registration_backoff_factor="10ms" --resources="cpus:2;gpus:0;mem:1024;disk:1024;ports:[31000-32000]"
--revocable_cpu_low_priority="true" --runtime_dir="/tmp/Endpoint_SlaveEndpointTest_NoAuthorizer_0_tGtxx1"
--sandbox_directory="/mnt/mesos/sandbox" --strict="true" --switch_user="true" --systemd_enable_support="true"
--systemd_runtime_directory="/run/systemd/system" --version="false" --work_dir="/tmp/Endpoint_SlaveEndpointTest_NoAuthorizer_0_MbcWW9"
I0224 07:47:19.686251 27160 credentials.hpp:86] Loading credential for authentication from
'/tmp/Endpoint_SlaveEndpointTest_NoAuthorizer_0_tGtxx1/credential'
I0224 07:47:19.686354 27160 slave.cpp:354] Agent using credential for: test-principal
I0224 07:47:19.686365 27160 credentials.hpp:37] Loading credentials for authentication from
'/tmp/Endpoint_SlaveEndpointTest_NoAuthorizer_0_tGtxx1/http_credentials'
I0224 07:47:19.686481 27160 http.cpp:919] Using default 'basic' HTTP authenticator for realm
'mesos-agent-readonly'
I0224 07:47:19.686519 27160 http.cpp:919] Using default 'basic' HTTP authenticator for realm
'mesos-agent-readwrite'
I0224 07:47:19.686978 27160 slave.cpp:541] Agent resources: cpus(*):2; mem(*):1024; disk(*):1024;
ports(*):[31000-32000]
I0224 07:47:19.687018 27160 slave.cpp:549] Agent attributes: [  ]
I0224 07:47:19.687026 27160 slave.cpp:554] Agent hostname: 83ceb4629b8f
I0224 07:47:19.687553 27174 status_update_manager.cpp:177] Pausing sending status updates
I0224 07:47:19.687921 27162 state.cpp:62] Recovering state from '/tmp/Endpoint_SlaveEndpointTest_NoAuthorizer_0_MbcWW9/meta'
I0224 07:47:19.688071 27162 status_update_manager.cpp:203] Recovering status update manager
I0224 07:47:19.688123 27162 containerizer.cpp:599] Recovering containerizer
I0224 07:47:19.688622 27162 provisioner.cpp:410] Provisioner recovery complete
I0224 07:47:19.688923 27160 slave.cpp:5558] Finished recovery
I0224 07:47:19.689353 27160 slave.cpp:5732] Querying resource estimator for oversubscribable
resources
I0224 07:47:19.689522 27160 slave.cpp:5746] Received oversubscribable resources {} from the
resource estimator
I0224 07:47:19.691370 27173 process.cpp:3704] Handling HTTP event for process 'slave(698)'
with path: '/slave(698)/monitor/statistics'
I0224 07:47:19.691779 27173 http.cpp:871] Authorizing principal 'test-principal' to GET the
'/monitor/statistics' endpoint
I0224 07:47:19.693380 27163 slave.cpp:803] Agent terminating
[       OK ] Endpoint/SlaveEndpointTest.NoAuthorizer/0 (57 ms)
[ RUN      ] Endpoint/SlaveEndpointTest.NoAuthorizer/1
I0224 07:47:19.742211 27159 containerizer.cpp:220] Using isolation: posix/cpu,posix/mem,filesystem/posix,network/cni
W0224 07:47:19.742593 27159 backend.cpp:76] Failed to create 'aufs' backend: AufsBackend requires
root privileges
W0224 07:47:19.742635 27159 backend.cpp:76] Failed to create 'bind' backend: BindBackend requires
root privileges
I0224 07:47:19.742653 27159 provisioner.cpp:249] Using default backend 'copy'
I0224 07:47:19.743322 27159 cluster.cpp:446] Creating default 'local' authorizer
I0224 07:47:19.743986 27166 slave.cpp:211] Mesos agent started on (699)@172.17.0.3:40389
I0224 07:47:19.744014 27166 slave.cpp:212] Flags at startup: --acls="" --appc_simple_discovery_uri_prefix="http://"
--appc_store_dir="/tmp/mesos/store/appc" --authenticate_http_readonly="true" --authenticate_http_readwrite="true"
--authenticatee="crammd5" --authentication_backoff_factor="1secs" --authorizer="local" --cgroups_cpu_enable_pids_and_tids_count="false"
--cgroups_enable_cfs="false" --cgroups_hierarchy="/sys/fs/cgroup" --cgroups_limit_swap="false"
--cgroups_root="mesos" --container_disk_watch_interval="15secs" --containerizers="mesos" --credential="/tmp/Endpoint_SlaveEndpointTest_NoAuthorizer_1_ROUZmu/credential"
--default_role="*" --disk_watch_interval="1mins" --docker="docker" --docker_kill_orphans="true"
--docker_registry="https://registry-1.docker.io" --docker_remove_delay="6hrs" --docker_socket="/var/run/docker.sock"
--docker_stop_timeout="0ns" --docker_store_dir="/tmp/mesos/store/docker" --docker_volume_checkpoint_dir="/var/run/mesos/isolators/docker/volume"
--enforce_container_disk_quota="false" --executor_registration_timeout="1mins" --executor_shutdown_grace_period="5secs"
--fetcher_cache_dir="/tmp/Endpoint_SlaveEndpointTest_NoAuthorizer_1_ROUZmu/fetch" --fetcher_cache_size="2GB"
--frameworks_home="" --gc_delay="1weeks" --gc_disk_headroom="0.1" --hadoop_home="" --help="false"
--hostname_lookup="true" --http_authenticators="basic" --http_command_executor="false" --http_credentials="/tmp/Endpoint_SlaveEndpointTest_NoAuthorizer_1_ROUZmu/http_credentials"
--http_heartbeat_interval="30secs" --initialize_driver_logging="true" --isolation="posix/cpu,posix/mem"
--launcher="posix" --launcher_dir="/mesos/build/src" --logbufsecs="0" --logging_level="INFO"
--max_completed_executors_per_framework="150" --oversubscribed_resources_interval="15secs"
--perf_duration="10secs" --perf_interval="1mins" --qos_correction_interval_min="0ns" --quiet="false"
--recover="reconnect" --recovery_timeout="15mins" --registration_backoff_factor="10ms" --resources="cpus:2;gpus:0;mem:1024;disk:1024;ports:[31000-32000]"
--revocable_cpu_low_priority="true" --runtime_dir="/tmp/Endpoint_SlaveEndpointTest_NoAuthorizer_1_ROUZmu"
--sandbox_directory="/mnt/mesos/sandbox" --strict="true" --switch_user="true" --systemd_enable_support="true"
--systemd_runtime_directory="/run/systemd/system" --version="false" --work_dir="/tmp/Endpoint_SlaveEndpointTest_NoAuthorizer_1_YjIZCC"
I0224 07:47:19.744375 27166 credentials.hpp:86] Loading credential for authentication from
'/tmp/Endpoint_SlaveEndpointTest_NoAuthorizer_1_ROUZmu/credential'
I0224 07:47:19.744488 27166 slave.cpp:354] Agent using credential for: test-principal
I0224 07:47:19.744500 27166 credentials.hpp:37] Loading credentials for authentication from
'/tmp/Endpoint_SlaveEndpointTest_NoAuthorizer_1_ROUZmu/http_credentials'
I0224 07:47:19.744596 27166 http.cpp:919] Using default 'basic' HTTP authenticator for realm
'mesos-agent-readonly'
I0224 07:47:19.744722 27166 http.cpp:919] Using default 'basic' HTTP authenticator for realm
'mesos-agent-readwrite'
I0224 07:47:19.745198 27166 slave.cpp:541] Agent resources: cpus(*):2; mem(*):1024; disk(*):1024;
ports(*):[31000-32000]
I0224 07:47:19.745235 27166 slave.cpp:549] Agent attributes: [  ]
I0224 07:47:19.745244 27166 slave.cpp:554] Agent hostname: 83ceb4629b8f
I0224 07:47:19.745306 27174 status_update_manager.cpp:177] Pausing sending status updates
I0224 07:47:19.745646 27160 state.cpp:62] Recovering state from '/tmp/Endpoint_SlaveEndpointTest_NoAuthorizer_1_YjIZCC/meta'
I0224 07:47:19.745849 27163 status_update_manager.cpp:203] Recovering status update manager
I0224 07:47:19.745992 27160 containerizer.cpp:599] Recovering containerizer
I0224 07:47:19.746521 27162 provisioner.cpp:410] Provisioner recovery complete
I0224 07:47:19.746690 27162 slave.cpp:5558] Finished recovery
I0224 07:47:19.747092 27162 slave.cpp:5732] Querying resource estimator for oversubscribable
resources
I0224 07:47:19.747223 27170 slave.cpp:5746] Received oversubscribable resources {} from the
resource estimator
I0224 07:47:19.747988 27165 process.cpp:3704] Handling HTTP event for process 'slave(699)'
with path: '/slave(699)/monitor/statistics.json'
I0224 07:47:19.748404 27174 http.cpp:871] Authorizing principal 'test-principal' to GET the
'/monitor/statistics.json' endpoint
I0224 07:47:19.749624 27159 slave.cpp:803] Agent terminating
[       OK ] Endpoint/SlaveEndpointTest.NoAuthorizer/1 (12 ms)
[ RUN      ] Endpoint/SlaveEndpointTest.NoAuthorizer/2
I0224 07:47:19.775082 27159 containerizer.cpp:220] Using isolation: posix/cpu,posix/mem,filesystem/posix,network/cni
W0224 07:47:19.775346 27159 backend.cpp:76] Failed to create 'aufs' backend: AufsBackend requires
root privileges
W0224 07:47:19.775385 27159 backend.cpp:76] Failed to create 'bind' backend: BindBackend requires
root privileges
I0224 07:47:19.775398 27159 provisioner.cpp:249] Using default backend 'copy'
I0224 07:47:19.776099 27159 cluster.cpp:446] Creating default 'local' authorizer
I0224 07:47:19.776598 27162 slave.cpp:211] Mesos agent started on (700)@172.17.0.3:40389
I0224 07:47:19.776643 27162 slave.cpp:212] Flags at startup: --acls="" --appc_simple_discovery_uri_prefix="http://"
--appc_store_dir="/tmp/mesos/store/appc" --authenticate_http_readonly="true" --authenticate_http_readwrite="true"
--authenticatee="crammd5" --authentication_backoff_factor="1secs" --authorizer="local" --cgroups_cpu_enable_pids_and_tids_count="false"
--cgroups_enable_cfs="false" --cgroups_hierarchy="/sys/fs/cgroup" --cgroups_limit_swap="false"
--cgroups_root="mesos" --container_disk_watch_interval="15secs" --containerizers="mesos" --credential="/tmp/Endpoint_SlaveEndpointTest_NoAuthorizer_2_fgu9BX/credential"
--default_role="*" --disk_watch_interval="1mins" --docker="docker" --docker_kill_orphans="true"
--docker_registry="https://registry-1.docker.io" --docker_remove_delay="6hrs" --docker_socket="/var/run/docker.sock"
--docker_stop_timeout="0ns" --docker_store_dir="/tmp/mesos/store/docker" --docker_volume_checkpoint_dir="/var/run/mesos/isolators/docker/volume"
--enforce_container_disk_quota="false" --executor_registration_timeout="1mins" --executor_shutdown_grace_period="5secs"
--fetcher_cache_dir="/tmp/Endpoint_SlaveEndpointTest_NoAuthorizer_2_fgu9BX/fetch" --fetcher_cache_size="2GB"
--frameworks_home="" --gc_delay="1weeks" --gc_disk_headroom="0.1" --hadoop_home="" --help="false"
--hostname_lookup="true" --http_authenticators="basic" --http_command_executor="false" --http_credentials="/tmp/Endpoint_SlaveEndpointTest_NoAuthorizer_2_fgu9BX/http_credentials"
--http_heartbeat_interval="30secs" --initialize_driver_logging="true" --isolation="posix/cpu,posix/mem"
--launcher="posix" --launcher_dir="/mesos/build/src" --logbufsecs="0" --logging_level="INFO"
--max_completed_executors_per_framework="150" --oversubscribed_resources_interval="15secs"
--perf_duration="10secs" --perf_interval="1mins" --qos_correction_interval_min="0ns" --quiet="false"
--recover="reconnect" --recovery_timeout="15mins" --registration_backoff_factor="10ms" --resources="cpus:2;gpus:0;mem:1024;disk:1024;ports:[31000-32000]"
--revocable_cpu_low_priority="true" --runtime_dir="/tmp/Endpoint_SlaveEndpointTest_NoAuthorizer_2_fgu9BX"
--sandbox_directory="/mnt/mesos/sandbox" --strict="true" --switch_user="true" --systemd_enable_support="true"
--systemd_runtime_directory="/run/systemd/system" --version="false" --work_dir="/tmp/Endpoint_SlaveEndpointTest_NoAuthorizer_2_QAzJM5"
I0224 07:47:19.777128 27162 credentials.hpp:86] Loading credential for authentication from
'/tmp/Endpoint_SlaveEndpointTest_NoAuthorizer_2_fgu9BX/credential'
I0224 07:47:19.777231 27162 slave.cpp:354] Agent using credential for: test-principal
I0224 07:47:19.777246 27162 credentials.hpp:37] Loading credentials for authentication from
'/tmp/Endpoint_SlaveEndpointTest_NoAuthorizer_2_fgu9BX/http_credentials'
I0224 07:47:19.777372 27162 http.cpp:919] Using default 'basic' HTTP authenticator for realm
'mesos-agent-readonly'
I0224 07:47:19.777428 27162 http.cpp:919] Using default 'basic' HTTP authenticator for realm
'mesos-agent-readwrite'
I0224 07:47:19.777940 27162 slave.cpp:541] Agent resources: cpus(*):2; mem(*):1024; disk(*):1024;
ports(*):[31000-32000]
I0224 07:47:19.777984 27162 slave.cpp:549] Agent attributes: [  ]
I0224 07:47:19.777992 27162 slave.cpp:554] Agent hostname: 83ceb4629b8f
I0224 07:47:19.778070 27171 status_update_manager.cpp:177] Pausing sending status updates
I0224 07:47:19.778457 27167 state.cpp:62] Recovering state from '/tmp/Endpoint_SlaveEndpointTest_NoAuthorizer_2_QAzJM5/meta'
I0224 07:47:19.778628 27162 status_update_manager.cpp:203] Recovering status update manager
I0224 07:47:19.778740 27161 containerizer.cpp:599] Recovering containerizer
I0224 07:47:19.779263 27171 provisioner.cpp:410] Provisioner recovery complete
I0224 07:47:19.779462 27174 slave.cpp:5558] Finished recovery
I0224 07:47:19.779830 27174 slave.cpp:5732] Querying resource estimator for oversubscribable
resources
I0224 07:47:19.779965 27164 slave.cpp:5746] Received oversubscribable resources {} from the
resource estimator
I0224 07:47:19.780709 27166 process.cpp:3704] Handling HTTP event for process 'slave(700)'
with path: '/slave(700)/containers'
I0224 07:47:19.781147 27175 http.cpp:871] Authorizing principal 'test-principal' to GET the
'/containers' endpoint
I0224 07:47:19.782650 27159 slave.cpp:803] Agent terminating
[       OK ] Endpoint/SlaveEndpointTest.NoAuthorizer/2 (12 ms)
[----------] 9 tests from Endpoint/SlaveEndpointTest (448 ms total)

[----------] Global test environment tear-down
[==========] 1444 tests from 160 test cases ran. (540541 ms total)
[  PASSED  ] 1443 tests.
[  FAILED  ] 1 test, listed below:
[  FAILED  ] FaultToleranceTest.FrameworkReregister

 1 FAILED TEST
  YOU HAVE 11 DISABLED TESTS

make[3]: *** [CMakeFiles/check] Error 1
make[3]: Leaving directory `/mesos/build'
make[2]: Leaving directory `/mesos/build'
make[2]: *** [CMakeFiles/check.dir/all] Error 2
make[1]: Leaving directory `/mesos/build'
make[1]: *** [CMakeFiles/check.dir/rule] Error 2
make: *** [check] Error 2
+ docker rmi mesos-1487917107-2678
Untagged: mesos-1487917107-2678:latest
Deleted: sha256:ec1777463ab48835882102e88189fde4feb4199eeb573a5f492a5e18de2481e2
Deleted: sha256:d6e22e463787ebfc43873e1d613cd63b313b5bd53feec8313c9c214452e4bfc7
Deleted: sha256:7da672fe788c0337af3925d26df156b6cd9f173f88e7a59dd5135142448889b9
Deleted: sha256:0073936a6a2fd117fe7dd7de9a4cd9d8b7bd5551166a6d2b74525d9498486b03
Deleted: sha256:38102e78e6cf464e840a57360eec175e64f093df2839c4987fafbb4d8b4da396
Deleted: sha256:a570cda368b38878ed3ef57810f7a615069efcf8afaadda27f227a399ae4e283
Deleted: sha256:8559394b7b0998222b48bb9d1bc1b5bba80407a2897d5b32a9dcc7840f3ed748
Deleted: sha256:dbfcf1c22121b13ad4e12d492b45d12732300e5b202a70c1575e3fd89f75bf0f
Deleted: sha256:c1883523c40a5af4405d2c9bf7c606ae8af04ad5865d739b5dbc87682f080883
Deleted: sha256:d85dc13e3f6451deed684d30bc086a4d80d273d3d6f81fa824fdaea4f9b58eca
Deleted: sha256:b93dc410183e490a8605ccdde9d9b59508a1798f01894c41cbc25f726c54e668
Deleted: sha256:b1ca0b01ab88b11bfec270767f004619c65ceb21920c7f5a12ecfcdd0a341762
Deleted: sha256:7e253147df626efa266028e3b0dece9a2f22cff89a33a91a865e54a9ff5f9923
Deleted: sha256:06b45b40181cc46da221888d841bdab820ab7b0035aa1a3655a7108af53132ec
Deleted: sha256:9de9ff46a796fd9af4f56e52e8620580fa08c26a90991ae89e861e4de9788a99
Deleted: sha256:d88b2e26baf5319f28c8a969c7b5dc6983d24f24d130cd1be69e91a6a0ef64f0
Deleted: sha256:19bbad1d440b3dd299426d2b21981656ae759ed7e9bfff12b390b123041502ef
Deleted: sha256:8519dcb5d5eda6062cdb9ac863545329af5e92e85dfd722274bcd63392d0baae
Deleted: sha256:03ebdc699d81d1abf9e06639eea202d4be3883fc987f36f5896340bdb8ddbfde
Deleted: sha256:165872c6f12b0d9edb66ec7581f9bfa26c4ad47e1b710def9d5e79838c31d5dc
Deleted: sha256:b911f34e7f71c1e8220d3c6eaba581f614ea0b1c76aac0770a848c1914602f28
Deleted: sha256:c50e5f4f317ee19cfd508cca6dfbedc3a36b3a1362f93f3f83acf933ed470746
Deleted: sha256:fd1f5a095ee8bd22006ac12f67cfd0e4b110a8adf98cd4a76290300201663247
Deleted: sha256:2d1777d9c2a761b32add7b803a221bb79e4e5feb63fb100a2b7fff24ca0f2863
Build step 'Execute shell' marked build as failure

Mime
View raw message