mesos-builds mailing list archives

Site index · List index
Message view « Date » · « Thread »
Top « Date » · « Thread »
From Apache Jenkins Server <jenk...@builds.apache.org>
Subject Build failed in Jenkins: Mesos-Buildbot » autotools,gcc,--verbose,GLOG_v=1 MESOS_VERBOSE=1,ubuntu:14.04,(docker||Hadoop)&&(!ubuntu-us1)&&(!ubuntu-eu2) #3228
Date Sun, 05 Feb 2017 12:14:11 GMT
See <https://builds.apache.org/job/Mesos-Buildbot/BUILDTOOL=autotools,COMPILER=gcc,CONFIGURATION=--verbose,ENVIRONMENT=GLOG_v=1%20MESOS_VERBOSE=1,OS=ubuntu%3A14.04,label_exp=(docker%7C%7CHadoop)&&(!ubuntu-us1)&&(!ubuntu-eu2)/3228/>

------------------------------------------
[...truncated 177194 lines...]
I0205 12:13:55.658455 30288 provisioner.cpp:410] Provisioner recovery complete
I0205 12:13:55.658854 30289 slave.cpp:5499] Finished recovery
I0205 12:13:55.659843 30289 slave.cpp:5673] Querying resource estimator for oversubscribable
resources
I0205 12:13:55.660326 30289 slave.cpp:5687] Received oversubscribable resources {} from the
resource estimator
I0205 12:13:55.664310 30284 process.cpp:3697] Handling HTTP event for process 'slave(692)'
with path: '/slave(692)/monitor/statistics.json'
I0205 12:13:55.666507 30284 http.cpp:871] Authorizing principal 'test-principal' to GET the
'/monitor/statistics.json' endpoint
I0205 12:13:55.672124 30291 slave.cpp:803] Agent terminating
[       OK ] Endpoint/SlaveEndpointTest.AuthorizedRequest/1 (41 ms)
[ RUN      ] Endpoint/SlaveEndpointTest.AuthorizedRequest/2
I0205 12:13:55.685243 30260 containerizer.cpp:220] Using isolation: posix/cpu,posix/mem,filesystem/posix,network/cni
W0205 12:13:55.686045 30260 backend.cpp:76] Failed to create 'aufs' backend: AufsBackend requires
root privileges
W0205 12:13:55.686192 30260 backend.cpp:76] Failed to create 'bind' backend: BindBackend requires
root privileges
I0205 12:13:55.686280 30260 provisioner.cpp:249] Using default backend 'copy'
I0205 12:13:55.690861 30283 slave.cpp:211] Mesos agent started on (693)@172.17.0.3:59341
I0205 12:13:55.690893 30283 slave.cpp:212] Flags at startup: --acls="" --appc_simple_discovery_uri_prefix="http://"
--appc_store_dir="/tmp/mesos/store/appc" --authenticate_http_readonly="true" --authenticate_http_readwrite="true"
--authenticatee="crammd5" --authentication_backoff_factor="1secs" --authorizer="local" --cgroups_cpu_enable_pids_and_tids_count="false"
--cgroups_enable_cfs="false" --cgroups_hierarchy="/sys/fs/cgroup" --cgroups_limit_swap="false"
--cgroups_root="mesos" --container_disk_watch_interval="15secs" --containerizers="mesos" --credential="/tmp/Endpoint_SlaveEndpointTest_AuthorizedRequest_2_5ZjtOP/credential"
--default_role="*" --disk_watch_interval="1mins" --docker="docker" --docker_kill_orphans="true"
--docker_registry="https://registry-1.docker.io" --docker_remove_delay="6hrs" --docker_socket="/var/run/docker.sock"
--docker_stop_timeout="0ns" --docker_store_dir="/tmp/mesos/store/docker" --docker_volume_checkpoint_dir="/var/run/mesos/isolators/docker/volume"
--enforce_container_disk_quota="false" --executor_registration_timeout="1mins" --executor_shutdown_grace_period="5secs"
--fetcher_cache_dir="/tmp/Endpoint_SlaveEndpointTest_AuthorizedRequest_2_5ZjtOP/fetch" --fetcher_cache_size="2GB"
--frameworks_home="" --gc_delay="1weeks" --gc_disk_headroom="0.1" --hadoop_home="" --help="false"
--hostname_lookup="true" --http_authenticators="basic" --http_command_executor="false" --http_credentials="/tmp/Endpoint_SlaveEndpointTest_AuthorizedRequest_2_5ZjtOP/http_credentials"
--http_heartbeat_interval="30secs" --initialize_driver_logging="true" --isolation="posix/cpu,posix/mem"
--launcher="posix" --launcher_dir="/mesos/mesos-1.2.0/_build/src" --logbufsecs="0" --logging_level="INFO"
--max_completed_executors_per_framework="150" --oversubscribed_resources_interval="15secs"
--perf_duration="10secs" --perf_interval="1mins" --qos_correction_interval_min="0ns" --quiet="false"
--recover="reconnect" --recovery_timeout="15mins" --registration_backoff_factor="10ms" --resources="cpus:2;gpus:0;mem:1024;disk:1024;ports:[31000-32000]"
--revocable_cpu_low_priority="true" --runtime_dir="/tmp/Endpoint_SlaveEndpointTest_AuthorizedRequest_2_5ZjtOP"
--sandbox_directory="/mnt/mesos/sandbox" --strict="true" --switch_user="true" --systemd_enable_support="true"
--systemd_runtime_directory="/run/systemd/system" --version="false" --work_dir="/tmp/Endpoint_SlaveEndpointTest_AuthorizedRequest_2_7Oqf5I"
I0205 12:13:55.691563 30283 credentials.hpp:86] Loading credential for authentication from
'/tmp/Endpoint_SlaveEndpointTest_AuthorizedRequest_2_5ZjtOP/credential'
I0205 12:13:55.691798 30283 slave.cpp:354] Agent using credential for: test-principal
I0205 12:13:55.691817 30283 credentials.hpp:37] Loading credentials for authentication from
'/tmp/Endpoint_SlaveEndpointTest_AuthorizedRequest_2_5ZjtOP/http_credentials'
I0205 12:13:55.692075 30283 http.cpp:919] Using default 'basic' HTTP authenticator for realm
'mesos-agent-readonly'
I0205 12:13:55.692250 30283 http.cpp:919] Using default 'basic' HTTP authenticator for realm
'mesos-agent-readwrite'
I0205 12:13:55.694187 30283 slave.cpp:541] Agent resources: cpus(*):2; mem(*):1024; disk(*):1024;
ports(*):[31000-32000]
I0205 12:13:55.694329 30283 slave.cpp:549] Agent attributes: [  ]
I0205 12:13:55.694350 30283 slave.cpp:554] Agent hostname: 257da84a90fe
I0205 12:13:55.694519 30281 status_update_manager.cpp:177] Pausing sending status updates
I0205 12:13:55.695971 30291 state.cpp:60] Recovering state from '/tmp/Endpoint_SlaveEndpointTest_AuthorizedRequest_2_7Oqf5I/meta'
I0205 12:13:55.696447 30291 status_update_manager.cpp:203] Recovering status update manager
I0205 12:13:55.696789 30287 containerizer.cpp:599] Recovering containerizer
I0205 12:13:55.698559 30282 provisioner.cpp:410] Provisioner recovery complete
I0205 12:13:55.698988 30294 slave.cpp:5499] Finished recovery
I0205 12:13:55.699616 30294 slave.cpp:5673] Querying resource estimator for oversubscribable
resources
I0205 12:13:55.699939 30280 slave.cpp:5687] Received oversubscribable resources {} from the
resource estimator
I0205 12:13:55.703399 30286 process.cpp:3697] Handling HTTP event for process 'slave(693)'
with path: '/slave(693)/containers'
I0205 12:13:55.704995 30293 http.cpp:871] Authorizing principal 'test-principal' to GET the
'/containers' endpoint
I0205 12:13:55.709167 30291 slave.cpp:803] Agent terminating
[       OK ] Endpoint/SlaveEndpointTest.AuthorizedRequest/2 (45 ms)
[ RUN      ] Endpoint/SlaveEndpointTest.UnauthorizedRequest/0
I0205 12:13:55.728735 30260 containerizer.cpp:220] Using isolation: posix/cpu,posix/mem,filesystem/posix,network/cni
W0205 12:13:55.729235 30260 backend.cpp:76] Failed to create 'aufs' backend: AufsBackend requires
root privileges
W0205 12:13:55.729359 30260 backend.cpp:76] Failed to create 'bind' backend: BindBackend requires
root privileges
I0205 12:13:55.729404 30260 provisioner.cpp:249] Using default backend 'copy'
I0205 12:13:55.732396 30293 slave.cpp:211] Mesos agent started on (694)@172.17.0.3:59341
I0205 12:13:55.732421 30293 slave.cpp:212] Flags at startup: --acls="" --appc_simple_discovery_uri_prefix="http://"
--appc_store_dir="/tmp/mesos/store/appc" --authenticate_http_readonly="true" --authenticate_http_readwrite="true"
--authenticatee="crammd5" --authentication_backoff_factor="1secs" --authorizer="local" --cgroups_cpu_enable_pids_and_tids_count="false"
--cgroups_enable_cfs="false" --cgroups_hierarchy="/sys/fs/cgroup" --cgroups_limit_swap="false"
--cgroups_root="mesos" --container_disk_watch_interval="15secs" --containerizers="mesos" --credential="/tmp/Endpoint_SlaveEndpointTest_UnauthorizedRequest_0_ZD3K7g/credential"
--default_role="*" --disk_watch_interval="1mins" --docker="docker" --docker_kill_orphans="true"
--docker_registry="https://registry-1.docker.io" --docker_remove_delay="6hrs" --docker_socket="/var/run/docker.sock"
--docker_stop_timeout="0ns" --docker_store_dir="/tmp/mesos/store/docker" --docker_volume_checkpoint_dir="/var/run/mesos/isolators/docker/volume"
--enforce_container_disk_quota="false" --executor_registration_timeout="1mins" --executor_shutdown_grace_period="5secs"
--fetcher_cache_dir="/tmp/Endpoint_SlaveEndpointTest_UnauthorizedRequest_0_ZD3K7g/fetch" --fetcher_cache_size="2GB"
--frameworks_home="" --gc_delay="1weeks" --gc_disk_headroom="0.1" --hadoop_home="" --help="false"
--hostname_lookup="true" --http_authenticators="basic" --http_command_executor="false" --http_credentials="/tmp/Endpoint_SlaveEndpointTest_UnauthorizedRequest_0_ZD3K7g/http_credentials"
--http_heartbeat_interval="30secs" --initialize_driver_logging="true" --isolation="posix/cpu,posix/mem"
--launcher="posix" --launcher_dir="/mesos/mesos-1.2.0/_build/src" --logbufsecs="0" --logging_level="INFO"
--max_completed_executors_per_framework="150" --oversubscribed_resources_interval="15secs"
--perf_duration="10secs" --perf_interval="1mins" --qos_correction_interval_min="0ns" --quiet="false"
--recover="reconnect" --recovery_timeout="15mins" --registration_backoff_factor="10ms" --resources="cpus:2;gpus:0;mem:1024;disk:1024;ports:[31000-32000]"
--revocable_cpu_low_priority="true" --runtime_dir="/tmp/Endpoint_SlaveEndpointTest_UnauthorizedRequest_0_ZD3K7g"
--sandbox_directory="/mnt/mesos/sandbox" --strict="true" --switch_user="true" --systemd_enable_support="true"
--systemd_runtime_directory="/run/systemd/system" --version="false" --work_dir="/tmp/Endpoint_SlaveEndpointTest_UnauthorizedRequest_0_RM3eha"
I0205 12:13:55.733098 30293 credentials.hpp:86] Loading credential for authentication from
'/tmp/Endpoint_SlaveEndpointTest_UnauthorizedRequest_0_ZD3K7g/credential'
I0205 12:13:55.733252 30293 slave.cpp:354] Agent using credential for: test-principal
I0205 12:13:55.733273 30293 credentials.hpp:37] Loading credentials for authentication from
'/tmp/Endpoint_SlaveEndpointTest_UnauthorizedRequest_0_ZD3K7g/http_credentials'
I0205 12:13:55.733489 30293 http.cpp:919] Using default 'basic' HTTP authenticator for realm
'mesos-agent-readonly'
I0205 12:13:55.733630 30293 http.cpp:919] Using default 'basic' HTTP authenticator for realm
'mesos-agent-readwrite'
I0205 12:13:55.735005 30293 slave.cpp:541] Agent resources: cpus(*):2; mem(*):1024; disk(*):1024;
ports(*):[31000-32000]
I0205 12:13:55.735085 30293 slave.cpp:549] Agent attributes: [  ]
I0205 12:13:55.735100 30293 slave.cpp:554] Agent hostname: 257da84a90fe
I0205 12:13:55.735286 30283 status_update_manager.cpp:177] Pausing sending status updates
I0205 12:13:55.737081 30285 state.cpp:60] Recovering state from '/tmp/Endpoint_SlaveEndpointTest_UnauthorizedRequest_0_RM3eha/meta'
I0205 12:13:55.737450 30283 status_update_manager.cpp:203] Recovering status update manager
I0205 12:13:55.737671 30284 containerizer.cpp:599] Recovering containerizer
I0205 12:13:55.739186 30290 provisioner.cpp:410] Provisioner recovery complete
I0205 12:13:55.739567 30284 slave.cpp:5499] Finished recovery
I0205 12:13:55.740066 30284 slave.cpp:5673] Querying resource estimator for oversubscribable
resources
I0205 12:13:55.740344 30280 slave.cpp:5687] Received oversubscribable resources {} from the
resource estimator
I0205 12:13:55.743201 30279 process.cpp:3697] Handling HTTP event for process 'slave(694)'
with path: '/slave(694)/monitor/statistics'
I0205 12:13:55.745040 30280 http.cpp:871] Authorizing principal 'test-principal' to GET the
'/monitor/statistics' endpoint
I0205 12:13:55.748311 30285 slave.cpp:803] Agent terminating
[       OK ] Endpoint/SlaveEndpointTest.UnauthorizedRequest/0 (33 ms)
[ RUN      ] Endpoint/SlaveEndpointTest.UnauthorizedRequest/1
I0205 12:13:55.762398 30260 containerizer.cpp:220] Using isolation: posix/cpu,posix/mem,filesystem/posix,network/cni
W0205 12:13:55.762864 30260 backend.cpp:76] Failed to create 'aufs' backend: AufsBackend requires
root privileges
W0205 12:13:55.762954 30260 backend.cpp:76] Failed to create 'bind' backend: BindBackend requires
root privileges
I0205 12:13:55.762989 30260 provisioner.cpp:249] Using default backend 'copy'
I0205 12:13:55.766044 30282 slave.cpp:211] Mesos agent started on (695)@172.17.0.3:59341
I0205 12:13:55.766090 30282 slave.cpp:212] Flags at startup: --acls="" --appc_simple_discovery_uri_prefix="http://"
--appc_store_dir="/tmp/mesos/store/appc" --authenticate_http_readonly="true" --authenticate_http_readwrite="true"
--authenticatee="crammd5" --authentication_backoff_factor="1secs" --authorizer="local" --cgroups_cpu_enable_pids_and_tids_count="false"
--cgroups_enable_cfs="false" --cgroups_hierarchy="/sys/fs/cgroup" --cgroups_limit_swap="false"
--cgroups_root="mesos" --container_disk_watch_interval="15secs" --containerizers="mesos" --credential="/tmp/Endpoint_SlaveEndpointTest_UnauthorizedRequest_1_sYz1NI/credential"
--default_role="*" --disk_watch_interval="1mins" --docker="docker" --docker_kill_orphans="true"
--docker_registry="https://registry-1.docker.io" --docker_remove_delay="6hrs" --docker_socket="/var/run/docker.sock"
--docker_stop_timeout="0ns" --docker_store_dir="/tmp/mesos/store/docker" --docker_volume_checkpoint_dir="/var/run/mesos/isolators/docker/volume"
--enforce_container_disk_quota="false" --executor_registration_timeout="1mins" --executor_shutdown_grace_period="5secs"
--fetcher_cache_dir="/tmp/Endpoint_SlaveEndpointTest_UnauthorizedRequest_1_sYz1NI/fetch" --fetcher_cache_size="2GB"
--frameworks_home="" --gc_delay="1weeks" --gc_disk_headroom="0.1" --hadoop_home="" --help="false"
--hostname_lookup="true" --http_authenticators="basic" --http_command_executor="false" --http_credentials="/tmp/Endpoint_SlaveEndpointTest_UnauthorizedRequest_1_sYz1NI/http_credentials"
--http_heartbeat_interval="30secs" --initialize_driver_logging="true" --isolation="posix/cpu,posix/mem"
--launcher="posix" --launcher_dir="/mesos/mesos-1.2.0/_build/src" --logbufsecs="0" --logging_level="INFO"
--max_completed_executors_per_framework="150" --oversubscribed_resources_interval="15secs"
--perf_duration="10secs" --perf_interval="1mins" --qos_correction_interval_min="0ns" --quiet="false"
--recover="reconnect" --recovery_timeout="15mins" --registration_backoff_factor="10ms" --resources="cpus:2;gpus:0;mem:1024;disk:1024;ports:[31000-32000]"
--revocable_cpu_low_priority="true" --runtime_dir="/tmp/Endpoint_SlaveEndpointTest_UnauthorizedRequest_1_sYz1NI"
--sandbox_directory="/mnt/mesos/sandbox" --strict="true" --switch_user="true" --systemd_enable_support="true"
--systemd_runtime_directory="/run/systemd/system" --version="false" --work_dir="/tmp/Endpoint_SlaveEndpointTest_UnauthorizedRequest_1_cu63RB"
I0205 12:13:55.766723 30282 credentials.hpp:86] Loading credential for authentication from
'/tmp/Endpoint_SlaveEndpointTest_UnauthorizedRequest_1_sYz1NI/credential'
I0205 12:13:55.766928 30282 slave.cpp:354] Agent using credential for: test-principal
I0205 12:13:55.766945 30282 credentials.hpp:37] Loading credentials for authentication from
'/tmp/Endpoint_SlaveEndpointTest_UnauthorizedRequest_1_sYz1NI/http_credentials'
I0205 12:13:55.767168 30282 http.cpp:919] Using default 'basic' HTTP authenticator for realm
'mesos-agent-readonly'
I0205 12:13:55.767333 30282 http.cpp:919] Using default 'basic' HTTP authenticator for realm
'mesos-agent-readwrite'
I0205 12:13:55.768852 30282 slave.cpp:541] Agent resources: cpus(*):2; mem(*):1024; disk(*):1024;
ports(*):[31000-32000]
I0205 12:13:55.768939 30282 slave.cpp:549] Agent attributes: [  ]
I0205 12:13:55.768981 30282 slave.cpp:554] Agent hostname: 257da84a90fe
I0205 12:13:55.769202 30286 status_update_manager.cpp:177] Pausing sending status updates
I0205 12:13:55.770848 30294 state.cpp:60] Recovering state from '/tmp/Endpoint_SlaveEndpointTest_UnauthorizedRequest_1_cu63RB/meta'
I0205 12:13:55.771255 30283 status_update_manager.cpp:203] Recovering status update manager
I0205 12:13:55.771494 30283 containerizer.cpp:599] Recovering containerizer
I0205 12:13:55.773032 30289 provisioner.cpp:410] Provisioner recovery complete
I0205 12:13:55.773447 30293 slave.cpp:5499] Finished recovery
I0205 12:13:55.773998 30293 slave.cpp:5673] Querying resource estimator for oversubscribable
resources
I0205 12:13:55.774400 30292 slave.cpp:5687] Received oversubscribable resources {} from the
resource estimator
I0205 12:13:55.777477 30286 process.cpp:3697] Handling HTTP event for process 'slave(695)'
with path: '/slave(695)/monitor/statistics.json'
I0205 12:13:55.779168 30287 http.cpp:871] Authorizing principal 'test-principal' to GET the
'/monitor/statistics.json' endpoint
I0205 12:13:55.781731 30293 slave.cpp:803] Agent terminating
[       OK ] Endpoint/SlaveEndpointTest.UnauthorizedRequest/1 (27 ms)
[ RUN      ] Endpoint/SlaveEndpointTest.UnauthorizedRequest/2
I0205 12:13:55.790791 30260 containerizer.cpp:220] Using isolation: posix/cpu,posix/mem,filesystem/posix,network/cni
W0205 12:13:55.791301 30260 backend.cpp:76] Failed to create 'aufs' backend: AufsBackend requires
root privileges
W0205 12:13:55.791437 30260 backend.cpp:76] Failed to create 'bind' backend: BindBackend requires
root privileges
I0205 12:13:55.791487 30260 provisioner.cpp:249] Using default backend 'copy'
I0205 12:13:55.794423 30281 slave.cpp:211] Mesos agent started on (696)@172.17.0.3:59341
I0205 12:13:55.794466 30281 slave.cpp:212] Flags at startup: --acls="" --appc_simple_discovery_uri_prefix="http://"
--appc_store_dir="/tmp/mesos/store/appc" --authenticate_http_readonly="true" --authenticate_http_readwrite="true"
--authenticatee="crammd5" --authentication_backoff_factor="1secs" --authorizer="local" --cgroups_cpu_enable_pids_and_tids_count="false"
--cgroups_enable_cfs="false" --cgroups_hierarchy="/sys/fs/cgroup" --cgroups_limit_swap="false"
--cgroups_root="mesos" --container_disk_watch_interval="15secs" --containerizers="mesos" --credential="/tmp/Endpoint_SlaveEndpointTest_UnauthorizedRequest_2_etfINa/credential"
--default_role="*" --disk_watch_interval="1mins" --docker="docker" --docker_kill_orphans="true"
--docker_registry="https://registry-1.docker.io" --docker_remove_delay="6hrs" --docker_socket="/var/run/docker.sock"
--docker_stop_timeout="0ns" --docker_store_dir="/tmp/mesos/store/docker" --docker_volume_checkpoint_dir="/var/run/mesos/isolators/docker/volume"
--enforce_container_disk_quota="false" --executor_registration_timeout="1mins" --executor_shutdown_grace_period="5secs"
--fetcher_cache_dir="/tmp/Endpoint_SlaveEndpointTest_UnauthorizedRequest_2_etfINa/fetch" --fetcher_cache_size="2GB"
--frameworks_home="" --gc_delay="1weeks" --gc_disk_headroom="0.1" --hadoop_home="" --help="false"
--hostname_lookup="true" --http_authenticators="basic" --http_command_executor="false" --http_credentials="/tmp/Endpoint_SlaveEndpointTest_UnauthorizedRequest_2_etfINa/http_credentials"
--http_heartbeat_interval="30secs" --initialize_driver_logging="true" --isolation="posix/cpu,posix/mem"
--launcher="posix" --launcher_dir="/mesos/mesos-1.2.0/_build/src" --logbufsecs="0" --logging_level="INFO"
--max_completed_executors_per_framework="150" --oversubscribed_resources_interval="15secs"
--perf_duration="10secs" --perf_interval="1mins" --qos_correction_interval_min="0ns" --quiet="false"
--recover="reconnect" --recovery_timeout="15mins" --registration_backoff_factor="10ms" --resources="cpus:2;gpus:0;mem:1024;disk:1024;ports:[31000-32000]"
--revocable_cpu_low_priority="true" --runtime_dir="/tmp/Endpoint_SlaveEndpointTest_UnauthorizedRequest_2_etfINa"
--sandbox_directory="/mnt/mesos/sandbox" --strict="true" --switch_user="true" --systemd_enable_support="true"
--systemd_runtime_directory="/run/systemd/system" --version="false" --work_dir="/tmp/Endpoint_SlaveEndpointTest_UnauthorizedRequest_2_0tq6M3"
I0205 12:13:55.795235 30281 credentials.hpp:86] Loading credential for authentication from
'/tmp/Endpoint_SlaveEndpointTest_UnauthorizedRequest_2_etfINa/credential'
I0205 12:13:55.795471 30281 slave.cpp:354] Agent using credential for: test-principal
I0205 12:13:55.795493 30281 credentials.hpp:37] Loading credentials for authentication from
'/tmp/Endpoint_SlaveEndpointTest_UnauthorizedRequest_2_etfINa/http_credentials'
I0205 12:13:55.795719 30281 http.cpp:919] Using default 'basic' HTTP authenticator for realm
'mesos-agent-readonly'
I0205 12:13:55.795863 30281 http.cpp:919] Using default 'basic' HTTP authenticator for realm
'mesos-agent-readwrite'
I0205 12:13:55.797216 30281 slave.cpp:541] Agent resources: cpus(*):2; mem(*):1024; disk(*):1024;
ports(*):[31000-32000]
I0205 12:13:55.797292 30281 slave.cpp:549] Agent attributes: [  ]
I0205 12:13:55.797312 30281 slave.cpp:554] Agent hostname: 257da84a90fe
I0205 12:13:55.797550 30279 status_update_manager.cpp:177] Pausing sending status updates
I0205 12:13:55.799099 30293 state.cpp:60] Recovering state from '/tmp/Endpoint_SlaveEndpointTest_UnauthorizedRequest_2_0tq6M3/meta'
I0205 12:13:55.799760 30293 status_update_manager.cpp:203] Recovering status update manager
I0205 12:13:55.800061 30293 containerizer.cpp:599] Recovering containerizer
I0205 12:13:55.801895 30294 provisioner.cpp:410] Provisioner recovery complete
I0205 12:13:55.802311 30293 slave.cpp:5499] Finished recovery
I0205 12:13:55.803164 30293 slave.cpp:5673] Querying resource estimator for oversubscribable
resources
I0205 12:13:55.803721 30293 slave.cpp:5687] Received oversubscribable resources {} from the
resource estimator
I0205 12:13:55.806684 30288 process.cpp:3697] Handling HTTP event for process 'slave(696)'
with path: '/slave(696)/containers'
I0205 12:13:55.808099 30293 http.cpp:871] Authorizing principal 'test-principal' to GET the
'/containers' endpoint
I0205 12:13:55.817051 30290 slave.cpp:803] Agent terminating
[       OK ] Endpoint/SlaveEndpointTest.UnauthorizedRequest/2 (36 ms)
[ RUN      ] Endpoint/SlaveEndpointTest.NoAuthorizer/0
I0205 12:13:55.827234 30260 containerizer.cpp:220] Using isolation: posix/cpu,posix/mem,filesystem/posix,network/cni
W0205 12:13:55.828096 30260 backend.cpp:76] Failed to create 'aufs' backend: AufsBackend requires
root privileges
W0205 12:13:55.828306 30260 backend.cpp:76] Failed to create 'bind' backend: BindBackend requires
root privileges
I0205 12:13:55.828477 30260 provisioner.cpp:249] Using default backend 'copy'
I0205 12:13:55.830487 30260 cluster.cpp:446] Creating default 'local' authorizer
I0205 12:13:55.833245 30280 slave.cpp:211] Mesos agent started on (697)@172.17.0.3:59341
I0205 12:13:55.833276 30280 slave.cpp:212] Flags at startup: --acls="" --appc_simple_discovery_uri_prefix="http://"
--appc_store_dir="/tmp/mesos/store/appc" --authenticate_http_readonly="true" --authenticate_http_readwrite="true"
--authenticatee="crammd5" --authentication_backoff_factor="1secs" --authorizer="local" --cgroups_cpu_enable_pids_and_tids_count="false"
--cgroups_enable_cfs="false" --cgroups_hierarchy="/sys/fs/cgroup" --cgroups_limit_swap="false"
--cgroups_root="mesos" --container_disk_watch_interval="15secs" --containerizers="mesos" --credential="/tmp/Endpoint_SlaveEndpointTest_NoAuthorizer_0_iZ3I9C/credential"
--default_role="*" --disk_watch_interval="1mins" --docker="docker" --docker_kill_orphans="true"
--docker_registry="https://registry-1.docker.io" --docker_remove_delay="6hrs" --docker_socket="/var/run/docker.sock"
--docker_stop_timeout="0ns" --docker_store_dir="/tmp/mesos/store/docker" --docker_volume_checkpoint_dir="/var/run/mesos/isolators/docker/volume"
--enforce_container_disk_quota="false" --executor_registration_timeout="1mins" --executor_shutdown_grace_period="5secs"
--fetcher_cache_dir="/tmp/Endpoint_SlaveEndpointTest_NoAuthorizer_0_iZ3I9C/fetch" --fetcher_cache_size="2GB"
--frameworks_home="" --gc_delay="1weeks" --gc_disk_headroom="0.1" --hadoop_home="" --help="false"
--hostname_lookup="true" --http_authenticators="basic" --http_command_executor="false" --http_credentials="/tmp/Endpoint_SlaveEndpointTest_NoAuthorizer_0_iZ3I9C/http_credentials"
--http_heartbeat_interval="30secs" --initialize_driver_logging="true" --isolation="posix/cpu,posix/mem"
--launcher="posix" --launcher_dir="/mesos/mesos-1.2.0/_build/src" --logbufsecs="0" --logging_level="INFO"
--max_completed_executors_per_framework="150" --oversubscribed_resources_interval="15secs"
--perf_duration="10secs" --perf_interval="1mins" --qos_correction_interval_min="0ns" --quiet="false"
--recover="reconnect" --recovery_timeout="15mins" --registration_backoff_factor="10ms" --resources="cpus:2;gpus:0;mem:1024;disk:1024;ports:[31000-32000]"
--revocable_cpu_low_priority="true" --runtime_dir="/tmp/Endpoint_SlaveEndpointTest_NoAuthorizer_0_iZ3I9C"
--sandbox_directory="/mnt/mesos/sandbox" --strict="true" --switch_user="true" --systemd_enable_support="true"
--systemd_runtime_directory="/run/systemd/system" --version="false" --work_dir="/tmp/Endpoint_SlaveEndpointTest_NoAuthorizer_0_MOgg3v"
I0205 12:13:55.834694 30280 credentials.hpp:86] Loading credential for authentication from
'/tmp/Endpoint_SlaveEndpointTest_NoAuthorizer_0_iZ3I9C/credential'
I0205 12:13:55.834951 30280 slave.cpp:354] Agent using credential for: test-principal
I0205 12:13:55.834980 30280 credentials.hpp:37] Loading credentials for authentication from
'/tmp/Endpoint_SlaveEndpointTest_NoAuthorizer_0_iZ3I9C/http_credentials'
I0205 12:13:55.835275 30280 http.cpp:919] Using default 'basic' HTTP authenticator for realm
'mesos-agent-readonly'
I0205 12:13:55.835459 30280 http.cpp:919] Using default 'basic' HTTP authenticator for realm
'mesos-agent-readwrite'
I0205 12:13:55.836813 30280 slave.cpp:541] Agent resources: cpus(*):2; mem(*):1024; disk(*):1024;
ports(*):[31000-32000]
I0205 12:13:55.836940 30280 slave.cpp:549] Agent attributes: [  ]
I0205 12:13:55.836962 30280 slave.cpp:554] Agent hostname: 257da84a90fe
I0205 12:13:55.837790 30293 status_update_manager.cpp:177] Pausing sending status updates
I0205 12:13:55.839319 30280 state.cpp:60] Recovering state from '/tmp/Endpoint_SlaveEndpointTest_NoAuthorizer_0_MOgg3v/meta'
I0205 12:13:55.840059 30287 status_update_manager.cpp:203] Recovering status update manager
I0205 12:13:55.842012 30285 containerizer.cpp:599] Recovering containerizer
I0205 12:13:55.844467 30285 provisioner.cpp:410] Provisioner recovery complete
I0205 12:13:55.845245 30285 slave.cpp:5499] Finished recovery
I0205 12:13:55.846297 30285 slave.cpp:5673] Querying resource estimator for oversubscribable
resources
I0205 12:13:55.846946 30285 slave.cpp:5687] Received oversubscribable resources {} from the
resource estimator
I0205 12:13:55.853477 30294 process.cpp:3697] Handling HTTP event for process 'slave(697)'
with path: '/slave(697)/monitor/statistics'
I0205 12:13:55.855703 30294 http.cpp:871] Authorizing principal 'test-principal' to GET the
'/monitor/statistics' endpoint
I0205 12:13:55.861856 30260 slave.cpp:803] Agent terminating
[       OK ] Endpoint/SlaveEndpointTest.NoAuthorizer/0 (55 ms)
[ RUN      ] Endpoint/SlaveEndpointTest.NoAuthorizer/1
I0205 12:13:55.885637 30260 containerizer.cpp:220] Using isolation: posix/cpu,posix/mem,filesystem/posix,network/cni
W0205 12:13:55.886415 30260 backend.cpp:76] Failed to create 'aufs' backend: AufsBackend requires
root privileges
W0205 12:13:55.886544 30260 backend.cpp:76] Failed to create 'bind' backend: BindBackend requires
root privileges
I0205 12:13:55.886591 30260 provisioner.cpp:249] Using default backend 'copy'
I0205 12:13:55.888551 30260 cluster.cpp:446] Creating default 'local' authorizer
I0205 12:13:55.891309 30279 slave.cpp:211] Mesos agent started on (698)@172.17.0.3:59341
I0205 12:13:55.891475 30279 slave.cpp:212] Flags at startup: --acls="" --appc_simple_discovery_uri_prefix="http://"
--appc_store_dir="/tmp/mesos/store/appc" --authenticate_http_readonly="true" --authenticate_http_readwrite="true"
--authenticatee="crammd5" --authentication_backoff_factor="1secs" --authorizer="local" --cgroups_cpu_enable_pids_and_tids_count="false"
--cgroups_enable_cfs="false" --cgroups_hierarchy="/sys/fs/cgroup" --cgroups_limit_swap="false"
--cgroups_root="mesos" --container_disk_watch_interval="15secs" --containerizers="mesos" --credential="/tmp/Endpoint_SlaveEndpointTest_NoAuthorizer_1_m8mr45/credential"
--default_role="*" --disk_watch_interval="1mins" --docker="docker" --docker_kill_orphans="true"
--docker_registry="https://registry-1.docker.io" --docker_remove_delay="6hrs" --docker_socket="/var/run/docker.sock"
--docker_stop_timeout="0ns" --docker_store_dir="/tmp/mesos/store/docker" --docker_volume_checkpoint_dir="/var/run/mesos/isolators/docker/volume"
--enforce_container_disk_quota="false" --executor_registration_timeout="1mins" --executor_shutdown_grace_period="5secs"
--fetcher_cache_dir="/tmp/Endpoint_SlaveEndpointTest_NoAuthorizer_1_m8mr45/fetch" --fetcher_cache_size="2GB"
--frameworks_home="" --gc_delay="1weeks" --gc_disk_headroom="0.1" --hadoop_home="" --help="false"
--hostname_lookup="true" --http_authenticators="basic" --http_command_executor="false" --http_credentials="/tmp/Endpoint_SlaveEndpointTest_NoAuthorizer_1_m8mr45/http_credentials"
--http_heartbeat_interval="30secs" --initialize_driver_logging="true" --isolation="posix/cpu,posix/mem"
--launcher="posix" --launcher_dir="/mesos/mesos-1.2.0/_build/src" --logbufsecs="0" --logging_level="INFO"
--max_completed_executors_per_framework="150" --oversubscribed_resources_interval="15secs"
--perf_duration="10secs" --perf_interval="1mins" --qos_correction_interval_min="0ns" --quiet="false"
--recover="reconnect" --recovery_timeout="15mins" --registration_backoff_factor="10ms" --resources="cpus:2;gpus:0;mem:1024;disk:1024;ports:[31000-32000]"
--revocable_cpu_low_priority="true" --runtime_dir="/tmp/Endpoint_SlaveEndpointTest_NoAuthorizer_1_m8mr45"
--sandbox_directory="/mnt/mesos/sandbox" --strict="true" --switch_user="true" --systemd_enable_support="true"
--systemd_runtime_directory="/run/systemd/system" --version="false" --work_dir="/tmp/Endpoint_SlaveEndpointTest_NoAuthorizer_1_8V8FOY"
I0205 12:13:55.892202 30279 credentials.hpp:86] Loading credential for authentication from
'/tmp/Endpoint_SlaveEndpointTest_NoAuthorizer_1_m8mr45/credential'
I0205 12:13:55.892444 30279 slave.cpp:354] Agent using credential for: test-principal
I0205 12:13:55.892470 30279 credentials.hpp:37] Loading credentials for authentication from
'/tmp/Endpoint_SlaveEndpointTest_NoAuthorizer_1_m8mr45/http_credentials'
I0205 12:13:55.892827 30279 http.cpp:919] Using default 'basic' HTTP authenticator for realm
'mesos-agent-readonly'
I0205 12:13:55.892997 30279 http.cpp:919] Using default 'basic' HTTP authenticator for realm
'mesos-agent-readwrite'
I0205 12:13:55.894724 30279 slave.cpp:541] Agent resources: cpus(*):2; mem(*):1024; disk(*):1024;
ports(*):[31000-32000]
I0205 12:13:55.894840 30279 slave.cpp:549] Agent attributes: [  ]
I0205 12:13:55.894860 30279 slave.cpp:554] Agent hostname: 257da84a90fe
I0205 12:13:55.895056 30280 status_update_manager.cpp:177] Pausing sending status updates
I0205 12:13:55.897121 30285 state.cpp:60] Recovering state from '/tmp/Endpoint_SlaveEndpointTest_NoAuthorizer_1_8V8FOY/meta'
I0205 12:13:55.897631 30280 status_update_manager.cpp:203] Recovering status update manager
I0205 12:13:55.898075 30280 containerizer.cpp:599] Recovering containerizer
I0205 12:13:55.899879 30286 provisioner.cpp:410] Provisioner recovery complete
I0205 12:13:55.900550 30286 slave.cpp:5499] Finished recovery
I0205 12:13:55.901175 30286 slave.cpp:5673] Querying resource estimator for oversubscribable
resources
I0205 12:13:55.901942 30286 slave.cpp:5687] Received oversubscribable resources {} from the
resource estimator
I0205 12:13:55.906299 30283 process.cpp:3697] Handling HTTP event for process 'slave(698)'
with path: '/slave(698)/monitor/statistics.json'
I0205 12:13:55.908012 30291 http.cpp:871] Authorizing principal 'test-principal' to GET the
'/monitor/statistics.json' endpoint
I0205 12:13:55.912616 30260 slave.cpp:803] Agent terminating
[       OK ] Endpoint/SlaveEndpointTest.NoAuthorizer/1 (50 ms)
[ RUN      ] Endpoint/SlaveEndpointTest.NoAuthorizer/2
I0205 12:13:55.934154 30260 containerizer.cpp:220] Using isolation: posix/cpu,posix/mem,filesystem/posix,network/cni
W0205 12:13:55.934918 30260 backend.cpp:76] Failed to create 'aufs' backend: AufsBackend requires
root privileges
W0205 12:13:55.935144 30260 backend.cpp:76] Failed to create 'bind' backend: BindBackend requires
root privileges
I0205 12:13:55.935302 30260 provisioner.cpp:249] Using default backend 'copy'
I0205 12:13:55.936849 30260 cluster.cpp:446] Creating default 'local' authorizer
I0205 12:13:55.939008 30286 slave.cpp:211] Mesos agent started on (699)@172.17.0.3:59341
I0205 12:13:55.939046 30286 slave.cpp:212] Flags at startup: --acls="" --appc_simple_discovery_uri_prefix="http://"
--appc_store_dir="/tmp/mesos/store/appc" --authenticate_http_readonly="true" --authenticate_http_readwrite="true"
--authenticatee="crammd5" --authentication_backoff_factor="1secs" --authorizer="local" --cgroups_cpu_enable_pids_and_tids_count="false"
--cgroups_enable_cfs="false" --cgroups_hierarchy="/sys/fs/cgroup" --cgroups_limit_swap="false"
--cgroups_root="mesos" --container_disk_watch_interval="15secs" --containerizers="mesos" --credential="/tmp/Endpoint_SlaveEndpointTest_NoAuthorizer_2_FYahwz/credential"
--default_role="*" --disk_watch_interval="1mins" --docker="docker" --docker_kill_orphans="true"
--docker_registry="https://registry-1.docker.io" --docker_remove_delay="6hrs" --docker_socket="/var/run/docker.sock"
--docker_stop_timeout="0ns" --docker_store_dir="/tmp/mesos/store/docker" --docker_volume_checkpoint_dir="/var/run/mesos/isolators/docker/volume"
--enforce_container_disk_quota="false" --executor_registration_timeout="1mins" --executor_shutdown_grace_period="5secs"
--fetcher_cache_dir="/tmp/Endpoint_SlaveEndpointTest_NoAuthorizer_2_FYahwz/fetch" --fetcher_cache_size="2GB"
--frameworks_home="" --gc_delay="1weeks" --gc_disk_headroom="0.1" --hadoop_home="" --help="false"
--hostname_lookup="true" --http_authenticators="basic" --http_command_executor="false" --http_credentials="/tmp/Endpoint_SlaveEndpointTest_NoAuthorizer_2_FYahwz/http_credentials"
--http_heartbeat_interval="30secs" --initialize_driver_logging="true" --isolation="posix/cpu,posix/mem"
--launcher="posix" --launcher_dir="/mesos/mesos-1.2.0/_build/src" --logbufsecs="0" --logging_level="INFO"
--max_completed_executors_per_framework="150" --oversubscribed_resources_interval="15secs"
--perf_duration="10secs" --perf_interval="1mins" --qos_correction_interval_min="0ns" --quiet="false"
--recover="reconnect" --recovery_timeout="15mins" --registration_backoff_factor="10ms" --resources="cpus:2;gpus:0;mem:1024;disk:1024;ports:[31000-32000]"
--revocable_cpu_low_priority="true" --runtime_dir="/tmp/Endpoint_SlaveEndpointTest_NoAuthorizer_2_FYahwz"
--sandbox_directory="/mnt/mesos/sandbox" --strict="true" --switch_user="true" --systemd_enable_support="true"
--systemd_runtime_directory="/run/systemd/system" --version="false" --work_dir="/tmp/Endpoint_SlaveEndpointTest_NoAuthorizer_2_8vGu8r"
I0205 12:13:55.939807 30286 credentials.hpp:86] Loading credential for authentication from
'/tmp/Endpoint_SlaveEndpointTest_NoAuthorizer_2_FYahwz/credential'
I0205 12:13:55.940007 30286 slave.cpp:354] Agent using credential for: test-principal
I0205 12:13:55.940026 30286 credentials.hpp:37] Loading credentials for authentication from
'/tmp/Endpoint_SlaveEndpointTest_NoAuthorizer_2_FYahwz/http_credentials'
I0205 12:13:55.940276 30286 http.cpp:919] Using default 'basic' HTTP authenticator for realm
'mesos-agent-readonly'
I0205 12:13:55.940436 30286 http.cpp:919] Using default 'basic' HTTP authenticator for realm
'mesos-agent-readwrite'
I0205 12:13:55.942934 30286 slave.cpp:541] Agent resources: cpus(*):2; mem(*):1024; disk(*):1024;
ports(*):[31000-32000]
I0205 12:13:55.943876 30286 slave.cpp:549] Agent attributes: [  ]
I0205 12:13:55.943897 30286 slave.cpp:554] Agent hostname: 257da84a90fe
I0205 12:13:55.944224 30279 status_update_manager.cpp:177] Pausing sending status updates
I0205 12:13:55.946177 30289 state.cpp:60] Recovering state from '/tmp/Endpoint_SlaveEndpointTest_NoAuthorizer_2_8vGu8r/meta'
I0205 12:13:55.946910 30289 status_update_manager.cpp:203] Recovering status update manager
I0205 12:13:55.947238 30293 containerizer.cpp:599] Recovering containerizer
I0205 12:13:55.949647 30293 provisioner.cpp:410] Provisioner recovery complete
I0205 12:13:55.950283 30293 slave.cpp:5499] Finished recovery
I0205 12:13:55.951364 30293 slave.cpp:5673] Querying resource estimator for oversubscribable
resources
I0205 12:13:55.951735 30283 slave.cpp:5687] Received oversubscribable resources {} from the
resource estimator
I0205 12:13:55.956797 30290 process.cpp:3697] Handling HTTP event for process 'slave(699)'
with path: '/slave(699)/containers'
I0205 12:13:55.958647 30292 http.cpp:871] Authorizing principal 'test-principal' to GET the
'/containers' endpoint
I0205 12:13:55.964601 30287 slave.cpp:803] Agent terminating
[       OK ] Endpoint/SlaveEndpointTest.NoAuthorizer/2 (48 ms)
[----------] 9 tests from Endpoint/SlaveEndpointTest (386 ms total)

[----------] Global test environment tear-down
[==========] 1484 tests from 168 test cases ran. (578395 ms total)
[  PASSED  ] 1481 tests.
[  FAILED  ] 3 tests, listed below:
[  FAILED  ] MasterAuthorizerTest/0.FilterOrphanedTasks, where TypeParam = mesos::internal::tests::Module<mesos::Authorizer,
(mesos::internal::tests::ModuleID)8>
[  FAILED  ] MasterTest.MaxCompletedFrameworksFlag
[  FAILED  ] SlaveRecoveryTest/0.RecoverSlaveState, where TypeParam = mesos::internal::slave::MesosContainerizer

 3 FAILED TESTS
  YOU HAVE 11 DISABLED TESTS

make[4]: *** [check-local] Error 1
make[4]: Leaving directory `/mesos/mesos-1.2.0/_build/src'
make[3]: *** [check-am] Error 2
make[3]: Leaving directory `/mesos/mesos-1.2.0/_build/src'
make[2]: *** [check] Error 2
make[2]: Leaving directory `/mesos/mesos-1.2.0/_build/src'
make[1]: *** [check-recursive] Error 1
make[1]: Leaving directory `/mesos/mesos-1.2.0/_build'
make: *** [distcheck] Error 1
+ docker rmi mesos-1486293338-21607
Untagged: mesos-1486293338-21607:latest
Deleted: sha256:9761c18c7c5de1faea08540dd4cfeccf8705852b810e0a057b78a4ce9c49194e
Deleted: sha256:ab21e4a64bd13b67b4711401a7ef092a93e4fb888f6a744adbe5939476fb0925
Deleted: sha256:fe8376cd7ebba20606f886bb000f1456a7074695ca0d504913b880e772f1b52c
Deleted: sha256:ade374b6ac366db9897f834f133957d039878d47aaa484e7f000cc37493227d2
Deleted: sha256:8d95507de016bf6ea75b6c15147b810234b6bb4951e477fae73668ea98c43f5b
Deleted: sha256:b1b91cb5365f3f9a3f91d9f1e63be459b348e064ebffe1531a9cbdf01bd5645b
Deleted: sha256:b1874b35fc0d051ce45687786116440684e6b990779bf1dad82d02d2fe993306
Deleted: sha256:d3c7e01829a7a2731349a3a8b240667fae8df3e56479bb40fc60cae8722c60bc
Deleted: sha256:2fbcab04c8884fcac322d7d96200027bb52e2fced6d4bf2228d9311b444cbfec
Deleted: sha256:61cdfeefdaf4c73a10c52a2ee4b4855cd279f01c244dadd6ebf1395f6e360de8
Deleted: sha256:c05b8c0f7e6fceb15de23f5161e2050a705f5c54b6437058f3d22ca358f904e4
Deleted: sha256:6bd9969e124e60d1591d1246d006fdefd6fc0860e8f5cba1ef8ca77183115f92
Deleted: sha256:2a528178380654fb763a4a19798e3ca66055b402a1a092cf608b38250b124ee3
Deleted: sha256:24faea9abe1f79d4f3bc343a0234fdbab304ec4fa600891b32bda8d8591f180d
Deleted: sha256:ddc3ded4a24abb56a597d13a9effd75c2367ab5e315240c8f9114d4c80d54d26
Deleted: sha256:b388bb17d74ac3b0ac18dbeb737a6bfc5f750fb693f4230edf4e35ddf323353b
Deleted: sha256:4a1f63954b1e1ebb2c72a7f1e62f0fa1eb2efabd828e815ceb4a7b348e082bf3
Deleted: sha256:b1770f24fb55d566f1da40c8d4edaa32457cae8a931b3b93a49ec8bb5171d108
Deleted: sha256:187abebe0458e9fbd7cc6ae1fe07cdd44bf3873847e57917588b77939bc33ca1
Deleted: sha256:cf881b4dbb9cb3cab7ede13178f8429cf938980d0f62d699b586ca8d41c55b68
Deleted: sha256:0130268b29026e50bf9bbcf1738dbfbb8a0837c31d45c44c41fb7a36e80cad0f
Deleted: sha256:de7f5b2b46705a9615389f88e7e31202faffe7c21f0153b33eaca8a7acf23020
Deleted: sha256:69b97f477f5d3e64e93ce9be1559d9f7009af647940941fd466c0d2b26847359
Deleted: sha256:53788e2ada0db0cadef98325c838562b04b53334f2a76a10df57dd40e88cad53
Build step 'Execute shell' marked build as failure

Mime
View raw message