mesos-builds mailing list archives

Site index · List index
Message view « Date » · « Thread »
Top « Date » · « Thread »
From Apache Jenkins Server <jenk...@builds.apache.org>
Subject Build failed in Jenkins: Mesos-Buildbot » cmake,gcc,--verbose --enable-libevent --enable-ssl,GLOG_v=1 MESOS_VERBOSE=1,ubuntu:14.04,(docker||Hadoop)&&(!ubuntu-us1)&&(!ubuntu-eu2) #3302
Date Fri, 24 Feb 2017 01:50:12 GMT
See <https://builds.apache.org/job/Mesos-Buildbot/BUILDTOOL=cmake,COMPILER=gcc,CONFIGURATION=--verbose%20--enable-libevent%20--enable-ssl,ENVIRONMENT=GLOG_v=1%20MESOS_VERBOSE=1,OS=ubuntu%3A14.04,label_exp=(docker%7C%7CHadoop)&&(!ubuntu-us1)&&(!ubuntu-eu2)/3302/display/redirect>

------------------------------------------
[...truncated 24.69 MB...]
I0224 01:49:39.161542 27105 status_update_manager.cpp:177] Pausing sending status updates
I0224 01:49:39.161895 27104 state.cpp:62] Recovering state from '/tmp/Endpoint_SlaveEndpointTest_AuthorizedRequest_1_FaqCiW/meta'
I0224 01:49:39.162072 27110 status_update_manager.cpp:203] Recovering status update manager
I0224 01:49:39.162168 27099 containerizer.cpp:599] Recovering containerizer
I0224 01:49:39.162695 27106 provisioner.cpp:410] Provisioner recovery complete
I0224 01:49:39.162899 27104 slave.cpp:5559] Finished recovery
I0224 01:49:39.163322 27104 slave.cpp:5733] Querying resource estimator for oversubscribable
resources
I0224 01:49:39.163527 27113 slave.cpp:5747] Received oversubscribable resources {} from the
resource estimator
I0224 01:49:39.164331 27106 process.cpp:3704] Handling HTTP event for process 'slave(701)'
with path: '/slave(701)/monitor/statistics.json'
I0224 01:49:39.164834 27103 http.cpp:885] Authorizing principal 'test-principal' to GET the
'/monitor/statistics.json' endpoint
I0224 01:49:39.166246 27108 slave.cpp:803] Agent terminating
[       OK ] Endpoint/SlaveEndpointTest.AuthorizedRequest/1 (12 ms)
[ RUN      ] Endpoint/SlaveEndpointTest.AuthorizedRequest/2
I0224 01:49:39.218231 27097 containerizer.cpp:220] Using isolation: posix/cpu,posix/mem,filesystem/posix,network/cni
W0224 01:49:39.218703 27097 backend.cpp:76] Failed to create 'aufs' backend: AufsBackend requires
root privileges
W0224 01:49:39.218853 27097 backend.cpp:76] Failed to create 'bind' backend: BindBackend requires
root privileges
I0224 01:49:39.218919 27097 provisioner.cpp:249] Using default backend 'copy'
I0224 01:49:39.220283 27103 slave.cpp:211] Mesos agent started on (702)@172.17.0.2:54254
I0224 01:49:39.220304 27103 slave.cpp:212] Flags at startup: --acls="" --appc_simple_discovery_uri_prefix="http://"
--appc_store_dir="/tmp/mesos/store/appc" --authenticate_http_readonly="true" --authenticate_http_readwrite="true"
--authenticatee="crammd5" --authentication_backoff_factor="1secs" --authorizer="local" --cgroups_cpu_enable_pids_and_tids_count="false"
--cgroups_enable_cfs="false" --cgroups_hierarchy="/sys/fs/cgroup" --cgroups_limit_swap="false"
--cgroups_root="mesos" --container_disk_watch_interval="15secs" --containerizers="mesos" --credential="/tmp/Endpoint_SlaveEndpointTest_AuthorizedRequest_2_uW5nAh/credential"
--default_role="*" --disk_watch_interval="1mins" --docker="docker" --docker_kill_orphans="true"
--docker_registry="https://registry-1.docker.io" --docker_remove_delay="6hrs" --docker_socket="/var/run/docker.sock"
--docker_stop_timeout="0ns" --docker_store_dir="/tmp/mesos/store/docker" --docker_volume_checkpoint_dir="/var/run/mesos/isolators/docker/volume"
--enforce_container_disk_quota="false" --executor_registration_timeout="1mins" --executor_shutdown_grace_period="5secs"
--fetcher_cache_dir="/tmp/Endpoint_SlaveEndpointTest_AuthorizedRequest_2_uW5nAh/fetch" --fetcher_cache_size="2GB"
--frameworks_home="" --gc_delay="1weeks" --gc_disk_headroom="0.1" --hadoop_home="" --help="false"
--hostname_lookup="true" --http_authenticators="basic" --http_command_executor="false" --http_credentials="/tmp/Endpoint_SlaveEndpointTest_AuthorizedRequest_2_uW5nAh/http_credentials"
--http_heartbeat_interval="30secs" --initialize_driver_logging="true" --isolation="posix/cpu,posix/mem"
--launcher="posix" --launcher_dir="/mesos/build/src" --logbufsecs="0" --logging_level="INFO"
--max_completed_executors_per_framework="150" --oversubscribed_resources_interval="15secs"
--perf_duration="10secs" --perf_interval="1mins" --qos_correction_interval_min="0ns" --quiet="false"
--recover="reconnect" --recovery_timeout="15mins" --registration_backoff_factor="10ms" --resources="cpus:2;gpus:0;mem:1024;disk:1024;ports:[31000-32000]"
--revocable_cpu_low_priority="true" --runtime_dir="/tmp/Endpoint_SlaveEndpointTest_AuthorizedRequest_2_uW5nAh"
--sandbox_directory="/mnt/mesos/sandbox" --strict="true" --switch_user="true" --systemd_enable_support="true"
--systemd_runtime_directory="/run/systemd/system" --version="false" --work_dir="/tmp/Endpoint_SlaveEndpointTest_AuthorizedRequest_2_zXfJgd"
I0224 01:49:39.220711 27103 credentials.hpp:86] Loading credential for authentication from
'/tmp/Endpoint_SlaveEndpointTest_AuthorizedRequest_2_uW5nAh/credential'
I0224 01:49:39.220818 27103 slave.cpp:354] Agent using credential for: test-principal
I0224 01:49:39.220831 27103 credentials.hpp:37] Loading credentials for authentication from
'/tmp/Endpoint_SlaveEndpointTest_AuthorizedRequest_2_uW5nAh/http_credentials'
I0224 01:49:39.220949 27103 http.cpp:933] Using default 'basic' HTTP authenticator for realm
'mesos-agent-readonly'
I0224 01:49:39.221007 27103 http.cpp:933] Using default 'basic' HTTP authenticator for realm
'mesos-agent-readwrite'
I0224 01:49:39.221508 27103 slave.cpp:541] Agent resources: cpus(*):2; mem(*):1024; disk(*):1024;
ports(*):[31000-32000]
I0224 01:49:39.221549 27103 slave.cpp:549] Agent attributes: [  ]
I0224 01:49:39.221554 27103 slave.cpp:554] Agent hostname: b4f684fdc995
I0224 01:49:39.221635 27106 status_update_manager.cpp:177] Pausing sending status updates
I0224 01:49:39.221964 27106 state.cpp:62] Recovering state from '/tmp/Endpoint_SlaveEndpointTest_AuthorizedRequest_2_zXfJgd/meta'
I0224 01:49:39.222146 27104 status_update_manager.cpp:203] Recovering status update manager
I0224 01:49:39.222213 27104 containerizer.cpp:599] Recovering containerizer
I0224 01:49:39.222759 27106 provisioner.cpp:410] Provisioner recovery complete
I0224 01:49:39.222949 27107 slave.cpp:5559] Finished recovery
I0224 01:49:39.223309 27107 slave.cpp:5733] Querying resource estimator for oversubscribable
resources
I0224 01:49:39.223428 27102 slave.cpp:5747] Received oversubscribable resources {} from the
resource estimator
I0224 01:49:39.224473 27102 process.cpp:3704] Handling HTTP event for process 'slave(702)'
with path: '/slave(702)/containers'
I0224 01:49:39.224804 27102 http.cpp:885] Authorizing principal 'test-principal' to GET the
'/containers' endpoint
I0224 01:49:39.225993 27101 slave.cpp:803] Agent terminating
[       OK ] Endpoint/SlaveEndpointTest.AuthorizedRequest/2 (12 ms)
[ RUN      ] Endpoint/SlaveEndpointTest.UnauthorizedRequest/0
I0224 01:49:39.293797 27097 containerizer.cpp:220] Using isolation: posix/cpu,posix/mem,filesystem/posix,network/cni
W0224 01:49:39.294188 27097 backend.cpp:76] Failed to create 'aufs' backend: AufsBackend requires
root privileges
W0224 01:49:39.294231 27097 backend.cpp:76] Failed to create 'bind' backend: BindBackend requires
root privileges
I0224 01:49:39.294248 27097 provisioner.cpp:249] Using default backend 'copy'
I0224 01:49:39.295704 27098 slave.cpp:211] Mesos agent started on (703)@172.17.0.2:54254
I0224 01:49:39.295722 27098 slave.cpp:212] Flags at startup: --acls="" --appc_simple_discovery_uri_prefix="http://"
--appc_store_dir="/tmp/mesos/store/appc" --authenticate_http_readonly="true" --authenticate_http_readwrite="true"
--authenticatee="crammd5" --authentication_backoff_factor="1secs" --authorizer="local" --cgroups_cpu_enable_pids_and_tids_count="false"
--cgroups_enable_cfs="false" --cgroups_hierarchy="/sys/fs/cgroup" --cgroups_limit_swap="false"
--cgroups_root="mesos" --container_disk_watch_interval="15secs" --containerizers="mesos" --credential="/tmp/Endpoint_SlaveEndpointTest_UnauthorizedRequest_0_WikFsz/credential"
--default_role="*" --disk_watch_interval="1mins" --docker="docker" --docker_kill_orphans="true"
--docker_registry="https://registry-1.docker.io" --docker_remove_delay="6hrs" --docker_socket="/var/run/docker.sock"
--docker_stop_timeout="0ns" --docker_store_dir="/tmp/mesos/store/docker" --docker_volume_checkpoint_dir="/var/run/mesos/isolators/docker/volume"
--enforce_container_disk_quota="false" --executor_registration_timeout="1mins" --executor_shutdown_grace_period="5secs"
--fetcher_cache_dir="/tmp/Endpoint_SlaveEndpointTest_UnauthorizedRequest_0_WikFsz/fetch" --fetcher_cache_size="2GB"
--frameworks_home="" --gc_delay="1weeks" --gc_disk_headroom="0.1" --hadoop_home="" --help="false"
--hostname_lookup="true" --http_authenticators="basic" --http_command_executor="false" --http_credentials="/tmp/Endpoint_SlaveEndpointTest_UnauthorizedRequest_0_WikFsz/http_credentials"
--http_heartbeat_interval="30secs" --initialize_driver_logging="true" --isolation="posix/cpu,posix/mem"
--launcher="posix" --launcher_dir="/mesos/build/src" --logbufsecs="0" --logging_level="INFO"
--max_completed_executors_per_framework="150" --oversubscribed_resources_interval="15secs"
--perf_duration="10secs" --perf_interval="1mins" --qos_correction_interval_min="0ns" --quiet="false"
--recover="reconnect" --recovery_timeout="15mins" --registration_backoff_factor="10ms" --resources="cpus:2;gpus:0;mem:1024;disk:1024;ports:[31000-32000]"
--revocable_cpu_low_priority="true" --runtime_dir="/tmp/Endpoint_SlaveEndpointTest_UnauthorizedRequest_0_WikFsz"
--sandbox_directory="/mnt/mesos/sandbox" --strict="true" --switch_user="true" --systemd_enable_support="true"
--systemd_runtime_directory="/run/systemd/system" --version="false" --work_dir="/tmp/Endpoint_SlaveEndpointTest_UnauthorizedRequest_0_TuDJWu"
I0224 01:49:39.296110 27098 credentials.hpp:86] Loading credential for authentication from
'/tmp/Endpoint_SlaveEndpointTest_UnauthorizedRequest_0_WikFsz/credential'
I0224 01:49:39.296217 27098 slave.cpp:354] Agent using credential for: test-principal
I0224 01:49:39.296229 27098 credentials.hpp:37] Loading credentials for authentication from
'/tmp/Endpoint_SlaveEndpointTest_UnauthorizedRequest_0_WikFsz/http_credentials'
I0224 01:49:39.296341 27098 http.cpp:933] Using default 'basic' HTTP authenticator for realm
'mesos-agent-readonly'
I0224 01:49:39.296391 27098 http.cpp:933] Using default 'basic' HTTP authenticator for realm
'mesos-agent-readwrite'
I0224 01:49:39.296839 27098 slave.cpp:541] Agent resources: cpus(*):2; mem(*):1024; disk(*):1024;
ports(*):[31000-32000]
I0224 01:49:39.296880 27098 slave.cpp:549] Agent attributes: [  ]
I0224 01:49:39.296887 27098 slave.cpp:554] Agent hostname: b4f684fdc995
I0224 01:49:39.296977 27099 status_update_manager.cpp:177] Pausing sending status updates
I0224 01:49:39.297376 27101 state.cpp:62] Recovering state from '/tmp/Endpoint_SlaveEndpointTest_UnauthorizedRequest_0_TuDJWu/meta'
I0224 01:49:39.297518 27108 status_update_manager.cpp:203] Recovering status update manager
I0224 01:49:39.297587 27108 containerizer.cpp:599] Recovering containerizer
I0224 01:49:39.298281 27103 provisioner.cpp:410] Provisioner recovery complete
I0224 01:49:39.298473 27098 slave.cpp:5559] Finished recovery
I0224 01:49:39.298876 27098 slave.cpp:5733] Querying resource estimator for oversubscribable
resources
I0224 01:49:39.298962 27108 slave.cpp:5747] Received oversubscribable resources {} from the
resource estimator
I0224 01:49:39.299749 27101 process.cpp:3704] Handling HTTP event for process 'slave(703)'
with path: '/slave(703)/monitor/statistics'
I0224 01:49:39.300173 27105 http.cpp:885] Authorizing principal 'test-principal' to GET the
'/monitor/statistics' endpoint
I0224 01:49:39.301111 27099 slave.cpp:803] Agent terminating
[       OK ] Endpoint/SlaveEndpointTest.UnauthorizedRequest/0 (13 ms)
[ RUN      ] Endpoint/SlaveEndpointTest.UnauthorizedRequest/1
I0224 01:49:39.340512 27097 containerizer.cpp:220] Using isolation: posix/cpu,posix/mem,filesystem/posix,network/cni
W0224 01:49:39.340987 27097 backend.cpp:76] Failed to create 'aufs' backend: AufsBackend requires
root privileges
W0224 01:49:39.341100 27097 backend.cpp:76] Failed to create 'bind' backend: BindBackend requires
root privileges
I0224 01:49:39.341166 27097 provisioner.cpp:249] Using default backend 'copy'
I0224 01:49:39.342334 27104 slave.cpp:211] Mesos agent started on (704)@172.17.0.2:54254
I0224 01:49:39.342350 27104 slave.cpp:212] Flags at startup: --acls="" --appc_simple_discovery_uri_prefix="http://"
--appc_store_dir="/tmp/mesos/store/appc" --authenticate_http_readonly="true" --authenticate_http_readwrite="true"
--authenticatee="crammd5" --authentication_backoff_factor="1secs" --authorizer="local" --cgroups_cpu_enable_pids_and_tids_count="false"
--cgroups_enable_cfs="false" --cgroups_hierarchy="/sys/fs/cgroup" --cgroups_limit_swap="false"
--cgroups_root="mesos" --container_disk_watch_interval="15secs" --containerizers="mesos" --credential="/tmp/Endpoint_SlaveEndpointTest_UnauthorizedRequest_1_OdQNTR/credential"
--default_role="*" --disk_watch_interval="1mins" --docker="docker" --docker_kill_orphans="true"
--docker_registry="https://registry-1.docker.io" --docker_remove_delay="6hrs" --docker_socket="/var/run/docker.sock"
--docker_stop_timeout="0ns" --docker_store_dir="/tmp/mesos/store/docker" --docker_volume_checkpoint_dir="/var/run/mesos/isolators/docker/volume"
--enforce_container_disk_quota="false" --executor_registration_timeout="1mins" --executor_shutdown_grace_period="5secs"
--fetcher_cache_dir="/tmp/Endpoint_SlaveEndpointTest_UnauthorizedRequest_1_OdQNTR/fetch" --fetcher_cache_size="2GB"
--frameworks_home="" --gc_delay="1weeks" --gc_disk_headroom="0.1" --hadoop_home="" --help="false"
--hostname_lookup="true" --http_authenticators="basic" --http_command_executor="false" --http_credentials="/tmp/Endpoint_SlaveEndpointTest_UnauthorizedRequest_1_OdQNTR/http_credentials"
--http_heartbeat_interval="30secs" --initialize_driver_logging="true" --isolation="posix/cpu,posix/mem"
--launcher="posix" --launcher_dir="/mesos/build/src" --logbufsecs="0" --logging_level="INFO"
--max_completed_executors_per_framework="150" --oversubscribed_resources_interval="15secs"
--perf_duration="10secs" --perf_interval="1mins" --qos_correction_interval_min="0ns" --quiet="false"
--recover="reconnect" --recovery_timeout="15mins" --registration_backoff_factor="10ms" --resources="cpus:2;gpus:0;mem:1024;disk:1024;ports:[31000-32000]"
--revocable_cpu_low_priority="true" --runtime_dir="/tmp/Endpoint_SlaveEndpointTest_UnauthorizedRequest_1_OdQNTR"
--sandbox_directory="/mnt/mesos/sandbox" --strict="true" --switch_user="true" --systemd_enable_support="true"
--systemd_runtime_directory="/run/systemd/system" --version="false" --work_dir="/tmp/Endpoint_SlaveEndpointTest_UnauthorizedRequest_1_ZjjlgN"
I0224 01:49:39.342640 27104 credentials.hpp:86] Loading credential for authentication from
'/tmp/Endpoint_SlaveEndpointTest_UnauthorizedRequest_1_OdQNTR/credential'
I0224 01:49:39.342754 27104 slave.cpp:354] Agent using credential for: test-principal
I0224 01:49:39.342766 27104 credentials.hpp:37] Loading credentials for authentication from
'/tmp/Endpoint_SlaveEndpointTest_UnauthorizedRequest_1_OdQNTR/http_credentials'
I0224 01:49:39.342856 27104 http.cpp:933] Using default 'basic' HTTP authenticator for realm
'mesos-agent-readonly'
I0224 01:49:39.342898 27104 http.cpp:933] Using default 'basic' HTTP authenticator for realm
'mesos-agent-readwrite'
I0224 01:49:39.343322 27104 slave.cpp:541] Agent resources: cpus(*):2; mem(*):1024; disk(*):1024;
ports(*):[31000-32000]
I0224 01:49:39.343370 27104 slave.cpp:549] Agent attributes: [  ]
I0224 01:49:39.343379 27104 slave.cpp:554] Agent hostname: b4f684fdc995
I0224 01:49:39.343482 27098 status_update_manager.cpp:177] Pausing sending status updates
I0224 01:49:39.343909 27107 state.cpp:62] Recovering state from '/tmp/Endpoint_SlaveEndpointTest_UnauthorizedRequest_1_ZjjlgN/meta'
I0224 01:49:39.344069 27109 status_update_manager.cpp:203] Recovering status update manager
I0224 01:49:39.344208 27106 containerizer.cpp:599] Recovering containerizer
I0224 01:49:39.344770 27099 provisioner.cpp:410] Provisioner recovery complete
I0224 01:49:39.344987 27102 slave.cpp:5559] Finished recovery
I0224 01:49:39.345360 27102 slave.cpp:5733] Querying resource estimator for oversubscribable
resources
I0224 01:49:39.345475 27113 slave.cpp:5747] Received oversubscribable resources {} from the
resource estimator
I0224 01:49:39.346295 27106 process.cpp:3704] Handling HTTP event for process 'slave(704)'
with path: '/slave(704)/monitor/statistics.json'
I0224 01:49:39.346731 27105 http.cpp:885] Authorizing principal 'test-principal' to GET the
'/monitor/statistics.json' endpoint
I0224 01:49:39.347708 27107 slave.cpp:803] Agent terminating
[       OK ] Endpoint/SlaveEndpointTest.UnauthorizedRequest/1 (18 ms)
[ RUN      ] Endpoint/SlaveEndpointTest.UnauthorizedRequest/2
I0224 01:49:39.383426 27097 containerizer.cpp:220] Using isolation: posix/cpu,posix/mem,filesystem/posix,network/cni
W0224 01:49:39.383844 27097 backend.cpp:76] Failed to create 'aufs' backend: AufsBackend requires
root privileges
W0224 01:49:39.383893 27097 backend.cpp:76] Failed to create 'bind' backend: BindBackend requires
root privileges
I0224 01:49:39.383991 27097 provisioner.cpp:249] Using default backend 'copy'
I0224 01:49:39.385545 27104 slave.cpp:211] Mesos agent started on (705)@172.17.0.2:54254
I0224 01:49:39.385562 27104 slave.cpp:212] Flags at startup: --acls="" --appc_simple_discovery_uri_prefix="http://"
--appc_store_dir="/tmp/mesos/store/appc" --authenticate_http_readonly="true" --authenticate_http_readwrite="true"
--authenticatee="crammd5" --authentication_backoff_factor="1secs" --authorizer="local" --cgroups_cpu_enable_pids_and_tids_count="false"
--cgroups_enable_cfs="false" --cgroups_hierarchy="/sys/fs/cgroup" --cgroups_limit_swap="false"
--cgroups_root="mesos" --container_disk_watch_interval="15secs" --containerizers="mesos" --credential="/tmp/Endpoint_SlaveEndpointTest_UnauthorizedRequest_2_2zFvNa/credential"
--default_role="*" --disk_watch_interval="1mins" --docker="docker" --docker_kill_orphans="true"
--docker_registry="https://registry-1.docker.io" --docker_remove_delay="6hrs" --docker_socket="/var/run/docker.sock"
--docker_stop_timeout="0ns" --docker_store_dir="/tmp/mesos/store/docker" --docker_volume_checkpoint_dir="/var/run/mesos/isolators/docker/volume"
--enforce_container_disk_quota="false" --executor_registration_timeout="1mins" --executor_shutdown_grace_period="5secs"
--fetcher_cache_dir="/tmp/Endpoint_SlaveEndpointTest_UnauthorizedRequest_2_2zFvNa/fetch" --fetcher_cache_size="2GB"
--frameworks_home="" --gc_delay="1weeks" --gc_disk_headroom="0.1" --hadoop_home="" --help="false"
--hostname_lookup="true" --http_authenticators="basic" --http_command_executor="false" --http_credentials="/tmp/Endpoint_SlaveEndpointTest_UnauthorizedRequest_2_2zFvNa/http_credentials"
--http_heartbeat_interval="30secs" --initialize_driver_logging="true" --isolation="posix/cpu,posix/mem"
--launcher="posix" --launcher_dir="/mesos/build/src" --logbufsecs="0" --logging_level="INFO"
--max_completed_executors_per_framework="150" --oversubscribed_resources_interval="15secs"
--perf_duration="10secs" --perf_interval="1mins" --qos_correction_interval_min="0ns" --quiet="false"
--recover="reconnect" --recovery_timeout="15mins" --registration_backoff_factor="10ms" --resources="cpus:2;gpus:0;mem:1024;disk:1024;ports:[31000-32000]"
--revocable_cpu_low_priority="true" --runtime_dir="/tmp/Endpoint_SlaveEndpointTest_UnauthorizedRequest_2_2zFvNa"
--sandbox_directory="/mnt/mesos/sandbox" --strict="true" --switch_user="true" --systemd_enable_support="true"
--systemd_runtime_directory="/run/systemd/system" --version="false" --work_dir="/tmp/Endpoint_SlaveEndpointTest_UnauthorizedRequest_2_HEs225"
I0224 01:49:39.385951 27104 credentials.hpp:86] Loading credential for authentication from
'/tmp/Endpoint_SlaveEndpointTest_UnauthorizedRequest_2_2zFvNa/credential'
I0224 01:49:39.386042 27104 slave.cpp:354] Agent using credential for: test-principal
I0224 01:49:39.386056 27104 credentials.hpp:37] Loading credentials for authentication from
'/tmp/Endpoint_SlaveEndpointTest_UnauthorizedRequest_2_2zFvNa/http_credentials'
I0224 01:49:39.386142 27104 http.cpp:933] Using default 'basic' HTTP authenticator for realm
'mesos-agent-readonly'
I0224 01:49:39.386186 27104 http.cpp:933] Using default 'basic' HTTP authenticator for realm
'mesos-agent-readwrite'
I0224 01:49:39.386575 27104 slave.cpp:541] Agent resources: cpus(*):2; mem(*):1024; disk(*):1024;
ports(*):[31000-32000]
I0224 01:49:39.386627 27104 slave.cpp:549] Agent attributes: [  ]
I0224 01:49:39.386638 27104 slave.cpp:554] Agent hostname: b4f684fdc995
I0224 01:49:39.386731 27106 status_update_manager.cpp:177] Pausing sending status updates
I0224 01:49:39.387049 27110 state.cpp:62] Recovering state from '/tmp/Endpoint_SlaveEndpointTest_UnauthorizedRequest_2_HEs225/meta'
I0224 01:49:39.387207 27107 status_update_manager.cpp:203] Recovering status update manager
I0224 01:49:39.387300 27106 containerizer.cpp:599] Recovering containerizer
I0224 01:49:39.387910 27104 provisioner.cpp:410] Provisioner recovery complete
I0224 01:49:39.388098 27104 slave.cpp:5559] Finished recovery
I0224 01:49:39.388492 27104 slave.cpp:5733] Querying resource estimator for oversubscribable
resources
I0224 01:49:39.388628 27104 slave.cpp:5747] Received oversubscribable resources {} from the
resource estimator
I0224 01:49:39.389426 27104 process.cpp:3704] Handling HTTP event for process 'slave(705)'
with path: '/slave(705)/containers'
I0224 01:49:39.389861 27105 http.cpp:885] Authorizing principal 'test-principal' to GET the
'/containers' endpoint
I0224 01:49:39.390743 27102 slave.cpp:803] Agent terminating
[       OK ] Endpoint/SlaveEndpointTest.UnauthorizedRequest/2 (12 ms)
[ RUN      ] Endpoint/SlaveEndpointTest.NoAuthorizer/0
I0224 01:49:39.401090 27097 containerizer.cpp:220] Using isolation: posix/cpu,posix/mem,filesystem/posix,network/cni
W0224 01:49:39.401469 27097 backend.cpp:76] Failed to create 'aufs' backend: AufsBackend requires
root privileges
W0224 01:49:39.401592 27097 backend.cpp:76] Failed to create 'bind' backend: BindBackend requires
root privileges
I0224 01:49:39.401659 27097 provisioner.cpp:249] Using default backend 'copy'
I0224 01:49:39.402472 27097 cluster.cpp:446] Creating default 'local' authorizer
I0224 01:49:39.403537 27111 slave.cpp:211] Mesos agent started on (706)@172.17.0.2:54254
I0224 01:49:39.403555 27111 slave.cpp:212] Flags at startup: --acls="" --appc_simple_discovery_uri_prefix="http://"
--appc_store_dir="/tmp/mesos/store/appc" --authenticate_http_readonly="true" --authenticate_http_readwrite="true"
--authenticatee="crammd5" --authentication_backoff_factor="1secs" --authorizer="local" --cgroups_cpu_enable_pids_and_tids_count="false"
--cgroups_enable_cfs="false" --cgroups_hierarchy="/sys/fs/cgroup" --cgroups_limit_swap="false"
--cgroups_root="mesos" --container_disk_watch_interval="15secs" --containerizers="mesos" --credential="/tmp/Endpoint_SlaveEndpointTest_NoAuthorizer_0_KuhOWt/credential"
--default_role="*" --disk_watch_interval="1mins" --docker="docker" --docker_kill_orphans="true"
--docker_registry="https://registry-1.docker.io" --docker_remove_delay="6hrs" --docker_socket="/var/run/docker.sock"
--docker_stop_timeout="0ns" --docker_store_dir="/tmp/mesos/store/docker" --docker_volume_checkpoint_dir="/var/run/mesos/isolators/docker/volume"
--enforce_container_disk_quota="false" --executor_registration_timeout="1mins" --executor_shutdown_grace_period="5secs"
--fetcher_cache_dir="/tmp/Endpoint_SlaveEndpointTest_NoAuthorizer_0_KuhOWt/fetch" --fetcher_cache_size="2GB"
--frameworks_home="" --gc_delay="1weeks" --gc_disk_headroom="0.1" --hadoop_home="" --help="false"
--hostname_lookup="true" --http_authenticators="basic" --http_command_executor="false" --http_credentials="/tmp/Endpoint_SlaveEndpointTest_NoAuthorizer_0_KuhOWt/http_credentials"
--http_heartbeat_interval="30secs" --initialize_driver_logging="true" --isolation="posix/cpu,posix/mem"
--launcher="posix" --launcher_dir="/mesos/build/src" --logbufsecs="0" --logging_level="INFO"
--max_completed_executors_per_framework="150" --oversubscribed_resources_interval="15secs"
--perf_duration="10secs" --perf_interval="1mins" --qos_correction_interval_min="0ns" --quiet="false"
--recover="reconnect" --recovery_timeout="15mins" --registration_backoff_factor="10ms" --resources="cpus:2;gpus:0;mem:1024;disk:1024;ports:[31000-32000]"
--revocable_cpu_low_priority="true" --runtime_dir="/tmp/Endpoint_SlaveEndpointTest_NoAuthorizer_0_KuhOWt"
--sandbox_directory="/mnt/mesos/sandbox" --strict="true" --switch_user="true" --systemd_enable_support="true"
--systemd_runtime_directory="/run/systemd/system" --version="false" --work_dir="/tmp/Endpoint_SlaveEndpointTest_NoAuthorizer_0_hl7t9o"
I0224 01:49:39.403928 27111 credentials.hpp:86] Loading credential for authentication from
'/tmp/Endpoint_SlaveEndpointTest_NoAuthorizer_0_KuhOWt/credential'
I0224 01:49:39.404017 27111 slave.cpp:354] Agent using credential for: test-principal
I0224 01:49:39.404026 27111 credentials.hpp:37] Loading credentials for authentication from
'/tmp/Endpoint_SlaveEndpointTest_NoAuthorizer_0_KuhOWt/http_credentials'
I0224 01:49:39.404134 27111 http.cpp:933] Using default 'basic' HTTP authenticator for realm
'mesos-agent-readonly'
I0224 01:49:39.404189 27111 http.cpp:933] Using default 'basic' HTTP authenticator for realm
'mesos-agent-readwrite'
I0224 01:49:39.404642 27111 slave.cpp:541] Agent resources: cpus(*):2; mem(*):1024; disk(*):1024;
ports(*):[31000-32000]
I0224 01:49:39.404677 27111 slave.cpp:549] Agent attributes: [  ]
I0224 01:49:39.404682 27111 slave.cpp:554] Agent hostname: b4f684fdc995
I0224 01:49:39.404765 27109 status_update_manager.cpp:177] Pausing sending status updates
I0224 01:49:39.405113 27108 state.cpp:62] Recovering state from '/tmp/Endpoint_SlaveEndpointTest_NoAuthorizer_0_hl7t9o/meta'
I0224 01:49:39.405297 27108 status_update_manager.cpp:203] Recovering status update manager
I0224 01:49:39.405427 27099 containerizer.cpp:599] Recovering containerizer
I0224 01:49:39.406117 27104 provisioner.cpp:410] Provisioner recovery complete
I0224 01:49:39.406294 27109 slave.cpp:5559] Finished recovery
I0224 01:49:39.406735 27109 slave.cpp:5733] Querying resource estimator for oversubscribable
resources
I0224 01:49:39.406919 27098 slave.cpp:5747] Received oversubscribable resources {} from the
resource estimator
I0224 01:49:39.407927 27099 process.cpp:3704] Handling HTTP event for process 'slave(706)'
with path: '/slave(706)/monitor/statistics'
I0224 01:49:39.408372 27108 http.cpp:885] Authorizing principal 'test-principal' to GET the
'/monitor/statistics' endpoint
I0224 01:49:39.410017 27103 slave.cpp:803] Agent terminating
[       OK ] Endpoint/SlaveEndpointTest.NoAuthorizer/0 (43 ms)
[ RUN      ] Endpoint/SlaveEndpointTest.NoAuthorizer/1
I0224 01:49:39.451489 27097 containerizer.cpp:220] Using isolation: posix/cpu,posix/mem,filesystem/posix,network/cni
W0224 01:49:39.451982 27097 backend.cpp:76] Failed to create 'aufs' backend: AufsBackend requires
root privileges
W0224 01:49:39.452121 27097 backend.cpp:76] Failed to create 'bind' backend: BindBackend requires
root privileges
I0224 01:49:39.452199 27097 provisioner.cpp:249] Using default backend 'copy'
I0224 01:49:39.452988 27097 cluster.cpp:446] Creating default 'local' authorizer
I0224 01:49:39.453843 27100 slave.cpp:211] Mesos agent started on (707)@172.17.0.2:54254
I0224 01:49:39.453871 27100 slave.cpp:212] Flags at startup: --acls="" --appc_simple_discovery_uri_prefix="http://"
--appc_store_dir="/tmp/mesos/store/appc" --authenticate_http_readonly="true" --authenticate_http_readwrite="true"
--authenticatee="crammd5" --authentication_backoff_factor="1secs" --authorizer="local" --cgroups_cpu_enable_pids_and_tids_count="false"
--cgroups_enable_cfs="false" --cgroups_hierarchy="/sys/fs/cgroup" --cgroups_limit_swap="false"
--cgroups_root="mesos" --container_disk_watch_interval="15secs" --containerizers="mesos" --credential="/tmp/Endpoint_SlaveEndpointTest_NoAuthorizer_1_qqoDxN/credential"
--default_role="*" --disk_watch_interval="1mins" --docker="docker" --docker_kill_orphans="true"
--docker_registry="https://registry-1.docker.io" --docker_remove_delay="6hrs" --docker_socket="/var/run/docker.sock"
--docker_stop_timeout="0ns" --docker_store_dir="/tmp/mesos/store/docker" --docker_volume_checkpoint_dir="/var/run/mesos/isolators/docker/volume"
--enforce_container_disk_quota="false" --executor_registration_timeout="1mins" --executor_shutdown_grace_period="5secs"
--fetcher_cache_dir="/tmp/Endpoint_SlaveEndpointTest_NoAuthorizer_1_qqoDxN/fetch" --fetcher_cache_size="2GB"
--frameworks_home="" --gc_delay="1weeks" --gc_disk_headroom="0.1" --hadoop_home="" --help="false"
--hostname_lookup="true" --http_authenticators="basic" --http_command_executor="false" --http_credentials="/tmp/Endpoint_SlaveEndpointTest_NoAuthorizer_1_qqoDxN/http_credentials"
--http_heartbeat_interval="30secs" --initialize_driver_logging="true" --isolation="posix/cpu,posix/mem"
--launcher="posix" --launcher_dir="/mesos/build/src" --logbufsecs="0" --logging_level="INFO"
--max_completed_executors_per_framework="150" --oversubscribed_resources_interval="15secs"
--perf_duration="10secs" --perf_interval="1mins" --qos_correction_interval_min="0ns" --quiet="false"
--recover="reconnect" --recovery_timeout="15mins" --registration_backoff_factor="10ms" --resources="cpus:2;gpus:0;mem:1024;disk:1024;ports:[31000-32000]"
--revocable_cpu_low_priority="true" --runtime_dir="/tmp/Endpoint_SlaveEndpointTest_NoAuthorizer_1_qqoDxN"
--sandbox_directory="/mnt/mesos/sandbox" --strict="true" --switch_user="true" --systemd_enable_support="true"
--systemd_runtime_directory="/run/systemd/system" --version="false" --work_dir="/tmp/Endpoint_SlaveEndpointTest_NoAuthorizer_1_tDA7BI"
I0224 01:49:39.454311 27100 credentials.hpp:86] Loading credential for authentication from
'/tmp/Endpoint_SlaveEndpointTest_NoAuthorizer_1_qqoDxN/credential'
I0224 01:49:39.454432 27100 slave.cpp:354] Agent using credential for: test-principal
I0224 01:49:39.454443 27100 credentials.hpp:37] Loading credentials for authentication from
'/tmp/Endpoint_SlaveEndpointTest_NoAuthorizer_1_qqoDxN/http_credentials'
I0224 01:49:39.454557 27100 http.cpp:933] Using default 'basic' HTTP authenticator for realm
'mesos-agent-readonly'
I0224 01:49:39.454618 27100 http.cpp:933] Using default 'basic' HTTP authenticator for realm
'mesos-agent-readwrite'
I0224 01:49:39.455062 27100 slave.cpp:541] Agent resources: cpus(*):2; mem(*):1024; disk(*):1024;
ports(*):[31000-32000]
I0224 01:49:39.455103 27100 slave.cpp:549] Agent attributes: [  ]
I0224 01:49:39.455111 27100 slave.cpp:554] Agent hostname: b4f684fdc995
I0224 01:49:39.455319 27109 status_update_manager.cpp:177] Pausing sending status updates
I0224 01:49:39.455641 27109 state.cpp:62] Recovering state from '/tmp/Endpoint_SlaveEndpointTest_NoAuthorizer_1_tDA7BI/meta'
I0224 01:49:39.455798 27109 status_update_manager.cpp:203] Recovering status update manager
I0224 01:49:39.455888 27109 containerizer.cpp:599] Recovering containerizer
I0224 01:49:39.456493 27109 provisioner.cpp:410] Provisioner recovery complete
I0224 01:49:39.456676 27106 slave.cpp:5559] Finished recovery
I0224 01:49:39.457043 27106 slave.cpp:5733] Querying resource estimator for oversubscribable
resources
I0224 01:49:39.457178 27112 slave.cpp:5747] Received oversubscribable resources {} from the
resource estimator
I0224 01:49:39.459231 27099 process.cpp:3704] Handling HTTP event for process 'slave(707)'
with path: '/slave(707)/monitor/statistics.json'
I0224 01:49:39.459698 27100 http.cpp:885] Authorizing principal 'test-principal' to GET the
'/monitor/statistics.json' endpoint
I0224 01:49:39.461069 27107 slave.cpp:803] Agent terminating
[       OK ] Endpoint/SlaveEndpointTest.NoAuthorizer/1 (55 ms)
[ RUN      ] Endpoint/SlaveEndpointTest.NoAuthorizer/2
I0224 01:49:39.602097 27097 containerizer.cpp:220] Using isolation: posix/cpu,posix/mem,filesystem/posix,network/cni
W0224 01:49:39.602473 27097 backend.cpp:76] Failed to create 'aufs' backend: AufsBackend requires
root privileges
W0224 01:49:39.602517 27097 backend.cpp:76] Failed to create 'bind' backend: BindBackend requires
root privileges
I0224 01:49:39.602584 27097 provisioner.cpp:249] Using default backend 'copy'
I0224 01:49:39.603214 27097 cluster.cpp:446] Creating default 'local' authorizer
I0224 01:49:39.603925 27098 slave.cpp:211] Mesos agent started on (708)@172.17.0.2:54254
I0224 01:49:39.603945 27098 slave.cpp:212] Flags at startup: --acls="" --appc_simple_discovery_uri_prefix="http://"
--appc_store_dir="/tmp/mesos/store/appc" --authenticate_http_readonly="true" --authenticate_http_readwrite="true"
--authenticatee="crammd5" --authentication_backoff_factor="1secs" --authorizer="local" --cgroups_cpu_enable_pids_and_tids_count="false"
--cgroups_enable_cfs="false" --cgroups_hierarchy="/sys/fs/cgroup" --cgroups_limit_swap="false"
--cgroups_root="mesos" --container_disk_watch_interval="15secs" --containerizers="mesos" --credential="/tmp/Endpoint_SlaveEndpointTest_NoAuthorizer_2_Bje4r8/credential"
--default_role="*" --disk_watch_interval="1mins" --docker="docker" --docker_kill_orphans="true"
--docker_registry="https://registry-1.docker.io" --docker_remove_delay="6hrs" --docker_socket="/var/run/docker.sock"
--docker_stop_timeout="0ns" --docker_store_dir="/tmp/mesos/store/docker" --docker_volume_checkpoint_dir="/var/run/mesos/isolators/docker/volume"
--enforce_container_disk_quota="false" --executor_registration_timeout="1mins" --executor_shutdown_grace_period="5secs"
--fetcher_cache_dir="/tmp/Endpoint_SlaveEndpointTest_NoAuthorizer_2_Bje4r8/fetch" --fetcher_cache_size="2GB"
--frameworks_home="" --gc_delay="1weeks" --gc_disk_headroom="0.1" --hadoop_home="" --help="false"
--hostname_lookup="true" --http_authenticators="basic" --http_command_executor="false" --http_credentials="/tmp/Endpoint_SlaveEndpointTest_NoAuthorizer_2_Bje4r8/http_credentials"
--http_heartbeat_interval="30secs" --initialize_driver_logging="true" --isolation="posix/cpu,posix/mem"
--launcher="posix" --launcher_dir="/mesos/build/src" --logbufsecs="0" --logging_level="INFO"
--max_completed_executors_per_framework="150" --oversubscribed_resources_interval="15secs"
--perf_duration="10secs" --perf_interval="1mins" --qos_correction_interval_min="0ns" --quiet="false"
--recover="reconnect" --recovery_timeout="15mins" --registration_backoff_factor="10ms" --resources="cpus:2;gpus:0;mem:1024;disk:1024;ports:[31000-32000]"
--revocable_cpu_low_priority="true" --runtime_dir="/tmp/Endpoint_SlaveEndpointTest_NoAuthorizer_2_Bje4r8"
--sandbox_directory="/mnt/mesos/sandbox" --strict="true" --switch_user="true" --systemd_enable_support="true"
--systemd_runtime_directory="/run/systemd/system" --version="false" --work_dir="/tmp/Endpoint_SlaveEndpointTest_NoAuthorizer_2_wNT472"
I0224 01:49:39.604234 27098 credentials.hpp:86] Loading credential for authentication from
'/tmp/Endpoint_SlaveEndpointTest_NoAuthorizer_2_Bje4r8/credential'
I0224 01:49:39.604326 27098 slave.cpp:354] Agent using credential for: test-principal
I0224 01:49:39.604341 27098 credentials.hpp:37] Loading credentials for authentication from
'/tmp/Endpoint_SlaveEndpointTest_NoAuthorizer_2_Bje4r8/http_credentials'
I0224 01:49:39.604470 27098 http.cpp:933] Using default 'basic' HTTP authenticator for realm
'mesos-agent-readonly'
I0224 01:49:39.604533 27098 http.cpp:933] Using default 'basic' HTTP authenticator for realm
'mesos-agent-readwrite'
I0224 01:49:39.605000 27098 slave.cpp:541] Agent resources: cpus(*):2; mem(*):1024; disk(*):1024;
ports(*):[31000-32000]
I0224 01:49:39.605031 27098 slave.cpp:549] Agent attributes: [  ]
I0224 01:49:39.605036 27098 slave.cpp:554] Agent hostname: b4f684fdc995
I0224 01:49:39.605108 27108 status_update_manager.cpp:177] Pausing sending status updates
I0224 01:49:39.605428 27113 state.cpp:62] Recovering state from '/tmp/Endpoint_SlaveEndpointTest_NoAuthorizer_2_wNT472/meta'
I0224 01:49:39.605594 27107 status_update_manager.cpp:203] Recovering status update manager
I0224 01:49:39.605739 27101 containerizer.cpp:599] Recovering containerizer
I0224 01:49:39.606323 27101 provisioner.cpp:410] Provisioner recovery complete
I0224 01:49:39.606484 27101 slave.cpp:5559] Finished recovery
I0224 01:49:39.606844 27101 slave.cpp:5733] Querying resource estimator for oversubscribable
resources
I0224 01:49:39.607014 27101 slave.cpp:5747] Received oversubscribable resources {} from the
resource estimator
I0224 01:49:39.607813 27106 process.cpp:3704] Handling HTTP event for process 'slave(708)'
with path: '/slave(708)/containers'
I0224 01:49:39.608196 27106 http.cpp:885] Authorizing principal 'test-principal' to GET the
'/containers' endpoint
I0224 01:49:39.609354 27113 slave.cpp:803] Agent terminating
[       OK ] Endpoint/SlaveEndpointTest.NoAuthorizer/2 (12 ms)
[----------] 9 tests from Endpoint/SlaveEndpointTest (552 ms total)

[----------] Global test environment tear-down
[==========] 1457 tests from 161 test cases ran. (525615 ms total)
[  PASSED  ] 1456 tests.
[  FAILED  ] 1 test, listed below:
[  FAILED  ] ContentType/AgentAPITest.LaunchNestedContainerSessionWithTTY/0, where GetParam()
= application/x-protobuf

 1 FAILED TEST
  YOU HAVE 12 DISABLED TESTS

make[3]: *** [CMakeFiles/check] Error 1
make[3]: Leaving directory `/mesos/build'
make[2]: *** [CMakeFiles/check.dir/all] Error 2
make[2]: Leaving directory `/mesos/build'
make[1]: *** [CMakeFiles/check.dir/rule] Error 2
make[1]: Leaving directory `/mesos/build'
make: *** [check] Error 2
+ docker rmi mesos-1487895814-29627
Untagged: mesos-1487895814-29627:latest
Deleted: sha256:c006993ac9ab63bb739326dd87fd0726183741a6bd4f378098504a6941b02d11
Deleted: sha256:0598c34c366f1a7e173e34fab50c86d8094f8e13908f813c339244c091a932f1
Deleted: sha256:f042494057683fffdc051fa5fd3275102ffba69019bc8e64b04a53911a3a31e5
Deleted: sha256:a9de809c545026704bb20d357b0d95982bf2052f7d20705027e122059ede5909
Deleted: sha256:403d0dfbb5774be2338c714dbeda89657c7fe490285c1836e1172331f8ccd8c4
Deleted: sha256:cd004a5dcd117062045086d92d549d1737573510b4c1b0fbc4598725349926d0
Deleted: sha256:57cabb0b19143c618279c303b0094067b2540ef8856b3dd2bfefa8d8826a775e
Deleted: sha256:9bf73bc3de8a5456e55234486dd10346ae38c66ca74e0b2bb5f77fff63401467
Deleted: sha256:f2e45884ef9ba012ca3d16ba415d83d0c16562048b8153a5cb6f397c58f0afec
Deleted: sha256:79a6db5416e54376561287d391b9130c15266ec92307f4c3ca34cfc50f37ce00
Deleted: sha256:274de8d185fd3c9789507e92393ba03c0d7cb503f076f559e5f4f029e3d43f7b
Deleted: sha256:cbd103f0fdee8b2e178ad483dda7fdc411c8f6bc851b117d8652cc782e876b01
Deleted: sha256:69b3dedf397a8514b1ff19f3f94b2c1feb70a0016571125da4ac98083edd6a0b
Deleted: sha256:b433326c767bdd70e5f66839b9b51240b6e457b6fff5572a54197f227fe4c893
Deleted: sha256:f71fe2c41e2a64f4a75d02467028acab5931a34b1bf46439f4e6e04bed392f19
Deleted: sha256:03b14995b62ae5bdfc2019bd0092f2b817d780fb31a297e0a7334fbd659ce8e5
Deleted: sha256:a263fbb5c33058214f23a094ce3f9e6f42c5857d0ef4316ccdd07fddf1f1f1b7
Deleted: sha256:7411655f0349356315b5e056042124f38f2c7a1c5163bb26ea8a30a3ab2d163d
Deleted: sha256:a44dd51b7998aea66bfc85c6e9a8cb406952ff9a2d58e068452c49039c138d31
Deleted: sha256:ea4b11b09d4b5e818b3658fb0726c3e47d1e411cff80e7d7e938e5f7d211ae01
Deleted: sha256:90af12f490076c21f254cbaa356aee5b99d94e12a0f00a14d978099c64b6afc9
Deleted: sha256:c03c5b99418a4bae653cc2dfed87ca5fafdec53be8a9df0b391d1df6de6eba57
Deleted: sha256:89d8de923f4079fb0dffbd8811d62807d6a21bd0448209e1005a9ce04af90be9
Deleted: sha256:aef050e6acee54a195c236ccca07d72cf550449597edba30bb5c51c00882b8e1
Build step 'Execute shell' marked build as failure

Mime
View raw message