mesos-builds mailing list archives

Site index · List index
Message view « Date » · « Thread »
Top « Date » · « Thread »
From Apache Jenkins Server <jenk...@builds.apache.org>
Subject Build failed in Jenkins: Mesos-Buildbot » autotools,gcc,--verbose,GLOG_v=1 MESOS_VERBOSE=1,centos:7,(docker||Hadoop)&&(!ubuntu-us1)&&(!ubuntu-eu2) #3322
Date Tue, 28 Feb 2017 21:13:57 GMT
See <https://builds.apache.org/job/Mesos-Buildbot/BUILDTOOL=autotools,COMPILER=gcc,CONFIGURATION=--verbose,ENVIRONMENT=GLOG_v=1%20MESOS_VERBOSE=1,OS=centos%3A7,label_exp=(docker%7C%7CHadoop)&&(!ubuntu-us1)&&(!ubuntu-eu2)/3322/display/redirect?page=changes>

Changes:

[neil.conway] Relax perf version check for Arch Linux.

------------------------------------------
[...truncated 25.58 MB...]
I0228 21:13:48.727049 31448 containerizer.cpp:599] Recovering containerizer
I0228 21:13:48.729024 31460 provisioner.cpp:410] Provisioner recovery complete
I0228 21:13:48.729630 31459 slave.cpp:5559] Finished recovery
I0228 21:13:48.730252 31459 slave.cpp:5733] Querying resource estimator for oversubscribable
resources
I0228 21:13:48.730556 31455 slave.cpp:5747] Received oversubscribable resources {} from the
resource estimator
I0228 21:13:48.732873 31455 process.cpp:3704] Handling HTTP event for process 'slave(702)'
with path: '/slave(702)/monitor/statistics.json'
I0228 21:13:48.734392 31448 http.cpp:885] Authorizing principal 'test-principal' to GET the
'/monitor/statistics.json' endpoint
I0228 21:13:48.738410 31460 slave.cpp:803] Agent terminating
[       OK ] Endpoint/SlaveEndpointTest.AuthorizedRequest/1 (34 ms)
[ RUN      ] Endpoint/SlaveEndpointTest.AuthorizedRequest/2
I0228 21:13:48.749912 31426 containerizer.cpp:220] Using isolation: posix/cpu,posix/mem,filesystem/posix,network/cni
W0228 21:13:48.750499 31426 backend.cpp:76] Failed to create 'aufs' backend: AufsBackend requires
root privileges
W0228 21:13:48.750613 31426 backend.cpp:76] Failed to create 'bind' backend: BindBackend requires
root privileges
I0228 21:13:48.750654 31426 provisioner.cpp:249] Using default backend 'copy'
I0228 21:13:48.754365 31459 slave.cpp:211] Mesos agent started on (703)@172.17.0.2:41970
I0228 21:13:48.754391 31459 slave.cpp:212] Flags at startup: --acls="" --appc_simple_discovery_uri_prefix="http://"
--appc_store_dir="/tmp/mesos/store/appc" --authenticate_http_readonly="true" --authenticate_http_readwrite="true"
--authenticatee="crammd5" --authentication_backoff_factor="1secs" --authorizer="local" --cgroups_cpu_enable_pids_and_tids_count="false"
--cgroups_enable_cfs="false" --cgroups_hierarchy="/sys/fs/cgroup" --cgroups_limit_swap="false"
--cgroups_root="mesos" --container_disk_watch_interval="15secs" --containerizers="mesos" --credential="/tmp/Endpoint_SlaveEndpointTest_AuthorizedRequest_2_wexz42/credential"
--default_role="*" --disk_watch_interval="1mins" --docker="docker" --docker_kill_orphans="true"
--docker_registry="https://registry-1.docker.io" --docker_remove_delay="6hrs" --docker_socket="/var/run/docker.sock"
--docker_stop_timeout="0ns" --docker_store_dir="/tmp/mesos/store/docker" --docker_volume_checkpoint_dir="/var/run/mesos/isolators/docker/volume"
--enforce_container_disk_quota="false" --executor_registration_timeout="1mins" --executor_shutdown_grace_period="5secs"
--fetcher_cache_dir="/tmp/Endpoint_SlaveEndpointTest_AuthorizedRequest_2_wexz42/fetch" --fetcher_cache_size="2GB"
--frameworks_home="" --gc_delay="1weeks" --gc_disk_headroom="0.1" --hadoop_home="" --help="false"
--hostname_lookup="true" --http_authenticators="basic" --http_command_executor="false" --http_credentials="/tmp/Endpoint_SlaveEndpointTest_AuthorizedRequest_2_wexz42/http_credentials"
--http_heartbeat_interval="30secs" --initialize_driver_logging="true" --isolation="posix/cpu,posix/mem"
--launcher="posix" --launcher_dir="/mesos/mesos-1.3.0/_build/src" --logbufsecs="0" --logging_level="INFO"
--max_completed_executors_per_framework="150" --oversubscribed_resources_interval="15secs"
--perf_duration="10secs" --perf_interval="1mins" --qos_correction_interval_min="0ns" --quiet="false"
--recover="reconnect" --recovery_timeout="15mins" --registration_backoff_factor="10ms" --resources="cpus:2;gpus:0;mem:1024;disk:1024;ports:[31000-32000]"
--revocable_cpu_low_priority="true" --runtime_dir="/tmp/Endpoint_SlaveEndpointTest_AuthorizedRequest_2_wexz42"
--sandbox_directory="/mnt/mesos/sandbox" --strict="true" --switch_user="true" --systemd_enable_support="true"
--systemd_runtime_directory="/run/systemd/system" --version="false" --work_dir="/tmp/Endpoint_SlaveEndpointTest_AuthorizedRequest_2_G19QZq"
I0228 21:13:48.754884 31459 credentials.hpp:86] Loading credential for authentication from
'/tmp/Endpoint_SlaveEndpointTest_AuthorizedRequest_2_wexz42/credential'
I0228 21:13:48.755029 31459 slave.cpp:354] Agent using credential for: test-principal
I0228 21:13:48.755053 31459 credentials.hpp:37] Loading credentials for authentication from
'/tmp/Endpoint_SlaveEndpointTest_AuthorizedRequest_2_wexz42/http_credentials'
I0228 21:13:48.755300 31459 http.cpp:933] Using default 'basic' HTTP authenticator for realm
'mesos-agent-readonly'
I0228 21:13:48.755462 31459 http.cpp:933] Using default 'basic' HTTP authenticator for realm
'mesos-agent-readwrite'
I0228 21:13:48.757038 31459 slave.cpp:541] Agent resources: cpus(*):2; mem(*):1024; disk(*):1024;
ports(*):[31000-32000]
I0228 21:13:48.757151 31459 slave.cpp:549] Agent attributes: [  ]
I0228 21:13:48.757179 31459 slave.cpp:554] Agent hostname: d9e7b337b460
I0228 21:13:48.757347 31455 status_update_manager.cpp:177] Pausing sending status updates
I0228 21:13:48.759191 31456 state.cpp:62] Recovering state from '/tmp/Endpoint_SlaveEndpointTest_AuthorizedRequest_2_G19QZq/meta'
I0228 21:13:48.759526 31445 status_update_manager.cpp:203] Recovering status update manager
I0228 21:13:48.759863 31445 containerizer.cpp:599] Recovering containerizer
I0228 21:13:48.761488 31450 provisioner.cpp:410] Provisioner recovery complete
I0228 21:13:48.762023 31450 slave.cpp:5559] Finished recovery
I0228 21:13:48.762436 31450 slave.cpp:5733] Querying resource estimator for oversubscribable
resources
I0228 21:13:48.762662 31453 slave.cpp:5747] Received oversubscribable resources {} from the
resource estimator
I0228 21:13:48.764886 31447 process.cpp:3704] Handling HTTP event for process 'slave(703)'
with path: '/slave(703)/containers'
I0228 21:13:48.766835 31445 http.cpp:885] Authorizing principal 'test-principal' to GET the
'/containers' endpoint
I0228 21:13:48.772037 31460 slave.cpp:803] Agent terminating
[       OK ] Endpoint/SlaveEndpointTest.AuthorizedRequest/2 (33 ms)
[ RUN      ] Endpoint/SlaveEndpointTest.UnauthorizedRequest/0
I0228 21:13:48.783653 31426 containerizer.cpp:220] Using isolation: posix/cpu,posix/mem,filesystem/posix,network/cni
W0228 21:13:48.784303 31426 backend.cpp:76] Failed to create 'aufs' backend: AufsBackend requires
root privileges
W0228 21:13:48.784427 31426 backend.cpp:76] Failed to create 'bind' backend: BindBackend requires
root privileges
I0228 21:13:48.784469 31426 provisioner.cpp:249] Using default backend 'copy'
I0228 21:13:48.788422 31451 slave.cpp:211] Mesos agent started on (704)@172.17.0.2:41970
I0228 21:13:48.788458 31451 slave.cpp:212] Flags at startup: --acls="" --appc_simple_discovery_uri_prefix="http://"
--appc_store_dir="/tmp/mesos/store/appc" --authenticate_http_readonly="true" --authenticate_http_readwrite="true"
--authenticatee="crammd5" --authentication_backoff_factor="1secs" --authorizer="local" --cgroups_cpu_enable_pids_and_tids_count="false"
--cgroups_enable_cfs="false" --cgroups_hierarchy="/sys/fs/cgroup" --cgroups_limit_swap="false"
--cgroups_root="mesos" --container_disk_watch_interval="15secs" --containerizers="mesos" --credential="/tmp/Endpoint_SlaveEndpointTest_UnauthorizedRequest_0_QrFUFv/credential"
--default_role="*" --disk_watch_interval="1mins" --docker="docker" --docker_kill_orphans="true"
--docker_registry="https://registry-1.docker.io" --docker_remove_delay="6hrs" --docker_socket="/var/run/docker.sock"
--docker_stop_timeout="0ns" --docker_store_dir="/tmp/mesos/store/docker" --docker_volume_checkpoint_dir="/var/run/mesos/isolators/docker/volume"
--enforce_container_disk_quota="false" --executor_registration_timeout="1mins" --executor_shutdown_grace_period="5secs"
--fetcher_cache_dir="/tmp/Endpoint_SlaveEndpointTest_UnauthorizedRequest_0_QrFUFv/fetch" --fetcher_cache_size="2GB"
--frameworks_home="" --gc_delay="1weeks" --gc_disk_headroom="0.1" --hadoop_home="" --help="false"
--hostname_lookup="true" --http_authenticators="basic" --http_command_executor="false" --http_credentials="/tmp/Endpoint_SlaveEndpointTest_UnauthorizedRequest_0_QrFUFv/http_credentials"
--http_heartbeat_interval="30secs" --initialize_driver_logging="true" --isolation="posix/cpu,posix/mem"
--launcher="posix" --launcher_dir="/mesos/mesos-1.3.0/_build/src" --logbufsecs="0" --logging_level="INFO"
--max_completed_executors_per_framework="150" --oversubscribed_resources_interval="15secs"
--perf_duration="10secs" --perf_interval="1mins" --qos_correction_interval_min="0ns" --quiet="false"
--recover="reconnect" --recovery_timeout="15mins" --registration_backoff_factor="10ms" --resources="cpus:2;gpus:0;mem:1024;disk:1024;ports:[31000-32000]"
--revocable_cpu_low_priority="true" --runtime_dir="/tmp/Endpoint_SlaveEndpointTest_UnauthorizedRequest_0_QrFUFv"
--sandbox_directory="/mnt/mesos/sandbox" --strict="true" --switch_user="true" --systemd_enable_support="true"
--systemd_runtime_directory="/run/systemd/system" --version="false" --work_dir="/tmp/Endpoint_SlaveEndpointTest_UnauthorizedRequest_0_CjUIvT"
I0228 21:13:48.789156 31451 credentials.hpp:86] Loading credential for authentication from
'/tmp/Endpoint_SlaveEndpointTest_UnauthorizedRequest_0_QrFUFv/credential'
I0228 21:13:48.789351 31451 slave.cpp:354] Agent using credential for: test-principal
I0228 21:13:48.789383 31451 credentials.hpp:37] Loading credentials for authentication from
'/tmp/Endpoint_SlaveEndpointTest_UnauthorizedRequest_0_QrFUFv/http_credentials'
I0228 21:13:48.789718 31451 http.cpp:933] Using default 'basic' HTTP authenticator for realm
'mesos-agent-readonly'
I0228 21:13:48.789883 31451 http.cpp:933] Using default 'basic' HTTP authenticator for realm
'mesos-agent-readwrite'
I0228 21:13:48.791923 31451 slave.cpp:541] Agent resources: cpus(*):2; mem(*):1024; disk(*):1024;
ports(*):[31000-32000]
I0228 21:13:48.792035 31451 slave.cpp:549] Agent attributes: [  ]
I0228 21:13:48.792062 31451 slave.cpp:554] Agent hostname: d9e7b337b460
I0228 21:13:48.792294 31460 status_update_manager.cpp:177] Pausing sending status updates
I0228 21:13:48.793862 31460 state.cpp:62] Recovering state from '/tmp/Endpoint_SlaveEndpointTest_UnauthorizedRequest_0_CjUIvT/meta'
I0228 21:13:48.794279 31458 status_update_manager.cpp:203] Recovering status update manager
I0228 21:13:48.794631 31451 containerizer.cpp:599] Recovering containerizer
I0228 21:13:48.796556 31452 provisioner.cpp:410] Provisioner recovery complete
I0228 21:13:48.797122 31458 slave.cpp:5559] Finished recovery
I0228 21:13:48.797770 31458 slave.cpp:5733] Querying resource estimator for oversubscribable
resources
I0228 21:13:48.798058 31456 slave.cpp:5747] Received oversubscribable resources {} from the
resource estimator
I0228 21:13:48.800639 31460 process.cpp:3704] Handling HTTP event for process 'slave(704)'
with path: '/slave(704)/monitor/statistics'
I0228 21:13:48.802163 31449 http.cpp:885] Authorizing principal 'test-principal' to GET the
'/monitor/statistics' endpoint
I0228 21:13:48.805135 31426 slave.cpp:803] Agent terminating
[       OK ] Endpoint/SlaveEndpointTest.UnauthorizedRequest/0 (31 ms)
[ RUN      ] Endpoint/SlaveEndpointTest.UnauthorizedRequest/1
I0228 21:13:48.818641 31426 containerizer.cpp:220] Using isolation: posix/cpu,posix/mem,filesystem/posix,network/cni
W0228 21:13:48.819257 31426 backend.cpp:76] Failed to create 'aufs' backend: AufsBackend requires
root privileges
W0228 21:13:48.819375 31426 backend.cpp:76] Failed to create 'bind' backend: BindBackend requires
root privileges
I0228 21:13:48.819416 31426 provisioner.cpp:249] Using default backend 'copy'
I0228 21:13:48.822991 31454 slave.cpp:211] Mesos agent started on (705)@172.17.0.2:41970
I0228 21:13:48.823048 31454 slave.cpp:212] Flags at startup: --acls="" --appc_simple_discovery_uri_prefix="http://"
--appc_store_dir="/tmp/mesos/store/appc" --authenticate_http_readonly="true" --authenticate_http_readwrite="true"
--authenticatee="crammd5" --authentication_backoff_factor="1secs" --authorizer="local" --cgroups_cpu_enable_pids_and_tids_count="false"
--cgroups_enable_cfs="false" --cgroups_hierarchy="/sys/fs/cgroup" --cgroups_limit_swap="false"
--cgroups_root="mesos" --container_disk_watch_interval="15secs" --containerizers="mesos" --credential="/tmp/Endpoint_SlaveEndpointTest_UnauthorizedRequest_1_G4K0DY/credential"
--default_role="*" --disk_watch_interval="1mins" --docker="docker" --docker_kill_orphans="true"
--docker_registry="https://registry-1.docker.io" --docker_remove_delay="6hrs" --docker_socket="/var/run/docker.sock"
--docker_stop_timeout="0ns" --docker_store_dir="/tmp/mesos/store/docker" --docker_volume_checkpoint_dir="/var/run/mesos/isolators/docker/volume"
--enforce_container_disk_quota="false" --executor_registration_timeout="1mins" --executor_shutdown_grace_period="5secs"
--fetcher_cache_dir="/tmp/Endpoint_SlaveEndpointTest_UnauthorizedRequest_1_G4K0DY/fetch" --fetcher_cache_size="2GB"
--frameworks_home="" --gc_delay="1weeks" --gc_disk_headroom="0.1" --hadoop_home="" --help="false"
--hostname_lookup="true" --http_authenticators="basic" --http_command_executor="false" --http_credentials="/tmp/Endpoint_SlaveEndpointTest_UnauthorizedRequest_1_G4K0DY/http_credentials"
--http_heartbeat_interval="30secs" --initialize_driver_logging="true" --isolation="posix/cpu,posix/mem"
--launcher="posix" --launcher_dir="/mesos/mesos-1.3.0/_build/src" --logbufsecs="0" --logging_level="INFO"
--max_completed_executors_per_framework="150" --oversubscribed_resources_interval="15secs"
--perf_duration="10secs" --perf_interval="1mins" --qos_correction_interval_min="0ns" --quiet="false"
--recover="reconnect" --recovery_timeout="15mins" --registration_backoff_factor="10ms" --resources="cpus:2;gpus:0;mem:1024;disk:1024;ports:[31000-32000]"
--revocable_cpu_low_priority="true" --runtime_dir="/tmp/Endpoint_SlaveEndpointTest_UnauthorizedRequest_1_G4K0DY"
--sandbox_directory="/mnt/mesos/sandbox" --strict="true" --switch_user="true" --systemd_enable_support="true"
--systemd_runtime_directory="/run/systemd/system" --version="false" --work_dir="/tmp/Endpoint_SlaveEndpointTest_UnauthorizedRequest_1_4BX8nm"
I0228 21:13:48.823784 31454 credentials.hpp:86] Loading credential for authentication from
'/tmp/Endpoint_SlaveEndpointTest_UnauthorizedRequest_1_G4K0DY/credential'
I0228 21:13:48.823958 31454 slave.cpp:354] Agent using credential for: test-principal
I0228 21:13:48.823985 31454 credentials.hpp:37] Loading credentials for authentication from
'/tmp/Endpoint_SlaveEndpointTest_UnauthorizedRequest_1_G4K0DY/http_credentials'
I0228 21:13:48.824261 31454 http.cpp:933] Using default 'basic' HTTP authenticator for realm
'mesos-agent-readonly'
I0228 21:13:48.824422 31454 http.cpp:933] Using default 'basic' HTTP authenticator for realm
'mesos-agent-readwrite'
I0228 21:13:48.826382 31454 slave.cpp:541] Agent resources: cpus(*):2; mem(*):1024; disk(*):1024;
ports(*):[31000-32000]
I0228 21:13:48.826490 31454 slave.cpp:549] Agent attributes: [  ]
I0228 21:13:48.826508 31454 slave.cpp:554] Agent hostname: d9e7b337b460
I0228 21:13:48.826676 31445 status_update_manager.cpp:177] Pausing sending status updates
I0228 21:13:48.828124 31450 state.cpp:62] Recovering state from '/tmp/Endpoint_SlaveEndpointTest_UnauthorizedRequest_1_4BX8nm/meta'
I0228 21:13:48.828593 31448 status_update_manager.cpp:203] Recovering status update manager
I0228 21:13:48.828966 31449 containerizer.cpp:599] Recovering containerizer
I0228 21:13:48.830726 31447 provisioner.cpp:410] Provisioner recovery complete
I0228 21:13:48.831279 31457 slave.cpp:5559] Finished recovery
I0228 21:13:48.831849 31457 slave.cpp:5733] Querying resource estimator for oversubscribable
resources
I0228 21:13:48.833920 31445 slave.cpp:5747] Received oversubscribable resources {} from the
resource estimator
I0228 21:13:48.836726 31452 process.cpp:3704] Handling HTTP event for process 'slave(705)'
with path: '/slave(705)/monitor/statistics.json'
I0228 21:13:48.838176 31455 http.cpp:885] Authorizing principal 'test-principal' to GET the
'/monitor/statistics.json' endpoint
I0228 21:13:48.841233 31457 slave.cpp:803] Agent terminating
[       OK ] Endpoint/SlaveEndpointTest.UnauthorizedRequest/1 (34 ms)
[ RUN      ] Endpoint/SlaveEndpointTest.UnauthorizedRequest/2
I0228 21:13:48.853516 31426 containerizer.cpp:220] Using isolation: posix/cpu,posix/mem,filesystem/posix,network/cni
W0228 21:13:48.854152 31426 backend.cpp:76] Failed to create 'aufs' backend: AufsBackend requires
root privileges
W0228 21:13:48.854269 31426 backend.cpp:76] Failed to create 'bind' backend: BindBackend requires
root privileges
I0228 21:13:48.854346 31426 provisioner.cpp:249] Using default backend 'copy'
I0228 21:13:48.858144 31448 slave.cpp:211] Mesos agent started on (706)@172.17.0.2:41970
I0228 21:13:48.858175 31448 slave.cpp:212] Flags at startup: --acls="" --appc_simple_discovery_uri_prefix="http://"
--appc_store_dir="/tmp/mesos/store/appc" --authenticate_http_readonly="true" --authenticate_http_readwrite="true"
--authenticatee="crammd5" --authentication_backoff_factor="1secs" --authorizer="local" --cgroups_cpu_enable_pids_and_tids_count="false"
--cgroups_enable_cfs="false" --cgroups_hierarchy="/sys/fs/cgroup" --cgroups_limit_swap="false"
--cgroups_root="mesos" --container_disk_watch_interval="15secs" --containerizers="mesos" --credential="/tmp/Endpoint_SlaveEndpointTest_UnauthorizedRequest_2_YieCYr/credential"
--default_role="*" --disk_watch_interval="1mins" --docker="docker" --docker_kill_orphans="true"
--docker_registry="https://registry-1.docker.io" --docker_remove_delay="6hrs" --docker_socket="/var/run/docker.sock"
--docker_stop_timeout="0ns" --docker_store_dir="/tmp/mesos/store/docker" --docker_volume_checkpoint_dir="/var/run/mesos/isolators/docker/volume"
--enforce_container_disk_quota="false" --executor_registration_timeout="1mins" --executor_shutdown_grace_period="5secs"
--fetcher_cache_dir="/tmp/Endpoint_SlaveEndpointTest_UnauthorizedRequest_2_YieCYr/fetch" --fetcher_cache_size="2GB"
--frameworks_home="" --gc_delay="1weeks" --gc_disk_headroom="0.1" --hadoop_home="" --help="false"
--hostname_lookup="true" --http_authenticators="basic" --http_command_executor="false" --http_credentials="/tmp/Endpoint_SlaveEndpointTest_UnauthorizedRequest_2_YieCYr/http_credentials"
--http_heartbeat_interval="30secs" --initialize_driver_logging="true" --isolation="posix/cpu,posix/mem"
--launcher="posix" --launcher_dir="/mesos/mesos-1.3.0/_build/src" --logbufsecs="0" --logging_level="INFO"
--max_completed_executors_per_framework="150" --oversubscribed_resources_interval="15secs"
--perf_duration="10secs" --perf_interval="1mins" --qos_correction_interval_min="0ns" --quiet="false"
--recover="reconnect" --recovery_timeout="15mins" --registration_backoff_factor="10ms" --resources="cpus:2;gpus:0;mem:1024;disk:1024;ports:[31000-32000]"
--revocable_cpu_low_priority="true" --runtime_dir="/tmp/Endpoint_SlaveEndpointTest_UnauthorizedRequest_2_YieCYr"
--sandbox_directory="/mnt/mesos/sandbox" --strict="true" --switch_user="true" --systemd_enable_support="true"
--systemd_runtime_directory="/run/systemd/system" --version="false" --work_dir="/tmp/Endpoint_SlaveEndpointTest_UnauthorizedRequest_2_qEO5CP"
I0228 21:13:48.858897 31448 credentials.hpp:86] Loading credential for authentication from
'/tmp/Endpoint_SlaveEndpointTest_UnauthorizedRequest_2_YieCYr/credential'
I0228 21:13:48.859066 31448 slave.cpp:354] Agent using credential for: test-principal
I0228 21:13:48.859092 31448 credentials.hpp:37] Loading credentials for authentication from
'/tmp/Endpoint_SlaveEndpointTest_UnauthorizedRequest_2_YieCYr/http_credentials'
I0228 21:13:48.859360 31448 http.cpp:933] Using default 'basic' HTTP authenticator for realm
'mesos-agent-readonly'
I0228 21:13:48.859503 31448 http.cpp:933] Using default 'basic' HTTP authenticator for realm
'mesos-agent-readwrite'
I0228 21:13:48.861163 31448 slave.cpp:541] Agent resources: cpus(*):2; mem(*):1024; disk(*):1024;
ports(*):[31000-32000]
I0228 21:13:48.861268 31448 slave.cpp:549] Agent attributes: [  ]
I0228 21:13:48.861282 31448 slave.cpp:554] Agent hostname: d9e7b337b460
I0228 21:13:48.861475 31453 status_update_manager.cpp:177] Pausing sending status updates
I0228 21:13:48.863016 31451 state.cpp:62] Recovering state from '/tmp/Endpoint_SlaveEndpointTest_UnauthorizedRequest_2_qEO5CP/meta'
I0228 21:13:48.863353 31457 status_update_manager.cpp:203] Recovering status update manager
I0228 21:13:48.863592 31456 containerizer.cpp:599] Recovering containerizer
I0228 21:13:48.865401 31458 provisioner.cpp:410] Provisioner recovery complete
I0228 21:13:48.865985 31460 slave.cpp:5559] Finished recovery
I0228 21:13:48.866463 31460 slave.cpp:5733] Querying resource estimator for oversubscribable
resources
I0228 21:13:48.866773 31447 slave.cpp:5747] Received oversubscribable resources {} from the
resource estimator
I0228 21:13:48.869340 31452 process.cpp:3704] Handling HTTP event for process 'slave(706)'
with path: '/slave(706)/containers'
I0228 21:13:48.870785 31454 http.cpp:885] Authorizing principal 'test-principal' to GET the
'/containers' endpoint
I0228 21:13:48.873891 31452 slave.cpp:803] Agent terminating
[       OK ] Endpoint/SlaveEndpointTest.UnauthorizedRequest/2 (32 ms)
[ RUN      ] Endpoint/SlaveEndpointTest.NoAuthorizer/0
I0228 21:13:48.885903 31426 containerizer.cpp:220] Using isolation: posix/cpu,posix/mem,filesystem/posix,network/cni
W0228 21:13:48.886312 31426 backend.cpp:76] Failed to create 'aufs' backend: AufsBackend requires
root privileges
W0228 21:13:48.886395 31426 backend.cpp:76] Failed to create 'bind' backend: BindBackend requires
root privileges
I0228 21:13:48.886423 31426 provisioner.cpp:249] Using default backend 'copy'
I0228 21:13:48.887773 31426 cluster.cpp:446] Creating default 'local' authorizer
I0228 21:13:48.889127 31452 slave.cpp:211] Mesos agent started on (707)@172.17.0.2:41970
I0228 21:13:48.889153 31452 slave.cpp:212] Flags at startup: --acls="" --appc_simple_discovery_uri_prefix="http://"
--appc_store_dir="/tmp/mesos/store/appc" --authenticate_http_readonly="true" --authenticate_http_readwrite="true"
--authenticatee="crammd5" --authentication_backoff_factor="1secs" --authorizer="local" --cgroups_cpu_enable_pids_and_tids_count="false"
--cgroups_enable_cfs="false" --cgroups_hierarchy="/sys/fs/cgroup" --cgroups_limit_swap="false"
--cgroups_root="mesos" --container_disk_watch_interval="15secs" --containerizers="mesos" --credential="/tmp/Endpoint_SlaveEndpointTest_NoAuthorizer_0_wnBEEV/credential"
--default_role="*" --disk_watch_interval="1mins" --docker="docker" --docker_kill_orphans="true"
--docker_registry="https://registry-1.docker.io" --docker_remove_delay="6hrs" --docker_socket="/var/run/docker.sock"
--docker_stop_timeout="0ns" --docker_store_dir="/tmp/mesos/store/docker" --docker_volume_checkpoint_dir="/var/run/mesos/isolators/docker/volume"
--enforce_container_disk_quota="false" --executor_registration_timeout="1mins" --executor_shutdown_grace_period="5secs"
--fetcher_cache_dir="/tmp/Endpoint_SlaveEndpointTest_NoAuthorizer_0_wnBEEV/fetch" --fetcher_cache_size="2GB"
--frameworks_home="" --gc_delay="1weeks" --gc_disk_headroom="0.1" --hadoop_home="" --help="false"
--hostname_lookup="true" --http_authenticators="basic" --http_command_executor="false" --http_credentials="/tmp/Endpoint_SlaveEndpointTest_NoAuthorizer_0_wnBEEV/http_credentials"
--http_heartbeat_interval="30secs" --initialize_driver_logging="true" --isolation="posix/cpu,posix/mem"
--launcher="posix" --launcher_dir="/mesos/mesos-1.3.0/_build/src" --logbufsecs="0" --logging_level="INFO"
--max_completed_executors_per_framework="150" --oversubscribed_resources_interval="15secs"
--perf_duration="10secs" --perf_interval="1mins" --qos_correction_interval_min="0ns" --quiet="false"
--recover="reconnect" --recovery_timeout="15mins" --registration_backoff_factor="10ms" --resources="cpus:2;gpus:0;mem:1024;disk:1024;ports:[31000-32000]"
--revocable_cpu_low_priority="true" --runtime_dir="/tmp/Endpoint_SlaveEndpointTest_NoAuthorizer_0_wnBEEV"
--sandbox_directory="/mnt/mesos/sandbox" --strict="true" --switch_user="true" --systemd_enable_support="true"
--systemd_runtime_directory="/run/systemd/system" --version="false" --work_dir="/tmp/Endpoint_SlaveEndpointTest_NoAuthorizer_0_yYiSdj"
I0228 21:13:48.889757 31452 credentials.hpp:86] Loading credential for authentication from
'/tmp/Endpoint_SlaveEndpointTest_NoAuthorizer_0_wnBEEV/credential'
I0228 21:13:48.889889 31452 slave.cpp:354] Agent using credential for: test-principal
I0228 21:13:48.889909 31452 credentials.hpp:37] Loading credentials for authentication from
'/tmp/Endpoint_SlaveEndpointTest_NoAuthorizer_0_wnBEEV/http_credentials'
I0228 21:13:48.890110 31452 http.cpp:933] Using default 'basic' HTTP authenticator for realm
'mesos-agent-readonly'
I0228 21:13:48.890240 31452 http.cpp:933] Using default 'basic' HTTP authenticator for realm
'mesos-agent-readwrite'
I0228 21:13:48.891402 31452 slave.cpp:541] Agent resources: cpus(*):2; mem(*):1024; disk(*):1024;
ports(*):[31000-32000]
I0228 21:13:48.891479 31452 slave.cpp:549] Agent attributes: [  ]
I0228 21:13:48.891499 31452 slave.cpp:554] Agent hostname: d9e7b337b460
I0228 21:13:48.891640 31460 status_update_manager.cpp:177] Pausing sending status updates
I0228 21:13:48.892772 31459 state.cpp:62] Recovering state from '/tmp/Endpoint_SlaveEndpointTest_NoAuthorizer_0_yYiSdj/meta'
I0228 21:13:48.893033 31448 status_update_manager.cpp:203] Recovering status update manager
I0228 21:13:48.893251 31456 containerizer.cpp:599] Recovering containerizer
I0228 21:13:48.894925 31459 provisioner.cpp:410] Provisioner recovery complete
I0228 21:13:48.895411 31448 slave.cpp:5559] Finished recovery
I0228 21:13:48.895920 31448 slave.cpp:5733] Querying resource estimator for oversubscribable
resources
I0228 21:13:48.896247 31449 slave.cpp:5747] Received oversubscribable resources {} from the
resource estimator
I0228 21:13:48.898810 31452 process.cpp:3704] Handling HTTP event for process 'slave(707)'
with path: '/slave(707)/monitor/statistics'
I0228 21:13:48.900311 31456 http.cpp:885] Authorizing principal 'test-principal' to GET the
'/monitor/statistics' endpoint
I0228 21:13:48.904495 31452 slave.cpp:803] Agent terminating
[       OK ] Endpoint/SlaveEndpointTest.NoAuthorizer/0 (29 ms)
[ RUN      ] Endpoint/SlaveEndpointTest.NoAuthorizer/1
I0228 21:13:48.916324 31426 containerizer.cpp:220] Using isolation: posix/cpu,posix/mem,filesystem/posix,network/cni
W0228 21:13:48.916949 31426 backend.cpp:76] Failed to create 'aufs' backend: AufsBackend requires
root privileges
W0228 21:13:48.917068 31426 backend.cpp:76] Failed to create 'bind' backend: BindBackend requires
root privileges
I0228 21:13:48.917109 31426 provisioner.cpp:249] Using default backend 'copy'
I0228 21:13:48.919313 31426 cluster.cpp:446] Creating default 'local' authorizer
I0228 21:13:48.921320 31448 slave.cpp:211] Mesos agent started on (708)@172.17.0.2:41970
I0228 21:13:48.921345 31448 slave.cpp:212] Flags at startup: --acls="" --appc_simple_discovery_uri_prefix="http://"
--appc_store_dir="/tmp/mesos/store/appc" --authenticate_http_readonly="true" --authenticate_http_readwrite="true"
--authenticatee="crammd5" --authentication_backoff_factor="1secs" --authorizer="local" --cgroups_cpu_enable_pids_and_tids_count="false"
--cgroups_enable_cfs="false" --cgroups_hierarchy="/sys/fs/cgroup" --cgroups_limit_swap="false"
--cgroups_root="mesos" --container_disk_watch_interval="15secs" --containerizers="mesos" --credential="/tmp/Endpoint_SlaveEndpointTest_NoAuthorizer_1_0IscEp/credential"
--default_role="*" --disk_watch_interval="1mins" --docker="docker" --docker_kill_orphans="true"
--docker_registry="https://registry-1.docker.io" --docker_remove_delay="6hrs" --docker_socket="/var/run/docker.sock"
--docker_stop_timeout="0ns" --docker_store_dir="/tmp/mesos/store/docker" --docker_volume_checkpoint_dir="/var/run/mesos/isolators/docker/volume"
--enforce_container_disk_quota="false" --executor_registration_timeout="1mins" --executor_shutdown_grace_period="5secs"
--fetcher_cache_dir="/tmp/Endpoint_SlaveEndpointTest_NoAuthorizer_1_0IscEp/fetch" --fetcher_cache_size="2GB"
--frameworks_home="" --gc_delay="1weeks" --gc_disk_headroom="0.1" --hadoop_home="" --help="false"
--hostname_lookup="true" --http_authenticators="basic" --http_command_executor="false" --http_credentials="/tmp/Endpoint_SlaveEndpointTest_NoAuthorizer_1_0IscEp/http_credentials"
--http_heartbeat_interval="30secs" --initialize_driver_logging="true" --isolation="posix/cpu,posix/mem"
--launcher="posix" --launcher_dir="/mesos/mesos-1.3.0/_build/src" --logbufsecs="0" --logging_level="INFO"
--max_completed_executors_per_framework="150" --oversubscribed_resources_interval="15secs"
--perf_duration="10secs" --perf_interval="1mins" --qos_correction_interval_min="0ns" --quiet="false"
--recover="reconnect" --recovery_timeout="15mins" --registration_backoff_factor="10ms" --resources="cpus:2;gpus:0;mem:1024;disk:1024;ports:[31000-32000]"
--revocable_cpu_low_priority="true" --runtime_dir="/tmp/Endpoint_SlaveEndpointTest_NoAuthorizer_1_0IscEp"
--sandbox_directory="/mnt/mesos/sandbox" --strict="true" --switch_user="true" --systemd_enable_support="true"
--systemd_runtime_directory="/run/systemd/system" --version="false" --work_dir="/tmp/Endpoint_SlaveEndpointTest_NoAuthorizer_1_kBNv8M"
I0228 21:13:48.921908 31448 credentials.hpp:86] Loading credential for authentication from
'/tmp/Endpoint_SlaveEndpointTest_NoAuthorizer_1_0IscEp/credential'
I0228 21:13:48.922140 31448 slave.cpp:354] Agent using credential for: test-principal
I0228 21:13:48.922173 31448 credentials.hpp:37] Loading credentials for authentication from
'/tmp/Endpoint_SlaveEndpointTest_NoAuthorizer_1_0IscEp/http_credentials'
I0228 21:13:48.922466 31448 http.cpp:933] Using default 'basic' HTTP authenticator for realm
'mesos-agent-readonly'
I0228 21:13:48.922631 31448 http.cpp:933] Using default 'basic' HTTP authenticator for realm
'mesos-agent-readwrite'
I0228 21:13:48.924623 31448 slave.cpp:541] Agent resources: cpus(*):2; mem(*):1024; disk(*):1024;
ports(*):[31000-32000]
I0228 21:13:48.924734 31448 slave.cpp:549] Agent attributes: [  ]
I0228 21:13:48.924760 31448 slave.cpp:554] Agent hostname: d9e7b337b460
I0228 21:13:48.924962 31445 status_update_manager.cpp:177] Pausing sending status updates
I0228 21:13:48.926659 31454 state.cpp:62] Recovering state from '/tmp/Endpoint_SlaveEndpointTest_NoAuthorizer_1_kBNv8M/meta'
I0228 21:13:48.927181 31455 status_update_manager.cpp:203] Recovering status update manager
I0228 21:13:48.927479 31450 containerizer.cpp:599] Recovering containerizer
I0228 21:13:48.929421 31455 provisioner.cpp:410] Provisioner recovery complete
I0228 21:13:48.929905 31459 slave.cpp:5559] Finished recovery
I0228 21:13:48.930583 31459 slave.cpp:5733] Querying resource estimator for oversubscribable
resources
I0228 21:13:48.930989 31460 slave.cpp:5747] Received oversubscribable resources {} from the
resource estimator
I0228 21:13:48.933974 31445 process.cpp:3704] Handling HTTP event for process 'slave(708)'
with path: '/slave(708)/monitor/statistics.json'
I0228 21:13:48.935714 31454 http.cpp:885] Authorizing principal 'test-principal' to GET the
'/monitor/statistics.json' endpoint
I0228 21:13:48.941741 31452 slave.cpp:803] Agent terminating
[       OK ] Endpoint/SlaveEndpointTest.NoAuthorizer/1 (37 ms)
[ RUN      ] Endpoint/SlaveEndpointTest.NoAuthorizer/2
I0228 21:13:48.953883 31426 containerizer.cpp:220] Using isolation: posix/cpu,posix/mem,filesystem/posix,network/cni
W0228 21:13:48.954541 31426 backend.cpp:76] Failed to create 'aufs' backend: AufsBackend requires
root privileges
W0228 21:13:48.954654 31426 backend.cpp:76] Failed to create 'bind' backend: BindBackend requires
root privileges
I0228 21:13:48.954694 31426 provisioner.cpp:249] Using default backend 'copy'
I0228 21:13:48.956475 31426 cluster.cpp:446] Creating default 'local' authorizer
I0228 21:13:48.958279 31454 slave.cpp:211] Mesos agent started on (709)@172.17.0.2:41970
I0228 21:13:48.958297 31454 slave.cpp:212] Flags at startup: --acls="" --appc_simple_discovery_uri_prefix="http://"
--appc_store_dir="/tmp/mesos/store/appc" --authenticate_http_readonly="true" --authenticate_http_readwrite="true"
--authenticatee="crammd5" --authentication_backoff_factor="1secs" --authorizer="local" --cgroups_cpu_enable_pids_and_tids_count="false"
--cgroups_enable_cfs="false" --cgroups_hierarchy="/sys/fs/cgroup" --cgroups_limit_swap="false"
--cgroups_root="mesos" --container_disk_watch_interval="15secs" --containerizers="mesos" --credential="/tmp/Endpoint_SlaveEndpointTest_NoAuthorizer_2_UTeE1T/credential"
--default_role="*" --disk_watch_interval="1mins" --docker="docker" --docker_kill_orphans="true"
--docker_registry="https://registry-1.docker.io" --docker_remove_delay="6hrs" --docker_socket="/var/run/docker.sock"
--docker_stop_timeout="0ns" --docker_store_dir="/tmp/mesos/store/docker" --docker_volume_checkpoint_dir="/var/run/mesos/isolators/docker/volume"
--enforce_container_disk_quota="false" --executor_registration_timeout="1mins" --executor_shutdown_grace_period="5secs"
--fetcher_cache_dir="/tmp/Endpoint_SlaveEndpointTest_NoAuthorizer_2_UTeE1T/fetch" --fetcher_cache_size="2GB"
--frameworks_home="" --gc_delay="1weeks" --gc_disk_headroom="0.1" --hadoop_home="" --help="false"
--hostname_lookup="true" --http_authenticators="basic" --http_command_executor="false" --http_credentials="/tmp/Endpoint_SlaveEndpointTest_NoAuthorizer_2_UTeE1T/http_credentials"
--http_heartbeat_interval="30secs" --initialize_driver_logging="true" --isolation="posix/cpu,posix/mem"
--launcher="posix" --launcher_dir="/mesos/mesos-1.3.0/_build/src" --logbufsecs="0" --logging_level="INFO"
--max_completed_executors_per_framework="150" --oversubscribed_resources_interval="15secs"
--perf_duration="10secs" --perf_interval="1mins" --qos_correction_interval_min="0ns" --quiet="false"
--recover="reconnect" --recovery_timeout="15mins" --registration_backoff_factor="10ms" --resources="cpus:2;gpus:0;mem:1024;disk:1024;ports:[31000-32000]"
--revocable_cpu_low_priority="true" --runtime_dir="/tmp/Endpoint_SlaveEndpointTest_NoAuthorizer_2_UTeE1T"
--sandbox_directory="/mnt/mesos/sandbox" --strict="true" --switch_user="true" --systemd_enable_support="true"
--systemd_runtime_directory="/run/systemd/system" --version="false" --work_dir="/tmp/Endpoint_SlaveEndpointTest_NoAuthorizer_2_kYLRph"
I0228 21:13:48.958771 31454 credentials.hpp:86] Loading credential for authentication from
'/tmp/Endpoint_SlaveEndpointTest_NoAuthorizer_2_UTeE1T/credential'
I0228 21:13:48.958914 31454 slave.cpp:354] Agent using credential for: test-principal
I0228 21:13:48.958935 31454 credentials.hpp:37] Loading credentials for authentication from
'/tmp/Endpoint_SlaveEndpointTest_NoAuthorizer_2_UTeE1T/http_credentials'
I0228 21:13:48.959228 31454 http.cpp:933] Using default 'basic' HTTP authenticator for realm
'mesos-agent-readonly'
I0228 21:13:48.959399 31454 http.cpp:933] Using default 'basic' HTTP authenticator for realm
'mesos-agent-readwrite'
I0228 21:13:48.961143 31454 slave.cpp:541] Agent resources: cpus(*):2; mem(*):1024; disk(*):1024;
ports(*):[31000-32000]
I0228 21:13:48.961252 31454 slave.cpp:549] Agent attributes: [  ]
I0228 21:13:48.961271 31454 slave.cpp:554] Agent hostname: d9e7b337b460
I0228 21:13:48.961468 31460 status_update_manager.cpp:177] Pausing sending status updates
I0228 21:13:48.963042 31452 state.cpp:62] Recovering state from '/tmp/Endpoint_SlaveEndpointTest_NoAuthorizer_2_kYLRph/meta'
I0228 21:13:48.963621 31454 status_update_manager.cpp:203] Recovering status update manager
I0228 21:13:48.963932 31448 containerizer.cpp:599] Recovering containerizer
I0228 21:13:48.966020 31451 provisioner.cpp:410] Provisioner recovery complete
I0228 21:13:48.966609 31457 slave.cpp:5559] Finished recovery
I0228 21:13:48.967027 31457 slave.cpp:5733] Querying resource estimator for oversubscribable
resources
I0228 21:13:48.967365 31452 slave.cpp:5747] Received oversubscribable resources {} from the
resource estimator
I0228 21:13:48.970214 31460 process.cpp:3704] Handling HTTP event for process 'slave(709)'
with path: '/slave(709)/containers'
I0228 21:13:48.972070 31449 http.cpp:885] Authorizing principal 'test-principal' to GET the
'/containers' endpoint
I0228 21:13:48.976986 31448 slave.cpp:803] Agent terminating
[       OK ] Endpoint/SlaveEndpointTest.NoAuthorizer/2 (35 ms)
[----------] 9 tests from Endpoint/SlaveEndpointTest (314 ms total)

[----------] Global test environment tear-down
[==========] 1507 tests from 168 test cases ran. (602587 ms total)
[  PASSED  ] 1506 tests.
[  FAILED  ] 1 test, listed below:
[  FAILED  ] FaultToleranceTest.FrameworkReregister

 1 FAILED TEST
  YOU HAVE 12 DISABLED TESTS

make[4]: *** [check-local] Error 1
make[4]: Leaving directory `/mesos/mesos-1.3.0/_build/src'
make[3]: *** [check-am] Error 2
make[3]: Leaving directory `/mesos/mesos-1.3.0/_build/src'
make[2]: *** [check] Error 2
make[2]: Leaving directory `/mesos/mesos-1.3.0/_build/src'
make[1]: *** [check-recursive] Error 1
make[1]: Leaving directory `/mesos/mesos-1.3.0/_build'
make: *** [distcheck] Error 1
+ docker rmi mesos-1488313547-20586
Untagged: mesos-1488313547-20586:latest
Deleted: sha256:ed18d350e44496dd68eb980fdaf1d527cf1a8ad1fbd62008b45c102e2c4b2e36
Deleted: sha256:2c7bb6984e2f3f4f044d62b0c4471087a8dea5bb4211c8da2f254809cb63e318
Deleted: sha256:429fe422ff3b8090cc1bf38f933eac09cd483b12ef2e3dcbf98fd80bafb39594
Deleted: sha256:6ec844992fe149454e34efc22c19f456e85b16b1bbb2188ba4fd599759fd5dce
Deleted: sha256:e082cd6b541085eaa9d2b3509610c823267adfc5732ec57bbb9c83153ce5a644
Deleted: sha256:83823f83751c7be56050f31345fbaf8de9b20e865da6222fbefd328eef3af4f9
Deleted: sha256:94c09af6fc5dcc8b3b328346619fa2904097bc5cf9d1647b6fc4658f4a20570e
Deleted: sha256:5aaccf1ad7390d35efdd2f6919a0e034ccd857cf48a9515084aae2b7554ffcfb
Deleted: sha256:31f536c1cf2e6b744b0a5eac55935ee8b8c42811e785ecdee4b78e2e5f0493b8
Deleted: sha256:57d914927b5ec76027b1b7ae215c42dc0850bb9c2749daf042da35991b3b2b99
Deleted: sha256:3d691e92d9b1ddde649309c509b9bf1fe05e6e72e3e2ecddc6859499411b10d1
Deleted: sha256:07758598ff1e1efc2ec726047a993a597fef582451f1d6e75ee2bbff64c29b78
Deleted: sha256:4c5e331fce89504776dd33efe06bf04e8c733711f6d2b81a1821c3b1d6633ac8
Deleted: sha256:7e92e68bc053214ebfac30aa1608a0236c07fb3dacf7189beced870446f8c02d
Deleted: sha256:94bfb69c0b3363b3732f93b2a86124c9e86ccf7b2f694a1ba8597d21c56f7eae
Deleted: sha256:88d61965708e4296f91e87eba4dfcafaff8bc77011a4c5b89791769f938a888c
Deleted: sha256:8e893d1f53a1fddb80727c2a0384b7b2daca6218259852728111dd3bbbf2251d
Deleted: sha256:52f3527e7c670ffde543c32011f95ed96772042476c49d92eff7bf38720eea7c
Deleted: sha256:dbe82fafc0fb8f6bc10ad8071e6b991249686b4d06f46c099a6b110c95da80e7
Deleted: sha256:93491ca34bcfe39d520fcdc414c135481e1ca5b716f72281332791fec2d62e30
Deleted: sha256:aa12c4247852a64acc1e8cd492976cd2c28d999b57c3fea977b629e75ce10c9f
Deleted: sha256:a136137ac0664605d54ebfb0ba58e8f3eadc7a5919d1b219d7ebcf916e20cde5
Deleted: sha256:28ec2340292c23b5aa0a54dcc044ca427deaf760d29f9c8d7c1ade69ab133f64
Deleted: sha256:e12a80bd72d511ed078f12e11cec76a5529749e1f7b04d48b4586ea56dd504ff
Deleted: sha256:49dee0f98b746d1b0d1b4edbbd1ad575c7988de2f38ecf11929ff3fc85a5c34b
Build step 'Execute shell' marked build as failure

Mime
View raw message