mesos-builds mailing list archives

Site index · List index
Message view « Date » · « Thread »
Top « Date » · « Thread »
From Apache Jenkins Server <jenk...@builds.apache.org>
Subject Build failed in Jenkins: Mesos-Buildbot » cmake,gcc,--verbose --enable-libevent --enable-ssl,GLOG_v=1 MESOS_VERBOSE=1,ubuntu:14.04,(docker||Hadoop)&&(!ubuntu-us1)&&(!ubuntu-eu2) #3316
Date Tue, 28 Feb 2017 05:13:36 GMT
See <https://builds.apache.org/job/Mesos-Buildbot/BUILDTOOL=cmake,COMPILER=gcc,CONFIGURATION=--verbose%20--enable-libevent%20--enable-ssl,ENVIRONMENT=GLOG_v=1%20MESOS_VERBOSE=1,OS=ubuntu%3A14.04,label_exp=(docker%7C%7CHadoop)&&(!ubuntu-us1)&&(!ubuntu-eu2)/3316/display/redirect?page=changes>

Changes:

[bmahler] Clears timedout timers before marking the clock as settle.

------------------------------------------
[...truncated 24.39 MB...]
I0228 05:12:43.326992 27099 state.cpp:62] Recovering state from '/tmp/Endpoint_SlaveEndpointTest_AuthorizedRequest_1_Tq9qGN/meta'
I0228 05:12:43.327422 27099 status_update_manager.cpp:203] Recovering status update manager
I0228 05:12:43.327853 27110 containerizer.cpp:599] Recovering containerizer
I0228 05:12:43.328613 27100 provisioner.cpp:410] Provisioner recovery complete
I0228 05:12:43.328896 27110 slave.cpp:5559] Finished recovery
I0228 05:12:43.329272 27110 slave.cpp:5733] Querying resource estimator for oversubscribable
resources
I0228 05:12:43.329521 27101 slave.cpp:5747] Received oversubscribable resources {} from the
resource estimator
I0228 05:12:43.330468 27107 process.cpp:3704] Handling HTTP event for process 'slave(702)'
with path: '/slave(702)/monitor/statistics.json'
I0228 05:12:43.331127 27101 http.cpp:885] Authorizing principal 'test-principal' to GET the
'/monitor/statistics.json' endpoint
I0228 05:12:43.332466 27097 slave.cpp:803] Agent terminating
[       OK ] Endpoint/SlaveEndpointTest.AuthorizedRequest/1 (17 ms)
[ RUN      ] Endpoint/SlaveEndpointTest.AuthorizedRequest/2
I0228 05:12:43.370797 27097 containerizer.cpp:220] Using isolation: posix/cpu,posix/mem,filesystem/posix,network/cni
W0228 05:12:43.371054 27097 backend.cpp:76] Failed to create 'aufs' backend: AufsBackend requires
root privileges
W0228 05:12:43.371100 27097 backend.cpp:76] Failed to create 'bind' backend: BindBackend requires
root privileges
I0228 05:12:43.371114 27097 provisioner.cpp:249] Using default backend 'copy'
I0228 05:12:43.372210 27110 slave.cpp:211] Mesos agent started on (703)@172.17.0.2:40207
I0228 05:12:43.372237 27110 slave.cpp:212] Flags at startup: --acls="" --appc_simple_discovery_uri_prefix="http://"
--appc_store_dir="/tmp/mesos/store/appc" --authenticate_http_readonly="true" --authenticate_http_readwrite="true"
--authenticatee="crammd5" --authentication_backoff_factor="1secs" --authorizer="local" --cgroups_cpu_enable_pids_and_tids_count="false"
--cgroups_enable_cfs="false" --cgroups_hierarchy="/sys/fs/cgroup" --cgroups_limit_swap="false"
--cgroups_root="mesos" --container_disk_watch_interval="15secs" --containerizers="mesos" --credential="/tmp/Endpoint_SlaveEndpointTest_AuthorizedRequest_2_QiAYry/credential"
--default_role="*" --disk_watch_interval="1mins" --docker="docker" --docker_kill_orphans="true"
--docker_registry="https://registry-1.docker.io" --docker_remove_delay="6hrs" --docker_socket="/var/run/docker.sock"
--docker_stop_timeout="0ns" --docker_store_dir="/tmp/mesos/store/docker" --docker_volume_checkpoint_dir="/var/run/mesos/isolators/docker/volume"
--enforce_container_disk_quota="false" --executor_registration_timeout="1mins" --executor_shutdown_grace_period="5secs"
--fetcher_cache_dir="/tmp/Endpoint_SlaveEndpointTest_AuthorizedRequest_2_QiAYry/fetch" --fetcher_cache_size="2GB"
--frameworks_home="" --gc_delay="1weeks" --gc_disk_headroom="0.1" --hadoop_home="" --help="false"
--hostname_lookup="true" --http_authenticators="basic" --http_command_executor="false" --http_credentials="/tmp/Endpoint_SlaveEndpointTest_AuthorizedRequest_2_QiAYry/http_credentials"
--http_heartbeat_interval="30secs" --initialize_driver_logging="true" --isolation="posix/cpu,posix/mem"
--launcher="posix" --launcher_dir="/mesos/build/src" --logbufsecs="0" --logging_level="INFO"
--max_completed_executors_per_framework="150" --oversubscribed_resources_interval="15secs"
--perf_duration="10secs" --perf_interval="1mins" --qos_correction_interval_min="0ns" --quiet="false"
--recover="reconnect" --recovery_timeout="15mins" --registration_backoff_factor="10ms" --resources="cpus:2;gpus:0;mem:1024;disk:1024;ports:[31000-32000]"
--revocable_cpu_low_priority="true" --runtime_dir="/tmp/Endpoint_SlaveEndpointTest_AuthorizedRequest_2_QiAYry"
--sandbox_directory="/mnt/mesos/sandbox" --strict="true" --switch_user="true" --systemd_enable_support="true"
--systemd_runtime_directory="/run/systemd/system" --version="false" --work_dir="/tmp/Endpoint_SlaveEndpointTest_AuthorizedRequest_2_1zaSrB"
I0228 05:12:43.372666 27110 credentials.hpp:86] Loading credential for authentication from
'/tmp/Endpoint_SlaveEndpointTest_AuthorizedRequest_2_QiAYry/credential'
I0228 05:12:43.372788 27110 slave.cpp:354] Agent using credential for: test-principal
I0228 05:12:43.372797 27110 credentials.hpp:37] Loading credentials for authentication from
'/tmp/Endpoint_SlaveEndpointTest_AuthorizedRequest_2_QiAYry/http_credentials'
I0228 05:12:43.372902 27110 http.cpp:933] Using default 'basic' HTTP authenticator for realm
'mesos-agent-readonly'
I0228 05:12:43.372966 27110 http.cpp:933] Using default 'basic' HTTP authenticator for realm
'mesos-agent-readwrite'
I0228 05:12:43.373347 27110 slave.cpp:541] Agent resources: cpus(*):2; mem(*):1024; disk(*):1024;
ports(*):[31000-32000]
I0228 05:12:43.373379 27110 slave.cpp:549] Agent attributes: [  ]
I0228 05:12:43.373384 27110 slave.cpp:554] Agent hostname: 611ba5eda876
I0228 05:12:43.373451 27102 status_update_manager.cpp:177] Pausing sending status updates
I0228 05:12:43.373751 27102 state.cpp:62] Recovering state from '/tmp/Endpoint_SlaveEndpointTest_AuthorizedRequest_2_1zaSrB/meta'
I0228 05:12:43.373930 27107 status_update_manager.cpp:203] Recovering status update manager
I0228 05:12:43.374111 27112 containerizer.cpp:599] Recovering containerizer
I0228 05:12:43.374588 27112 provisioner.cpp:410] Provisioner recovery complete
I0228 05:12:43.374753 27112 slave.cpp:5559] Finished recovery
I0228 05:12:43.375143 27112 slave.cpp:5733] Querying resource estimator for oversubscribable
resources
I0228 05:12:43.375311 27112 slave.cpp:5747] Received oversubscribable resources {} from the
resource estimator
I0228 05:12:43.376173 27107 process.cpp:3704] Handling HTTP event for process 'slave(703)'
with path: '/slave(703)/containers'
I0228 05:12:43.376616 27108 http.cpp:885] Authorizing principal 'test-principal' to GET the
'/containers' endpoint
I0228 05:12:43.377887 27110 slave.cpp:803] Agent terminating
[       OK ] Endpoint/SlaveEndpointTest.AuthorizedRequest/2 (11 ms)
[ RUN      ] Endpoint/SlaveEndpointTest.UnauthorizedRequest/0
I0228 05:12:43.394083 27097 containerizer.cpp:220] Using isolation: posix/cpu,posix/mem,filesystem/posix,network/cni
W0228 05:12:43.394387 27097 backend.cpp:76] Failed to create 'aufs' backend: AufsBackend requires
root privileges
W0228 05:12:43.394431 27097 backend.cpp:76] Failed to create 'bind' backend: BindBackend requires
root privileges
I0228 05:12:43.394448 27097 provisioner.cpp:249] Using default backend 'copy'
I0228 05:12:43.395983 27100 slave.cpp:211] Mesos agent started on (704)@172.17.0.2:40207
I0228 05:12:43.396010 27100 slave.cpp:212] Flags at startup: --acls="" --appc_simple_discovery_uri_prefix="http://"
--appc_store_dir="/tmp/mesos/store/appc" --authenticate_http_readonly="true" --authenticate_http_readwrite="true"
--authenticatee="crammd5" --authentication_backoff_factor="1secs" --authorizer="local" --cgroups_cpu_enable_pids_and_tids_count="false"
--cgroups_enable_cfs="false" --cgroups_hierarchy="/sys/fs/cgroup" --cgroups_limit_swap="false"
--cgroups_root="mesos" --container_disk_watch_interval="15secs" --containerizers="mesos" --credential="/tmp/Endpoint_SlaveEndpointTest_UnauthorizedRequest_0_Y6xpEm/credential"
--default_role="*" --disk_watch_interval="1mins" --docker="docker" --docker_kill_orphans="true"
--docker_registry="https://registry-1.docker.io" --docker_remove_delay="6hrs" --docker_socket="/var/run/docker.sock"
--docker_stop_timeout="0ns" --docker_store_dir="/tmp/mesos/store/docker" --docker_volume_checkpoint_dir="/var/run/mesos/isolators/docker/volume"
--enforce_container_disk_quota="false" --executor_registration_timeout="1mins" --executor_shutdown_grace_period="5secs"
--fetcher_cache_dir="/tmp/Endpoint_SlaveEndpointTest_UnauthorizedRequest_0_Y6xpEm/fetch" --fetcher_cache_size="2GB"
--frameworks_home="" --gc_delay="1weeks" --gc_disk_headroom="0.1" --hadoop_home="" --help="false"
--hostname_lookup="true" --http_authenticators="basic" --http_command_executor="false" --http_credentials="/tmp/Endpoint_SlaveEndpointTest_UnauthorizedRequest_0_Y6xpEm/http_credentials"
--http_heartbeat_interval="30secs" --initialize_driver_logging="true" --isolation="posix/cpu,posix/mem"
--launcher="posix" --launcher_dir="/mesos/build/src" --logbufsecs="0" --logging_level="INFO"
--max_completed_executors_per_framework="150" --oversubscribed_resources_interval="15secs"
--perf_duration="10secs" --perf_interval="1mins" --qos_correction_interval_min="0ns" --quiet="false"
--recover="reconnect" --recovery_timeout="15mins" --registration_backoff_factor="10ms" --resources="cpus:2;gpus:0;mem:1024;disk:1024;ports:[31000-32000]"
--revocable_cpu_low_priority="true" --runtime_dir="/tmp/Endpoint_SlaveEndpointTest_UnauthorizedRequest_0_Y6xpEm"
--sandbox_directory="/mnt/mesos/sandbox" --strict="true" --switch_user="true" --systemd_enable_support="true"
--systemd_runtime_directory="/run/systemd/system" --version="false" --work_dir="/tmp/Endpoint_SlaveEndpointTest_UnauthorizedRequest_0_nu0wAp"
I0228 05:12:43.396427 27100 credentials.hpp:86] Loading credential for authentication from
'/tmp/Endpoint_SlaveEndpointTest_UnauthorizedRequest_0_Y6xpEm/credential'
I0228 05:12:43.396584 27100 slave.cpp:354] Agent using credential for: test-principal
I0228 05:12:43.396595 27100 credentials.hpp:37] Loading credentials for authentication from
'/tmp/Endpoint_SlaveEndpointTest_UnauthorizedRequest_0_Y6xpEm/http_credentials'
I0228 05:12:43.396702 27100 http.cpp:933] Using default 'basic' HTTP authenticator for realm
'mesos-agent-readonly'
I0228 05:12:43.396737 27100 http.cpp:933] Using default 'basic' HTTP authenticator for realm
'mesos-agent-readwrite'
I0228 05:12:43.397083 27100 slave.cpp:541] Agent resources: cpus(*):2; mem(*):1024; disk(*):1024;
ports(*):[31000-32000]
I0228 05:12:43.397127 27100 slave.cpp:549] Agent attributes: [  ]
I0228 05:12:43.397136 27100 slave.cpp:554] Agent hostname: 611ba5eda876
I0228 05:12:43.397485 27100 status_update_manager.cpp:177] Pausing sending status updates
I0228 05:12:43.397661 27100 state.cpp:62] Recovering state from '/tmp/Endpoint_SlaveEndpointTest_UnauthorizedRequest_0_nu0wAp/meta'
I0228 05:12:43.397783 27100 status_update_manager.cpp:203] Recovering status update manager
I0228 05:12:43.397830 27100 containerizer.cpp:599] Recovering containerizer
I0228 05:12:43.398197 27100 provisioner.cpp:410] Provisioner recovery complete
I0228 05:12:43.398293 27100 slave.cpp:5559] Finished recovery
I0228 05:12:43.398655 27100 slave.cpp:5733] Querying resource estimator for oversubscribable
resources
I0228 05:12:43.398807 27100 slave.cpp:5747] Received oversubscribable resources {} from the
resource estimator
I0228 05:12:43.399775 27113 process.cpp:3704] Handling HTTP event for process 'slave(704)'
with path: '/slave(704)/monitor/statistics'
I0228 05:12:43.400311 27110 http.cpp:885] Authorizing principal 'test-principal' to GET the
'/monitor/statistics' endpoint
I0228 05:12:43.401500 27097 slave.cpp:803] Agent terminating
[       OK ] Endpoint/SlaveEndpointTest.UnauthorizedRequest/0 (50 ms)
[ RUN      ] Endpoint/SlaveEndpointTest.UnauthorizedRequest/1
I0228 05:12:43.444953 27097 containerizer.cpp:220] Using isolation: posix/cpu,posix/mem,filesystem/posix,network/cni
W0228 05:12:43.445300 27097 backend.cpp:76] Failed to create 'aufs' backend: AufsBackend requires
root privileges
W0228 05:12:43.445340 27097 backend.cpp:76] Failed to create 'bind' backend: BindBackend requires
root privileges
I0228 05:12:43.445356 27097 provisioner.cpp:249] Using default backend 'copy'
I0228 05:12:43.446527 27110 slave.cpp:211] Mesos agent started on (705)@172.17.0.2:40207
I0228 05:12:43.446547 27110 slave.cpp:212] Flags at startup: --acls="" --appc_simple_discovery_uri_prefix="http://"
--appc_store_dir="/tmp/mesos/store/appc" --authenticate_http_readonly="true" --authenticate_http_readwrite="true"
--authenticatee="crammd5" --authentication_backoff_factor="1secs" --authorizer="local" --cgroups_cpu_enable_pids_and_tids_count="false"
--cgroups_enable_cfs="false" --cgroups_hierarchy="/sys/fs/cgroup" --cgroups_limit_swap="false"
--cgroups_root="mesos" --container_disk_watch_interval="15secs" --containerizers="mesos" --credential="/tmp/Endpoint_SlaveEndpointTest_UnauthorizedRequest_1_i6Edjb/credential"
--default_role="*" --disk_watch_interval="1mins" --docker="docker" --docker_kill_orphans="true"
--docker_registry="https://registry-1.docker.io" --docker_remove_delay="6hrs" --docker_socket="/var/run/docker.sock"
--docker_stop_timeout="0ns" --docker_store_dir="/tmp/mesos/store/docker" --docker_volume_checkpoint_dir="/var/run/mesos/isolators/docker/volume"
--enforce_container_disk_quota="false" --executor_registration_timeout="1mins" --executor_shutdown_grace_period="5secs"
--fetcher_cache_dir="/tmp/Endpoint_SlaveEndpointTest_UnauthorizedRequest_1_i6Edjb/fetch" --fetcher_cache_size="2GB"
--frameworks_home="" --gc_delay="1weeks" --gc_disk_headroom="0.1" --hadoop_home="" --help="false"
--hostname_lookup="true" --http_authenticators="basic" --http_command_executor="false" --http_credentials="/tmp/Endpoint_SlaveEndpointTest_UnauthorizedRequest_1_i6Edjb/http_credentials"
--http_heartbeat_interval="30secs" --initialize_driver_logging="true" --isolation="posix/cpu,posix/mem"
--launcher="posix" --launcher_dir="/mesos/build/src" --logbufsecs="0" --logging_level="INFO"
--max_completed_executors_per_framework="150" --oversubscribed_resources_interval="15secs"
--perf_duration="10secs" --perf_interval="1mins" --qos_correction_interval_min="0ns" --quiet="false"
--recover="reconnect" --recovery_timeout="15mins" --registration_backoff_factor="10ms" --resources="cpus:2;gpus:0;mem:1024;disk:1024;ports:[31000-32000]"
--revocable_cpu_low_priority="true" --runtime_dir="/tmp/Endpoint_SlaveEndpointTest_UnauthorizedRequest_1_i6Edjb"
--sandbox_directory="/mnt/mesos/sandbox" --strict="true" --switch_user="true" --systemd_enable_support="true"
--systemd_runtime_directory="/run/systemd/system" --version="false" --work_dir="/tmp/Endpoint_SlaveEndpointTest_UnauthorizedRequest_1_xCT86d"
I0228 05:12:43.446935 27110 credentials.hpp:86] Loading credential for authentication from
'/tmp/Endpoint_SlaveEndpointTest_UnauthorizedRequest_1_i6Edjb/credential'
I0228 05:12:43.447016 27110 slave.cpp:354] Agent using credential for: test-principal
I0228 05:12:43.447026 27110 credentials.hpp:37] Loading credentials for authentication from
'/tmp/Endpoint_SlaveEndpointTest_UnauthorizedRequest_1_i6Edjb/http_credentials'
I0228 05:12:43.447111 27110 http.cpp:933] Using default 'basic' HTTP authenticator for realm
'mesos-agent-readonly'
I0228 05:12:43.447152 27110 http.cpp:933] Using default 'basic' HTTP authenticator for realm
'mesos-agent-readwrite'
I0228 05:12:43.447546 27110 slave.cpp:541] Agent resources: cpus(*):2; mem(*):1024; disk(*):1024;
ports(*):[31000-32000]
I0228 05:12:43.447576 27110 slave.cpp:549] Agent attributes: [  ]
I0228 05:12:43.447582 27110 slave.cpp:554] Agent hostname: 611ba5eda876
I0228 05:12:43.447669 27108 status_update_manager.cpp:177] Pausing sending status updates
I0228 05:12:43.447949 27110 state.cpp:62] Recovering state from '/tmp/Endpoint_SlaveEndpointTest_UnauthorizedRequest_1_xCT86d/meta'
I0228 05:12:43.448148 27106 status_update_manager.cpp:203] Recovering status update manager
I0228 05:12:43.448340 27106 containerizer.cpp:599] Recovering containerizer
I0228 05:12:43.449075 27101 provisioner.cpp:410] Provisioner recovery complete
I0228 05:12:43.449232 27113 slave.cpp:5559] Finished recovery
I0228 05:12:43.449622 27113 slave.cpp:5733] Querying resource estimator for oversubscribable
resources
I0228 05:12:43.449713 27103 slave.cpp:5747] Received oversubscribable resources {} from the
resource estimator
I0228 05:12:43.450894 27101 process.cpp:3704] Handling HTTP event for process 'slave(705)'
with path: '/slave(705)/monitor/statistics.json'
I0228 05:12:43.451342 27102 http.cpp:885] Authorizing principal 'test-principal' to GET the
'/monitor/statistics.json' endpoint
I0228 05:12:43.452445 27098 slave.cpp:803] Agent terminating
[       OK ] Endpoint/SlaveEndpointTest.UnauthorizedRequest/1 (11 ms)
[ RUN      ] Endpoint/SlaveEndpointTest.UnauthorizedRequest/2
I0228 05:12:43.468052 27097 containerizer.cpp:220] Using isolation: posix/cpu,posix/mem,filesystem/posix,network/cni
W0228 05:12:43.468358 27097 backend.cpp:76] Failed to create 'aufs' backend: AufsBackend requires
root privileges
W0228 05:12:43.468400 27097 backend.cpp:76] Failed to create 'bind' backend: BindBackend requires
root privileges
I0228 05:12:43.468420 27097 provisioner.cpp:249] Using default backend 'copy'
I0228 05:12:43.469368 27110 slave.cpp:211] Mesos agent started on (706)@172.17.0.2:40207
I0228 05:12:43.469384 27110 slave.cpp:212] Flags at startup: --acls="" --appc_simple_discovery_uri_prefix="http://"
--appc_store_dir="/tmp/mesos/store/appc" --authenticate_http_readonly="true" --authenticate_http_readwrite="true"
--authenticatee="crammd5" --authentication_backoff_factor="1secs" --authorizer="local" --cgroups_cpu_enable_pids_and_tids_count="false"
--cgroups_enable_cfs="false" --cgroups_hierarchy="/sys/fs/cgroup" --cgroups_limit_swap="false"
--cgroups_root="mesos" --container_disk_watch_interval="15secs" --containerizers="mesos" --credential="/tmp/Endpoint_SlaveEndpointTest_UnauthorizedRequest_2_KKcPh0/credential"
--default_role="*" --disk_watch_interval="1mins" --docker="docker" --docker_kill_orphans="true"
--docker_registry="https://registry-1.docker.io" --docker_remove_delay="6hrs" --docker_socket="/var/run/docker.sock"
--docker_stop_timeout="0ns" --docker_store_dir="/tmp/mesos/store/docker" --docker_volume_checkpoint_dir="/var/run/mesos/isolators/docker/volume"
--enforce_container_disk_quota="false" --executor_registration_timeout="1mins" --executor_shutdown_grace_period="5secs"
--fetcher_cache_dir="/tmp/Endpoint_SlaveEndpointTest_UnauthorizedRequest_2_KKcPh0/fetch" --fetcher_cache_size="2GB"
--frameworks_home="" --gc_delay="1weeks" --gc_disk_headroom="0.1" --hadoop_home="" --help="false"
--hostname_lookup="true" --http_authenticators="basic" --http_command_executor="false" --http_credentials="/tmp/Endpoint_SlaveEndpointTest_UnauthorizedRequest_2_KKcPh0/http_credentials"
--http_heartbeat_interval="30secs" --initialize_driver_logging="true" --isolation="posix/cpu,posix/mem"
--launcher="posix" --launcher_dir="/mesos/build/src" --logbufsecs="0" --logging_level="INFO"
--max_completed_executors_per_framework="150" --oversubscribed_resources_interval="15secs"
--perf_duration="10secs" --perf_interval="1mins" --qos_correction_interval_min="0ns" --quiet="false"
--recover="reconnect" --recovery_timeout="15mins" --registration_backoff_factor="10ms" --resources="cpus:2;gpus:0;mem:1024;disk:1024;ports:[31000-32000]"
--revocable_cpu_low_priority="true" --runtime_dir="/tmp/Endpoint_SlaveEndpointTest_UnauthorizedRequest_2_KKcPh0"
--sandbox_directory="/mnt/mesos/sandbox" --strict="true" --switch_user="true" --systemd_enable_support="true"
--systemd_runtime_directory="/run/systemd/system" --version="false" --work_dir="/tmp/Endpoint_SlaveEndpointTest_UnauthorizedRequest_2_r3tV12"
I0228 05:12:43.469660 27110 credentials.hpp:86] Loading credential for authentication from
'/tmp/Endpoint_SlaveEndpointTest_UnauthorizedRequest_2_KKcPh0/credential'
I0228 05:12:43.469743 27110 slave.cpp:354] Agent using credential for: test-principal
I0228 05:12:43.469764 27110 credentials.hpp:37] Loading credentials for authentication from
'/tmp/Endpoint_SlaveEndpointTest_UnauthorizedRequest_2_KKcPh0/http_credentials'
I0228 05:12:43.469872 27110 http.cpp:933] Using default 'basic' HTTP authenticator for realm
'mesos-agent-readonly'
I0228 05:12:43.469923 27110 http.cpp:933] Using default 'basic' HTTP authenticator for realm
'mesos-agent-readwrite'
I0228 05:12:43.470305 27110 slave.cpp:541] Agent resources: cpus(*):2; mem(*):1024; disk(*):1024;
ports(*):[31000-32000]
I0228 05:12:43.470340 27110 slave.cpp:549] Agent attributes: [  ]
I0228 05:12:43.470348 27110 slave.cpp:554] Agent hostname: 611ba5eda876
I0228 05:12:43.470448 27108 status_update_manager.cpp:177] Pausing sending status updates
I0228 05:12:43.470758 27104 state.cpp:62] Recovering state from '/tmp/Endpoint_SlaveEndpointTest_UnauthorizedRequest_2_r3tV12/meta'
I0228 05:12:43.470893 27108 status_update_manager.cpp:203] Recovering status update manager
I0228 05:12:43.470973 27108 containerizer.cpp:599] Recovering containerizer
I0228 05:12:43.471444 27112 provisioner.cpp:410] Provisioner recovery complete
I0228 05:12:43.471614 27112 slave.cpp:5559] Finished recovery
I0228 05:12:43.471995 27112 slave.cpp:5733] Querying resource estimator for oversubscribable
resources
I0228 05:12:43.472118 27102 slave.cpp:5747] Received oversubscribable resources {} from the
resource estimator
I0228 05:12:43.473018 27107 process.cpp:3704] Handling HTTP event for process 'slave(706)'
with path: '/slave(706)/containers'
I0228 05:12:43.473414 27107 http.cpp:885] Authorizing principal 'test-principal' to GET the
'/containers' endpoint
I0228 05:12:43.474314 27099 slave.cpp:803] Agent terminating
[       OK ] Endpoint/SlaveEndpointTest.UnauthorizedRequest/2 (44 ms)
[ RUN      ] Endpoint/SlaveEndpointTest.NoAuthorizer/0
I0228 05:12:43.513231 27097 containerizer.cpp:220] Using isolation: posix/cpu,posix/mem,filesystem/posix,network/cni
W0228 05:12:43.513593 27097 backend.cpp:76] Failed to create 'aufs' backend: AufsBackend requires
root privileges
W0228 05:12:43.513628 27097 backend.cpp:76] Failed to create 'bind' backend: BindBackend requires
root privileges
I0228 05:12:43.513644 27097 provisioner.cpp:249] Using default backend 'copy'
I0228 05:12:43.514169 27097 cluster.cpp:446] Creating default 'local' authorizer
I0228 05:12:43.514875 27099 slave.cpp:211] Mesos agent started on (707)@172.17.0.2:40207
I0228 05:12:43.514902 27099 slave.cpp:212] Flags at startup: --acls="" --appc_simple_discovery_uri_prefix="http://"
--appc_store_dir="/tmp/mesos/store/appc" --authenticate_http_readonly="true" --authenticate_http_readwrite="true"
--authenticatee="crammd5" --authentication_backoff_factor="1secs" --authorizer="local" --cgroups_cpu_enable_pids_and_tids_count="false"
--cgroups_enable_cfs="false" --cgroups_hierarchy="/sys/fs/cgroup" --cgroups_limit_swap="false"
--cgroups_root="mesos" --container_disk_watch_interval="15secs" --containerizers="mesos" --credential="/tmp/Endpoint_SlaveEndpointTest_NoAuthorizer_0_sXKCFP/credential"
--default_role="*" --disk_watch_interval="1mins" --docker="docker" --docker_kill_orphans="true"
--docker_registry="https://registry-1.docker.io" --docker_remove_delay="6hrs" --docker_socket="/var/run/docker.sock"
--docker_stop_timeout="0ns" --docker_store_dir="/tmp/mesos/store/docker" --docker_volume_checkpoint_dir="/var/run/mesos/isolators/docker/volume"
--enforce_container_disk_quota="false" --executor_registration_timeout="1mins" --executor_shutdown_grace_period="5secs"
--fetcher_cache_dir="/tmp/Endpoint_SlaveEndpointTest_NoAuthorizer_0_sXKCFP/fetch" --fetcher_cache_size="2GB"
--frameworks_home="" --gc_delay="1weeks" --gc_disk_headroom="0.1" --hadoop_home="" --help="false"
--hostname_lookup="true" --http_authenticators="basic" --http_command_executor="false" --http_credentials="/tmp/Endpoint_SlaveEndpointTest_NoAuthorizer_0_sXKCFP/http_credentials"
--http_heartbeat_interval="30secs" --initialize_driver_logging="true" --isolation="posix/cpu,posix/mem"
--launcher="posix" --launcher_dir="/mesos/build/src" --logbufsecs="0" --logging_level="INFO"
--max_completed_executors_per_framework="150" --oversubscribed_resources_interval="15secs"
--perf_duration="10secs" --perf_interval="1mins" --qos_correction_interval_min="0ns" --quiet="false"
--recover="reconnect" --recovery_timeout="15mins" --registration_backoff_factor="10ms" --resources="cpus:2;gpus:0;mem:1024;disk:1024;ports:[31000-32000]"
--revocable_cpu_low_priority="true" --runtime_dir="/tmp/Endpoint_SlaveEndpointTest_NoAuthorizer_0_sXKCFP"
--sandbox_directory="/mnt/mesos/sandbox" --strict="true" --switch_user="true" --systemd_enable_support="true"
--systemd_runtime_directory="/run/systemd/system" --version="false" --work_dir="/tmp/Endpoint_SlaveEndpointTest_NoAuthorizer_0_nWlwiS"
I0228 05:12:43.515338 27099 credentials.hpp:86] Loading credential for authentication from
'/tmp/Endpoint_SlaveEndpointTest_NoAuthorizer_0_sXKCFP/credential'
I0228 05:12:43.515465 27099 slave.cpp:354] Agent using credential for: test-principal
I0228 05:12:43.515476 27099 credentials.hpp:37] Loading credentials for authentication from
'/tmp/Endpoint_SlaveEndpointTest_NoAuthorizer_0_sXKCFP/http_credentials'
I0228 05:12:43.515600 27099 http.cpp:933] Using default 'basic' HTTP authenticator for realm
'mesos-agent-readonly'
I0228 05:12:43.515658 27099 http.cpp:933] Using default 'basic' HTTP authenticator for realm
'mesos-agent-readwrite'
I0228 05:12:43.516108 27099 slave.cpp:541] Agent resources: cpus(*):2; mem(*):1024; disk(*):1024;
ports(*):[31000-32000]
I0228 05:12:43.516149 27099 slave.cpp:549] Agent attributes: [  ]
I0228 05:12:43.516155 27099 slave.cpp:554] Agent hostname: 611ba5eda876
I0228 05:12:43.516297 27105 status_update_manager.cpp:177] Pausing sending status updates
I0228 05:12:43.516762 27098 state.cpp:62] Recovering state from '/tmp/Endpoint_SlaveEndpointTest_NoAuthorizer_0_nWlwiS/meta'
I0228 05:12:43.516932 27099 status_update_manager.cpp:203] Recovering status update manager
I0228 05:12:43.517065 27110 containerizer.cpp:599] Recovering containerizer
I0228 05:12:43.517560 27110 provisioner.cpp:410] Provisioner recovery complete
I0228 05:12:43.517704 27110 slave.cpp:5559] Finished recovery
I0228 05:12:43.518054 27110 slave.cpp:5733] Querying resource estimator for oversubscribable
resources
I0228 05:12:43.518195 27110 slave.cpp:5747] Received oversubscribable resources {} from the
resource estimator
I0228 05:12:43.519011 27110 process.cpp:3704] Handling HTTP event for process 'slave(707)'
with path: '/slave(707)/monitor/statistics'
I0228 05:12:43.519429 27099 http.cpp:885] Authorizing principal 'test-principal' to GET the
'/monitor/statistics' endpoint
I0228 05:12:43.521041 27113 slave.cpp:803] Agent terminating
[       OK ] Endpoint/SlaveEndpointTest.NoAuthorizer/0 (14 ms)
[ RUN      ] Endpoint/SlaveEndpointTest.NoAuthorizer/1
I0228 05:12:43.587080 27097 containerizer.cpp:220] Using isolation: posix/cpu,posix/mem,filesystem/posix,network/cni
W0228 05:12:43.587365 27097 backend.cpp:76] Failed to create 'aufs' backend: AufsBackend requires
root privileges
W0228 05:12:43.587401 27097 backend.cpp:76] Failed to create 'bind' backend: BindBackend requires
root privileges
I0228 05:12:43.587415 27097 provisioner.cpp:249] Using default backend 'copy'
I0228 05:12:43.587977 27097 cluster.cpp:446] Creating default 'local' authorizer
I0228 05:12:43.588449 27112 slave.cpp:211] Mesos agent started on (708)@172.17.0.2:40207
I0228 05:12:43.588465 27112 slave.cpp:212] Flags at startup: --acls="" --appc_simple_discovery_uri_prefix="http://"
--appc_store_dir="/tmp/mesos/store/appc" --authenticate_http_readonly="true" --authenticate_http_readwrite="true"
--authenticatee="crammd5" --authentication_backoff_factor="1secs" --authorizer="local" --cgroups_cpu_enable_pids_and_tids_count="false"
--cgroups_enable_cfs="false" --cgroups_hierarchy="/sys/fs/cgroup" --cgroups_limit_swap="false"
--cgroups_root="mesos" --container_disk_watch_interval="15secs" --containerizers="mesos" --credential="/tmp/Endpoint_SlaveEndpointTest_NoAuthorizer_1_cHvgLF/credential"
--default_role="*" --disk_watch_interval="1mins" --docker="docker" --docker_kill_orphans="true"
--docker_registry="https://registry-1.docker.io" --docker_remove_delay="6hrs" --docker_socket="/var/run/docker.sock"
--docker_stop_timeout="0ns" --docker_store_dir="/tmp/mesos/store/docker" --docker_volume_checkpoint_dir="/var/run/mesos/isolators/docker/volume"
--enforce_container_disk_quota="false" --executor_registration_timeout="1mins" --executor_shutdown_grace_period="5secs"
--fetcher_cache_dir="/tmp/Endpoint_SlaveEndpointTest_NoAuthorizer_1_cHvgLF/fetch" --fetcher_cache_size="2GB"
--frameworks_home="" --gc_delay="1weeks" --gc_disk_headroom="0.1" --hadoop_home="" --help="false"
--hostname_lookup="true" --http_authenticators="basic" --http_command_executor="false" --http_credentials="/tmp/Endpoint_SlaveEndpointTest_NoAuthorizer_1_cHvgLF/http_credentials"
--http_heartbeat_interval="30secs" --initialize_driver_logging="true" --isolation="posix/cpu,posix/mem"
--launcher="posix" --launcher_dir="/mesos/build/src" --logbufsecs="0" --logging_level="INFO"
--max_completed_executors_per_framework="150" --oversubscribed_resources_interval="15secs"
--perf_duration="10secs" --perf_interval="1mins" --qos_correction_interval_min="0ns" --quiet="false"
--recover="reconnect" --recovery_timeout="15mins" --registration_backoff_factor="10ms" --resources="cpus:2;gpus:0;mem:1024;disk:1024;ports:[31000-32000]"
--revocable_cpu_low_priority="true" --runtime_dir="/tmp/Endpoint_SlaveEndpointTest_NoAuthorizer_1_cHvgLF"
--sandbox_directory="/mnt/mesos/sandbox" --strict="true" --switch_user="true" --systemd_enable_support="true"
--systemd_runtime_directory="/run/systemd/system" --version="false" --work_dir="/tmp/Endpoint_SlaveEndpointTest_NoAuthorizer_1_7nt3bI"
I0228 05:12:43.588809 27112 credentials.hpp:86] Loading credential for authentication from
'/tmp/Endpoint_SlaveEndpointTest_NoAuthorizer_1_cHvgLF/credential'
I0228 05:12:43.588888 27112 slave.cpp:354] Agent using credential for: test-principal
I0228 05:12:43.588904 27112 credentials.hpp:37] Loading credentials for authentication from
'/tmp/Endpoint_SlaveEndpointTest_NoAuthorizer_1_cHvgLF/http_credentials'
I0228 05:12:43.589025 27112 http.cpp:933] Using default 'basic' HTTP authenticator for realm
'mesos-agent-readonly'
I0228 05:12:43.589066 27112 http.cpp:933] Using default 'basic' HTTP authenticator for realm
'mesos-agent-readwrite'
I0228 05:12:43.589457 27112 slave.cpp:541] Agent resources: cpus(*):2; mem(*):1024; disk(*):1024;
ports(*):[31000-32000]
I0228 05:12:43.589488 27112 slave.cpp:549] Agent attributes: [  ]
I0228 05:12:43.589493 27112 slave.cpp:554] Agent hostname: 611ba5eda876
I0228 05:12:43.589567 27103 status_update_manager.cpp:177] Pausing sending status updates
I0228 05:12:43.589953 27109 state.cpp:62] Recovering state from '/tmp/Endpoint_SlaveEndpointTest_NoAuthorizer_1_7nt3bI/meta'
I0228 05:12:43.590106 27098 status_update_manager.cpp:203] Recovering status update manager
I0228 05:12:43.590350 27098 containerizer.cpp:599] Recovering containerizer
I0228 05:12:43.590847 27098 provisioner.cpp:410] Provisioner recovery complete
I0228 05:12:43.590984 27098 slave.cpp:5559] Finished recovery
I0228 05:12:43.591408 27098 slave.cpp:5733] Querying resource estimator for oversubscribable
resources
I0228 05:12:43.591557 27098 slave.cpp:5747] Received oversubscribable resources {} from the
resource estimator
I0228 05:12:43.592412 27111 process.cpp:3704] Handling HTTP event for process 'slave(708)'
with path: '/slave(708)/monitor/statistics.json'
I0228 05:12:43.592808 27105 http.cpp:885] Authorizing principal 'test-principal' to GET the
'/monitor/statistics.json' endpoint
I0228 05:12:43.594578 27097 slave.cpp:803] Agent terminating
[       OK ] Endpoint/SlaveEndpointTest.NoAuthorizer/1 (50 ms)
[ RUN      ] Endpoint/SlaveEndpointTest.NoAuthorizer/2
I0228 05:12:43.637650 27097 containerizer.cpp:220] Using isolation: posix/cpu,posix/mem,filesystem/posix,network/cni
W0228 05:12:43.638052 27097 backend.cpp:76] Failed to create 'aufs' backend: AufsBackend requires
root privileges
W0228 05:12:43.638157 27097 backend.cpp:76] Failed to create 'bind' backend: BindBackend requires
root privileges
I0228 05:12:43.638231 27097 provisioner.cpp:249] Using default backend 'copy'
I0228 05:12:43.638944 27097 cluster.cpp:446] Creating default 'local' authorizer
I0228 05:12:43.639631 27109 slave.cpp:211] Mesos agent started on (709)@172.17.0.2:40207
I0228 05:12:43.639660 27109 slave.cpp:212] Flags at startup: --acls="" --appc_simple_discovery_uri_prefix="http://"
--appc_store_dir="/tmp/mesos/store/appc" --authenticate_http_readonly="true" --authenticate_http_readwrite="true"
--authenticatee="crammd5" --authentication_backoff_factor="1secs" --authorizer="local" --cgroups_cpu_enable_pids_and_tids_count="false"
--cgroups_enable_cfs="false" --cgroups_hierarchy="/sys/fs/cgroup" --cgroups_limit_swap="false"
--cgroups_root="mesos" --container_disk_watch_interval="15secs" --containerizers="mesos" --credential="/tmp/Endpoint_SlaveEndpointTest_NoAuthorizer_2_Cbrgrw/credential"
--default_role="*" --disk_watch_interval="1mins" --docker="docker" --docker_kill_orphans="true"
--docker_registry="https://registry-1.docker.io" --docker_remove_delay="6hrs" --docker_socket="/var/run/docker.sock"
--docker_stop_timeout="0ns" --docker_store_dir="/tmp/mesos/store/docker" --docker_volume_checkpoint_dir="/var/run/mesos/isolators/docker/volume"
--enforce_container_disk_quota="false" --executor_registration_timeout="1mins" --executor_shutdown_grace_period="5secs"
--fetcher_cache_dir="/tmp/Endpoint_SlaveEndpointTest_NoAuthorizer_2_Cbrgrw/fetch" --fetcher_cache_size="2GB"
--frameworks_home="" --gc_delay="1weeks" --gc_disk_headroom="0.1" --hadoop_home="" --help="false"
--hostname_lookup="true" --http_authenticators="basic" --http_command_executor="false" --http_credentials="/tmp/Endpoint_SlaveEndpointTest_NoAuthorizer_2_Cbrgrw/http_credentials"
--http_heartbeat_interval="30secs" --initialize_driver_logging="true" --isolation="posix/cpu,posix/mem"
--launcher="posix" --launcher_dir="/mesos/build/src" --logbufsecs="0" --logging_level="INFO"
--max_completed_executors_per_framework="150" --oversubscribed_resources_interval="15secs"
--perf_duration="10secs" --perf_interval="1mins" --qos_correction_interval_min="0ns" --quiet="false"
--recover="reconnect" --recovery_timeout="15mins" --registration_backoff_factor="10ms" --resources="cpus:2;gpus:0;mem:1024;disk:1024;ports:[31000-32000]"
--revocable_cpu_low_priority="true" --runtime_dir="/tmp/Endpoint_SlaveEndpointTest_NoAuthorizer_2_Cbrgrw"
--sandbox_directory="/mnt/mesos/sandbox" --strict="true" --switch_user="true" --systemd_enable_support="true"
--systemd_runtime_directory="/run/systemd/system" --version="false" --work_dir="/tmp/Endpoint_SlaveEndpointTest_NoAuthorizer_2_xowTJy"
I0228 05:12:43.640135 27109 credentials.hpp:86] Loading credential for authentication from
'/tmp/Endpoint_SlaveEndpointTest_NoAuthorizer_2_Cbrgrw/credential'
I0228 05:12:43.640267 27109 slave.cpp:354] Agent using credential for: test-principal
I0228 05:12:43.640278 27109 credentials.hpp:37] Loading credentials for authentication from
'/tmp/Endpoint_SlaveEndpointTest_NoAuthorizer_2_Cbrgrw/http_credentials'
I0228 05:12:43.640393 27109 http.cpp:933] Using default 'basic' HTTP authenticator for realm
'mesos-agent-readonly'
I0228 05:12:43.640450 27109 http.cpp:933] Using default 'basic' HTTP authenticator for realm
'mesos-agent-readwrite'
I0228 05:12:43.640944 27109 slave.cpp:541] Agent resources: cpus(*):2; mem(*):1024; disk(*):1024;
ports(*):[31000-32000]
I0228 05:12:43.640985 27109 slave.cpp:549] Agent attributes: [  ]
I0228 05:12:43.640992 27109 slave.cpp:554] Agent hostname: 611ba5eda876
I0228 05:12:43.641074 27110 status_update_manager.cpp:177] Pausing sending status updates
I0228 05:12:43.641419 27102 state.cpp:62] Recovering state from '/tmp/Endpoint_SlaveEndpointTest_NoAuthorizer_2_xowTJy/meta'
I0228 05:12:43.641582 27102 status_update_manager.cpp:203] Recovering status update manager
I0228 05:12:43.641664 27102 containerizer.cpp:599] Recovering containerizer
I0228 05:12:43.642246 27103 provisioner.cpp:410] Provisioner recovery complete
I0228 05:12:43.642427 27110 slave.cpp:5559] Finished recovery
I0228 05:12:43.642896 27110 slave.cpp:5733] Querying resource estimator for oversubscribable
resources
I0228 05:12:43.643038 27108 slave.cpp:5747] Received oversubscribable resources {} from the
resource estimator
I0228 05:12:43.644063 27108 process.cpp:3704] Handling HTTP event for process 'slave(709)'
with path: '/slave(709)/containers'
I0228 05:12:43.644551 27099 http.cpp:885] Authorizing principal 'test-principal' to GET the
'/containers' endpoint
I0228 05:12:43.646096 27097 slave.cpp:803] Agent terminating
[       OK ] Endpoint/SlaveEndpointTest.NoAuthorizer/2 (38 ms)
[----------] 9 tests from Endpoint/SlaveEndpointTest (484 ms total)

[----------] Global test environment tear-down
[==========] 1464 tests from 161 test cases ran. (655539 ms total)
[  PASSED  ] 1462 tests.
[  FAILED  ] 2 tests, listed below:
[  FAILED  ] DiskQuotaTest.SlaveRecovery
[  FAILED  ] UpgradeTest.ReregisterOldAgentWithMultiRoleMaster

 2 FAILED TESTS
  YOU HAVE 12 DISABLED TESTS

make[3]: *** [CMakeFiles/check] Error 1
make[3]: Leaving directory `/mesos/build'
make[2]: *** [CMakeFiles/check.dir/all] Error 2
make[2]: Leaving directory `/mesos/build'
make[1]: *** [CMakeFiles/check.dir/rule] Error 2
make[1]: Leaving directory `/mesos/build'
make: *** [check] Error 2
+ docker rmi mesos-1488253787-18300
Untagged: mesos-1488253787-18300:latest
Deleted: sha256:f9716486c37b2fdc7fe4beb6ffab254736e8512d378db2959c54ec40690aa74f
Deleted: sha256:6abb445ce10fe802ac28ebc53385dad6b9e96c37d56edd928f01a52bc717fac2
Deleted: sha256:0cb20824e10ce45e4ce5a766c7618e4c357e564ec223252e5a55baca1ba36e8d
Deleted: sha256:30e51ec6a80affc9ec4d22de8f491824bfd6b6c93960efd8a56375951b3ac736
Deleted: sha256:33d40adf1c140da0e301b4ac7ceee68701d9f0a537b8a60a1a35bf41d86d1a37
Deleted: sha256:feee51e9e124354989ffaa1c7195dc13c4e6f5fc53ca3f7edde1b27daeb53561
Deleted: sha256:c9ae4d7b936f63f6ddcee779d49672e3d15b07cda6ddf063a410b85838b079ca
Deleted: sha256:13a799865693c579f65e1aa24f5c71888ec09c6392f7b430dd5749817ed1661f
Deleted: sha256:4ef608cd4ff691d39bb3751e9e2a40ce8d202b12f724e3f071beb2c1cbb7efe4
Deleted: sha256:f9693bd326072bace17ff7b9976d901f5c273d84988f6f3a01081dfca3441a6f
Deleted: sha256:d3ef3d6a60a925aca08355327b8cda6929727e918c493b13786d310d2cebbb36
Deleted: sha256:bbd1e7932d4c392434b1822d3585b28a5727df1d1a4ff443b08f1848a82c99d5
Deleted: sha256:a5e8d4a6d2922c7eb552b3d0c3096497ac488529f46bd97bef454df4422dc38c
Deleted: sha256:52b35056ee593128bb23235dac4f5b4006ddca9c507a17e10ac15fd4d958cbd1
Deleted: sha256:cdc6caeff6db45ff72874286c494619e71d1d1dd3a5560220db1f4e3185c7e93
Deleted: sha256:f0adcb410bf95dea09b10cd291f440e13b6bb585172f01ff31483b8544dd43a8
Deleted: sha256:f31d64a4d4603e30bfebc5249f524fd9d7e85d21117cda87084b0955d7d7b5a3
Deleted: sha256:d21509f8787ef4f7886fbe75c5763623f5890a708aec0a93b575994ae854ea6b
Deleted: sha256:9e69451275fcb12e1d498301d341cae6eb2acd287180287133d5a3cef8fb80e6
Deleted: sha256:0e3309121d2489bc072cea9a2ea2683aaffd6a92d502bd71f60816b4bb7bb844
Deleted: sha256:72c2c676299ef6a8c77e8d5ba082075351ab6c806e30f3a31cae6513ccb12dd3
Deleted: sha256:9ce99d7bc76599ebf7aad6680a51554d5e40e49a3d4ae09602843c9878198004
Deleted: sha256:91c282ba20dfdb5451d7b64009593ee877a61b582bfede0c2e8e566d4908a5d7
Deleted: sha256:06e5c1d6d4b4dcd20fcf07d2c95ceb8bf861fb7a198af710c698ce9003c19aea
Build step 'Execute shell' marked build as failure

Mime
View raw message