mesos-builds mailing list archives

Site index · List index
Message view « Date » · « Thread »
Top « Date » · « Thread »
From Apache Jenkins Server <jenk...@builds.apache.org>
Subject Build failed in Jenkins: Mesos-Buildbot » autotools,clang,--verbose --enable-libevent --enable-ssl,GLOG_v=1 MESOS_VERBOSE=1,ubuntu:14.04,(docker||Hadoop)&&(!ubuntu-us1)&&(!ubuntu-eu2) #3253
Date Fri, 10 Feb 2017 02:58:46 GMT
See <https://builds.apache.org/job/Mesos-Buildbot/BUILDTOOL=autotools,COMPILER=clang,CONFIGURATION=--verbose%20--enable-libevent%20--enable-ssl,ENVIRONMENT=GLOG_v=1%20MESOS_VERBOSE=1,OS=ubuntu%3A14.04,label_exp=(docker%7C%7CHadoop)&&(!ubuntu-us1)&&(!ubuntu-eu2)/3253/changes>

Changes:

[adam] Bumped version to 1.3.0.

------------------------------------------
[...truncated 14292 lines...]
I0210 02:58:35.734865 25981 openssl.cpp:429] Will not verify peer certificate!
NOTE: Set LIBPROCESS_SSL_VERIFY_CERT=1 to enable peer certificate verification
I0210 02:58:35.734869 25981 openssl.cpp:435] Will only verify peer certificate if presented!
NOTE: Set LIBPROCESS_SSL_REQUIRE_CERT=1 to require peer certificate verification
I0210 02:58:35.749311 25998 libevent_ssl_socket.cpp:1170] Socket error: error:140760FC:SSL
routines:SSL23_GET_CLIENT_HELLO:unknown protocol
I0210 02:58:35.778039 25981 ssl_tests.cpp:638] Testing server protocol 'LIBPROCESS_SSL_ENABLE_TLS_V1_0'
I0210 02:58:35.778513 25981 openssl.cpp:419] CA file path is unspecified! NOTE: Set CA file
path with LIBPROCESS_SSL_CA_FILE=<filepath>
I0210 02:58:35.778528 25981 openssl.cpp:424] CA directory path unspecified! NOTE: Set CA directory
path with LIBPROCESS_SSL_CA_DIR=<dirpath>
I0210 02:58:35.778537 25981 openssl.cpp:429] Will not verify peer certificate!
NOTE: Set LIBPROCESS_SSL_VERIFY_CERT=1 to enable peer certificate verification
I0210 02:58:35.778553 25981 openssl.cpp:435] Will only verify peer certificate if presented!
NOTE: Set LIBPROCESS_SSL_REQUIRE_CERT=1 to require peer certificate verification
I0210 02:58:35.797256 25998 libevent_ssl_socket.cpp:1170] Socket error: error:140760FC:SSL
routines:SSL23_GET_CLIENT_HELLO:unknown protocol
I0210 02:58:35.879111 25981 ssl_tests.cpp:638] Testing server protocol 'LIBPROCESS_SSL_ENABLE_TLS_V1_1'
I0210 02:58:35.879586 25981 openssl.cpp:419] CA file path is unspecified! NOTE: Set CA file
path with LIBPROCESS_SSL_CA_FILE=<filepath>
I0210 02:58:35.879601 25981 openssl.cpp:424] CA directory path unspecified! NOTE: Set CA directory
path with LIBPROCESS_SSL_CA_DIR=<dirpath>
I0210 02:58:35.879606 25981 openssl.cpp:429] Will not verify peer certificate!
NOTE: Set LIBPROCESS_SSL_VERIFY_CERT=1 to enable peer certificate verification
I0210 02:58:35.879609 25981 openssl.cpp:435] Will only verify peer certificate if presented!
NOTE: Set LIBPROCESS_SSL_REQUIRE_CERT=1 to require peer certificate verification
I0210 02:58:35.895536 25998 libevent_ssl_socket.cpp:1170] Socket error: error:140760FC:SSL
routines:SSL23_GET_CLIENT_HELLO:unknown protocol
I0210 02:58:35.980424 25981 ssl_tests.cpp:638] Testing server protocol 'LIBPROCESS_SSL_ENABLE_TLS_V1_2'
I0210 02:58:35.980988 25981 openssl.cpp:419] CA file path is unspecified! NOTE: Set CA file
path with LIBPROCESS_SSL_CA_FILE=<filepath>
I0210 02:58:35.981003 25981 openssl.cpp:424] CA directory path unspecified! NOTE: Set CA directory
path with LIBPROCESS_SSL_CA_DIR=<dirpath>
I0210 02:58:35.981007 25981 openssl.cpp:429] Will not verify peer certificate!
NOTE: Set LIBPROCESS_SSL_VERIFY_CERT=1 to enable peer certificate verification
I0210 02:58:35.981011 25981 openssl.cpp:435] Will only verify peer certificate if presented!
NOTE: Set LIBPROCESS_SSL_REQUIRE_CERT=1 to require peer certificate verification
I0210 02:58:35.992689 25998 libevent_ssl_socket.cpp:1170] Socket error: error:140760FC:SSL
routines:SSL23_GET_CLIENT_HELLO:unknown protocol
[       OK ] SSLTest.NoValidDowngradeEachProtocol (706 ms)
[ RUN      ] SSLTest.PeerAddress
I0210 02:58:36.463794 25981 openssl.cpp:419] CA file path is unspecified! NOTE: Set CA file
path with LIBPROCESS_SSL_CA_FILE=<filepath>
I0210 02:58:36.463817 25981 openssl.cpp:424] CA directory path unspecified! NOTE: Set CA directory
path with LIBPROCESS_SSL_CA_DIR=<dirpath>
I0210 02:58:36.463822 25981 openssl.cpp:429] Will not verify peer certificate!
NOTE: Set LIBPROCESS_SSL_VERIFY_CERT=1 to enable peer certificate verification
I0210 02:58:36.463826 25981 openssl.cpp:435] Will only verify peer certificate if presented!
NOTE: Set LIBPROCESS_SSL_REQUIRE_CERT=1 to require peer certificate verification
[       OK ] SSLTest.PeerAddress (387 ms)
[ RUN      ] SSLTest.HTTPSGet
I0210 02:58:36.609596 25981 openssl.cpp:419] CA file path is unspecified! NOTE: Set CA file
path with LIBPROCESS_SSL_CA_FILE=<filepath>
I0210 02:58:36.609617 25981 openssl.cpp:424] CA directory path unspecified! NOTE: Set CA directory
path with LIBPROCESS_SSL_CA_DIR=<dirpath>
I0210 02:58:36.609622 25981 openssl.cpp:429] Will not verify peer certificate!
NOTE: Set LIBPROCESS_SSL_VERIFY_CERT=1 to enable peer certificate verification
I0210 02:58:36.609627 25981 openssl.cpp:435] Will only verify peer certificate if presented!
NOTE: Set LIBPROCESS_SSL_REQUIRE_CERT=1 to require peer certificate verification
[       OK ] SSLTest.HTTPSGet (146 ms)
[ RUN      ] SSLTest.HTTPSPost
I0210 02:58:36.977654 25981 openssl.cpp:419] CA file path is unspecified! NOTE: Set CA file
path with LIBPROCESS_SSL_CA_FILE=<filepath>
I0210 02:58:36.977679 25981 openssl.cpp:424] CA directory path unspecified! NOTE: Set CA directory
path with LIBPROCESS_SSL_CA_DIR=<dirpath>
I0210 02:58:36.977685 25981 openssl.cpp:429] Will not verify peer certificate!
NOTE: Set LIBPROCESS_SSL_VERIFY_CERT=1 to enable peer certificate verification
I0210 02:58:36.977691 25981 openssl.cpp:435] Will only verify peer certificate if presented!
NOTE: Set LIBPROCESS_SSL_REQUIRE_CERT=1 to require peer certificate verification
[       OK ] SSLTest.HTTPSPost (369 ms)
[ RUN      ] SSLTest.SilentSocket
I0210 02:58:37.303668 25981 openssl.cpp:419] CA file path is unspecified! NOTE: Set CA file
path with LIBPROCESS_SSL_CA_FILE=<filepath>
I0210 02:58:37.303690 25981 openssl.cpp:424] CA directory path unspecified! NOTE: Set CA directory
path with LIBPROCESS_SSL_CA_DIR=<dirpath>
I0210 02:58:37.303695 25981 openssl.cpp:429] Will not verify peer certificate!
NOTE: Set LIBPROCESS_SSL_VERIFY_CERT=1 to enable peer certificate verification
I0210 02:58:37.303699 25981 openssl.cpp:435] Will only verify peer certificate if presented!
NOTE: Set LIBPROCESS_SSL_REQUIRE_CERT=1 to require peer certificate verification
I0210 02:58:37.309875 25998 libevent_ssl_socket.cpp:1170] Socket error: error:00000000:lib(0):func(0):reason(0)
[       OK ] SSLTest.SilentSocket (326 ms)
[----------] 15 tests from SSLTest (9186 ms total)

[----------] 42 tests from Scheme/HTTPTest
[ RUN      ] Scheme/HTTPTest.Endpoints/0
I0210 02:58:38.315698 25981 openssl.cpp:419] CA file path is unspecified! NOTE: Set CA file
path with LIBPROCESS_SSL_CA_FILE=<filepath>
I0210 02:58:38.315721 25981 openssl.cpp:424] CA directory path unspecified! NOTE: Set CA directory
path with LIBPROCESS_SSL_CA_DIR=<dirpath>
I0210 02:58:38.315726 25981 openssl.cpp:429] Will not verify peer certificate!
NOTE: Set LIBPROCESS_SSL_VERIFY_CERT=1 to enable peer certificate verification
I0210 02:58:38.315731 25981 openssl.cpp:435] Will only verify peer certificate if presented!
NOTE: Set LIBPROCESS_SSL_REQUIRE_CERT=1 to require peer certificate verification
I0210 02:58:38.318683 25981 process.cpp:1246] libprocess is initialized on 172.17.0.3:60971
with 16 worker threads
I0210 02:58:38.324939 26740 process.cpp:3704] Handling HTTP event for process '(75)' with
path: '/(75)/body'
I0210 02:58:38.330193 26750 process.cpp:3704] Handling HTTP event for process '(75)' with
path: '/(75)/pipe'
I0210 02:58:38.336446 26744 process.cpp:3704] Handling HTTP event for process '(75)' with
path: '/(75)/body'
I0210 02:58:38.337013 26748 process.cpp:3761] Failed to process request for '/(75)/body':
failure
I0210 02:58:38.337044 26750 process.cpp:1456] Returning '500 Internal Server Error' for '/(75)/body'
(failure)
[       OK ] Scheme/HTTPTest.Endpoints/0 (1028 ms)
[ RUN      ] Scheme/HTTPTest.Endpoints/1
I0210 02:58:38.340966 25981 process.cpp:1246] libprocess is initialized on 172.17.0.3:40854
with 16 worker threads
I0210 02:58:38.342245 26764 process.cpp:3704] Handling HTTP event for process '(76)' with
path: '/(76)/body'
I0210 02:58:38.344331 26765 process.cpp:3704] Handling HTTP event for process '(76)' with
path: '/(76)/pipe'
I0210 02:58:38.347074 26757 process.cpp:3704] Handling HTTP event for process '(76)' with
path: '/(76)/body'
I0210 02:58:38.347645 26767 process.cpp:3761] Failed to process request for '/(76)/body':
failure
I0210 02:58:38.347667 26768 process.cpp:1456] Returning '500 Internal Server Error' for '/(76)/body'
(failure)
I0210 02:58:38.348516 26771 process.cpp:827] Decode failure: Connection reset by peer
E0210 02:58:38.348556 26771 process.cpp:2426] Failed to shutdown socket with fd 9: Transport
endpoint is not connected
[       OK ] Scheme/HTTPTest.Endpoints/1 (11 ms)
[ RUN      ] Scheme/HTTPTest.EndpointsHelp/0
I0210 02:58:38.922843 25981 openssl.cpp:419] CA file path is unspecified! NOTE: Set CA file
path with LIBPROCESS_SSL_CA_FILE=<filepath>
I0210 02:58:38.922865 25981 openssl.cpp:424] CA directory path unspecified! NOTE: Set CA directory
path with LIBPROCESS_SSL_CA_DIR=<dirpath>
I0210 02:58:38.922871 25981 openssl.cpp:429] Will not verify peer certificate!
NOTE: Set LIBPROCESS_SSL_VERIFY_CERT=1 to enable peer certificate verification
I0210 02:58:38.922875 25981 openssl.cpp:435] Will only verify peer certificate if presented!
NOTE: Set LIBPROCESS_SSL_REQUIRE_CERT=1 to require peer certificate verification
I0210 02:58:38.925776 25981 process.cpp:1246] libprocess is initialized on 172.17.0.3:52796
with 16 worker threads
I0210 02:58:38.931545 26773 process.cpp:3704] Handling HTTP event for process 'help' with
path: '/help'
I0210 02:58:38.937364 26776 process.cpp:3704] Handling HTTP event for process 'help' with
path: '/help'
I0210 02:58:38.944021 26778 process.cpp:3704] Handling HTTP event for process 'help' with
path: '/help/(77)/body'
I0210 02:58:38.949825 26782 process.cpp:3704] Handling HTTP event for process 'help' with
path: '/help/(77)/a/b/c'
[       OK ] Scheme/HTTPTest.EndpointsHelp/0 (602 ms)
[ RUN      ] Scheme/HTTPTest.EndpointsHelp/1
I0210 02:58:38.958433 25981 process.cpp:1246] libprocess is initialized on 172.17.0.3:48215
with 16 worker threads
I0210 02:58:38.959517 26793 process.cpp:3704] Handling HTTP event for process 'help' with
path: '/help'
I0210 02:58:38.961455 26791 process.cpp:3704] Handling HTTP event for process 'help' with
path: '/help'
I0210 02:58:38.964113 26804 process.cpp:3704] Handling HTTP event for process 'help' with
path: '/help/(78)/body'
I0210 02:58:38.965879 26790 process.cpp:3704] Handling HTTP event for process 'help' with
path: '/help/(78)/a/b/c'
[       OK ] Scheme/HTTPTest.EndpointsHelp/1 (16 ms)
[ RUN      ] Scheme/HTTPTest.EndpointsHelpRemoval/0
I0210 02:58:39.371182 25981 openssl.cpp:419] CA file path is unspecified! NOTE: Set CA file
path with LIBPROCESS_SSL_CA_FILE=<filepath>
I0210 02:58:39.371209 25981 openssl.cpp:424] CA directory path unspecified! NOTE: Set CA directory
path with LIBPROCESS_SSL_CA_DIR=<dirpath>
I0210 02:58:39.371214 25981 openssl.cpp:429] Will not verify peer certificate!
NOTE: Set LIBPROCESS_SSL_VERIFY_CERT=1 to enable peer certificate verification
I0210 02:58:39.371218 25981 openssl.cpp:435] Will only verify peer certificate if presented!
NOTE: Set LIBPROCESS_SSL_REQUIRE_CERT=1 to require peer certificate verification
I0210 02:58:39.374398 25981 process.cpp:1246] libprocess is initialized on 172.17.0.3:56120
with 16 worker threads
I0210 02:58:39.380410 26812 process.cpp:3704] Handling HTTP event for process 'help' with
path: '/help/(79)/body'
I0210 02:58:39.386471 26810 process.cpp:3704] Handling HTTP event for process 'help' with
path: '/help/(79)/bogus'
[       OK ] Scheme/HTTPTest.EndpointsHelpRemoval/0 (420 ms)
[ RUN      ] Scheme/HTTPTest.EndpointsHelpRemoval/1
I0210 02:58:39.390085 25981 process.cpp:1246] libprocess is initialized on 172.17.0.3:34800
with 16 worker threads
I0210 02:58:39.393594 26830 process.cpp:3704] Handling HTTP event for process 'help' with
path: '/help/(80)/body'
I0210 02:58:39.395529 26834 process.cpp:3704] Handling HTTP event for process 'help' with
path: '/help/(80)/bogus'
[       OK ] Scheme/HTTPTest.EndpointsHelpRemoval/1 (8 ms)
[ RUN      ] Scheme/HTTPTest.PipeEOF/0
I0210 02:58:39.749186 25981 openssl.cpp:419] CA file path is unspecified! NOTE: Set CA file
path with LIBPROCESS_SSL_CA_FILE=<filepath>
I0210 02:58:39.749207 25981 openssl.cpp:424] CA directory path unspecified! NOTE: Set CA directory
path with LIBPROCESS_SSL_CA_DIR=<dirpath>
I0210 02:58:39.749212 25981 openssl.cpp:429] Will not verify peer certificate!
NOTE: Set LIBPROCESS_SSL_VERIFY_CERT=1 to enable peer certificate verification
I0210 02:58:39.749217 25981 openssl.cpp:435] Will only verify peer certificate if presented!
NOTE: Set LIBPROCESS_SSL_REQUIRE_CERT=1 to require peer certificate verification
I0210 02:58:39.751819 25981 process.cpp:1246] libprocess is initialized on 172.17.0.3:52825
with 16 worker threads
[       OK ] Scheme/HTTPTest.PipeEOF/0 (356 ms)
[ RUN      ] Scheme/HTTPTest.PipeEOF/1
I0210 02:58:39.754890 25981 process.cpp:1246] libprocess is initialized on 172.17.0.3:50996
with 16 worker threads
[       OK ] Scheme/HTTPTest.PipeEOF/1 (3 ms)
[ RUN      ] Scheme/HTTPTest.PipeFailure/0
I0210 02:58:40.090322 25981 openssl.cpp:419] CA file path is unspecified! NOTE: Set CA file
path with LIBPROCESS_SSL_CA_FILE=<filepath>
I0210 02:58:40.090343 25981 openssl.cpp:424] CA directory path unspecified! NOTE: Set CA directory
path with LIBPROCESS_SSL_CA_DIR=<dirpath>
I0210 02:58:40.090348 25981 openssl.cpp:429] Will not verify peer certificate!
NOTE: Set LIBPROCESS_SSL_VERIFY_CERT=1 to enable peer certificate verification
I0210 02:58:40.090353 25981 openssl.cpp:435] Will only verify peer certificate if presented!
NOTE: Set LIBPROCESS_SSL_REQUIRE_CERT=1 to require peer certificate verification
I0210 02:58:40.092571 25981 process.cpp:1246] libprocess is initialized on 172.17.0.3:47877
with 16 worker threads
[       OK ] Scheme/HTTPTest.PipeFailure/0 (338 ms)
[ RUN      ] Scheme/HTTPTest.PipeFailure/1
I0210 02:58:40.097847 25981 process.cpp:1246] libprocess is initialized on 172.17.0.3:54423
with 16 worker threads
[       OK ] Scheme/HTTPTest.PipeFailure/1 (5 ms)
[ RUN      ] Scheme/HTTPTest.PipeReaderCloses/0
I0210 02:58:40.557217 25981 openssl.cpp:419] CA file path is unspecified! NOTE: Set CA file
path with LIBPROCESS_SSL_CA_FILE=<filepath>
I0210 02:58:40.557240 25981 openssl.cpp:424] CA directory path unspecified! NOTE: Set CA directory
path with LIBPROCESS_SSL_CA_DIR=<dirpath>
I0210 02:58:40.557245 25981 openssl.cpp:429] Will not verify peer certificate!
NOTE: Set LIBPROCESS_SSL_VERIFY_CERT=1 to enable peer certificate verification
I0210 02:58:40.557248 25981 openssl.cpp:435] Will only verify peer certificate if presented!
NOTE: Set LIBPROCESS_SSL_REQUIRE_CERT=1 to require peer certificate verification
I0210 02:58:40.562443 25981 process.cpp:1246] libprocess is initialized on 172.17.0.3:33978
with 16 worker threads
[       OK ] Scheme/HTTPTest.PipeReaderCloses/0 (467 ms)
[ RUN      ] Scheme/HTTPTest.PipeReaderCloses/1
I0210 02:58:40.567514 25981 process.cpp:1246] libprocess is initialized on 172.17.0.3:43051
with 16 worker threads
[       OK ] Scheme/HTTPTest.PipeReaderCloses/1 (3 ms)
[ RUN      ] Scheme/HTTPTest.Encode/0
I0210 02:58:40.993688 25981 openssl.cpp:419] CA file path is unspecified! NOTE: Set CA file
path with LIBPROCESS_SSL_CA_FILE=<filepath>
I0210 02:58:40.993710 25981 openssl.cpp:424] CA directory path unspecified! NOTE: Set CA directory
path with LIBPROCESS_SSL_CA_DIR=<dirpath>
I0210 02:58:40.993716 25981 openssl.cpp:429] Will not verify peer certificate!
NOTE: Set LIBPROCESS_SSL_VERIFY_CERT=1 to enable peer certificate verification
I0210 02:58:40.993719 25981 openssl.cpp:435] Will only verify peer certificate if presented!
NOTE: Set LIBPROCESS_SSL_REQUIRE_CERT=1 to require peer certificate verification
I0210 02:58:41.002234 25981 process.cpp:1246] libprocess is initialized on 172.17.0.3:58631
with 16 worker threads
[       OK ] Scheme/HTTPTest.Encode/0 (434 ms)
[ RUN      ] Scheme/HTTPTest.Encode/1
I0210 02:58:41.009768 25981 process.cpp:1246] libprocess is initialized on 172.17.0.3:51055
with 16 worker threads
[       OK ] Scheme/HTTPTest.Encode/1 (8 ms)
[ RUN      ] Scheme/HTTPTest.PathParse/0
I0210 02:58:41.209902 25981 openssl.cpp:419] CA file path is unspecified! NOTE: Set CA file
path with LIBPROCESS_SSL_CA_FILE=<filepath>
I0210 02:58:41.209924 25981 openssl.cpp:424] CA directory path unspecified! NOTE: Set CA directory
path with LIBPROCESS_SSL_CA_DIR=<dirpath>
I0210 02:58:41.209929 25981 openssl.cpp:429] Will not verify peer certificate!
NOTE: Set LIBPROCESS_SSL_VERIFY_CERT=1 to enable peer certificate verification
I0210 02:58:41.209933 25981 openssl.cpp:435] Will only verify peer certificate if presented!
NOTE: Set LIBPROCESS_SSL_REQUIRE_CERT=1 to require peer certificate verification
*** Aborted at 1486695521 (unix time) try "date -d @1486695521" if you are using GNU date
***
PC: @     0x2af9b298ceee (unknown)
I0210 02:58:41.214241 25981 process.cpp:1246] libprocess is initialized on 172.17.0.3:57872
with 16 worker threads
*** SIGSEGV (@0x3d74af8) received by PID 25981 (TID 0x2af9b9e37700) from PID 64441080; stack
trace: ***
    @     0x2af9b02e1330 (unknown)
    @     0x2af9b298ceee (unknown)
    @     0x2af9b218fe30 (unknown)
[       OK ] Scheme/HTTPTest.PathParse/0 (204 ms)
[ RUN      ] Scheme/HTTPTest.PathParse/1
    @     0x2af9b219048c (unknown)
    @           0x442f6f process::UPID::UPID()
    @           0x9f4cbe process::DispatchEvent::DispatchEvent()
    @           0x9de773 process::internal::dispatch()
    @           0x9f477d process::dispatch<>()
    @           0x9dd797 process::ProcessBase::route()
    @           0xaf570d process::ProcessBase::route<>()
    @           0xaf2fe0 process::Help::initialize()
    @           0xaf3092 process::Help::initialize()
    @           0x9d8280 process::ProcessManager::resume()
    @           0x9e6aac process::ProcessManager::init_threads()::$_2::operator()()
    @           0x9e69b5 _ZNSt12_Bind_simpleIFZN7process14ProcessManager12init_threadsEvE3$_2vEE9_M_invokeIJEEEvSt12_Index_tupleIJXspT_EEE
    @           0x9e6985 std::_Bind_simple<>::operator()()
    @           0x9e695c std::thread::_Impl<>::_M_run()
    @     0x2af9b2186a60 (unknown)
    @     0x2af9b02d9184 start_thread
    @     0x2af9b29ef37d (unknown)
make[7]: *** [check-local] Segmentation fault (core dumped)
make[7]: Leaving directory `/mesos/mesos-1.3.0/_build/3rdparty/libprocess'
make[6]: *** [check-am] Error 2
make[6]: Leaving directory `/mesos/mesos-1.3.0/_build/3rdparty/libprocess'
make[5]: *** [check-recursive] Error 1
make[5]: Leaving directory `/mesos/mesos-1.3.0/_build/3rdparty/libprocess'
make[4]: *** [check] Error 2
make[4]: Leaving directory `/mesos/mesos-1.3.0/_build/3rdparty/libprocess'
make[3]: *** [check-recursive] Error 1
make[3]: Leaving directory `/mesos/mesos-1.3.0/_build/3rdparty'
make[2]: *** [check] Error 2
make[2]: Leaving directory `/mesos/mesos-1.3.0/_build/3rdparty'
make[1]: *** [check-recursive] Error 1
make[1]: Leaving directory `/mesos/mesos-1.3.0/_build'
make: *** [distcheck] Error 1
+ docker rmi mesos-1486694134-22090
Untagged: mesos-1486694134-22090:latest
Deleted: sha256:a2e85210b2e4c0e573357de32be0fe17ff6ca0276e8821b64d7b27e8a9140146
Deleted: sha256:b80e9c7add711eea91768223f4b5e2344e82fb73c904587cf074a31e0c355995
Deleted: sha256:915f4aae797c1104543dee6cd95330c997e29693d676424a97b40dd5ee2387b6
Deleted: sha256:d31e71fe1bee4646ef2b8477e967999f91ee8cde29924fa392cb2f417a560601
Deleted: sha256:f2a458e169893f04eb15f2d1e67f342ce613614cb7b8aefcf42124bede27e2fd
Deleted: sha256:d96e034b410a4ed6502df96f4a06ae25f7be68b1c71458f958c57c4dbd90d9d8
Deleted: sha256:62a55e45b126237c77eec659c3bd3f6a261e2e67c40309cec669fb67e0c5d4bc
Deleted: sha256:1a88aed6aa929c7c3a2f538d979bc6f8540f065bf7cdad14b43d2365f1723c2b
Deleted: sha256:493e906bf609cca59ca0d3ea2a38b041aaa08c9001aff227a12be9dd5ab71a4e
Deleted: sha256:399a48d40f6b13be98ce0ac9f477bc4daf2dae1173179d55a526177fbc6df09e
Deleted: sha256:edb530ae30cef32b9d0a5a1b161e44d0a7a0c59d3193cd82967a8c6b69d2326f
Deleted: sha256:7104a5e28fe088d60754920e928a8d1d9706d8369aeb225725e775e585a512d5
Deleted: sha256:a02419c16d8b4016abaafdc65d36fd04fb56a40fc4a5494edf728ed28da4274d
Deleted: sha256:e656ca697d605cee2ac5c669342518fac0faa4e14ac9a59fdb16b4c7f8d1af1f
Deleted: sha256:f556742dbd8dd22eeeb2d940a5164165035c81de125972022dbce89b7a335478
Deleted: sha256:9b392d17baed39d0316b9081f0b3c7753181404f2616df014ceece0ee034ebc8
Deleted: sha256:76909fe566b3a489cff530977d34016dd1298e958a9cf7f8a0a461ca1b0ab9b1
Deleted: sha256:1121d64c88a3a7c32927f9942676e291fac200ae760f54b3af2183f400ad0737
Deleted: sha256:7c1cee8f8d9ddf576256e0486212b14deb61587322ff86f2d1d13b77025ea611
Deleted: sha256:7a049be51f7cc4d0d4ceb7dd593509735f8e38b69d7a7afff98ea9bd0a018e2a
Deleted: sha256:155930c53c6665a09d1149e5d5c15672ad13685e58c7633f5c1781ee89069f24
Deleted: sha256:a90d07745de54d889a298467e6769c8f718be1ba0b5d92d78d103196a6cac0d5
Deleted: sha256:b86a8c3d5575e8027009136527bba4115ad964c867fae8e10d65f0635fa2c2cd
Deleted: sha256:9d64b054f1e82ba85679498cde9129c472ac69d2687e0b84ba3f164c768b6a34
Build step 'Execute shell' marked build as failure

Mime
View raw message