mesos-builds mailing list archives

Site index · List index
Message view « Date » · « Thread »
Top « Date » · « Thread »
From Apache Jenkins Server <jenk...@builds.apache.org>
Subject Build failed in Jenkins: Mesos-Reviewbot #17036
Date Thu, 09 Feb 2017 14:28:07 GMT
See <https://builds.apache.org/job/Mesos-Reviewbot/17036/>

------------------------------------------
[...truncated 177963 lines...]
I0209 14:27:56.988337 30466 status_update_manager.cpp:203] Recovering status update manager
I0209 14:27:56.988560 30464 containerizer.cpp:599] Recovering containerizer
I0209 14:27:56.990085 30462 provisioner.cpp:410] Provisioner recovery complete
I0209 14:27:56.990509 30473 slave.cpp:5555] Finished recovery
I0209 14:27:56.991050 30473 slave.cpp:5729] Querying resource estimator for oversubscribable
resources
I0209 14:27:56.991339 30469 slave.cpp:5743] Received oversubscribable resources {} from the
resource estimator
I0209 14:27:56.995625 30472 process.cpp:3704] Handling HTTP event for process 'slave(694)'
with path: '/slave(694)/monitor/statistics.json'
I0209 14:27:56.997145 30472 http.cpp:871] Authorizing principal 'test-principal' to GET the
'/monitor/statistics.json' endpoint
I0209 14:27:57.001060 30470 slave.cpp:803] Agent terminating
[       OK ] Endpoint/SlaveEndpointTest.AuthorizedRequest/1 (35 ms)
[ RUN      ] Endpoint/SlaveEndpointTest.AuthorizedRequest/2
I0209 14:27:57.012984 30441 containerizer.cpp:220] Using isolation: posix/cpu,posix/mem,filesystem/posix,network/cni
W0209 14:27:57.013661 30441 backend.cpp:76] Failed to create 'aufs' backend: AufsBackend requires
root privileges
W0209 14:27:57.013815 30441 backend.cpp:76] Failed to create 'bind' backend: BindBackend requires
root privileges
I0209 14:27:57.013968 30441 provisioner.cpp:249] Using default backend 'copy'
I0209 14:27:57.017400 30472 slave.cpp:211] Mesos agent started on (695)@172.17.0.2:47938
I0209 14:27:57.017431 30472 slave.cpp:212] Flags at startup: --acls="" --appc_simple_discovery_uri_prefix="http://"
--appc_store_dir="/tmp/mesos/store/appc" --authenticate_http_readonly="true" --authenticate_http_readwrite="true"
--authenticatee="crammd5" --authentication_backoff_factor="1secs" --authorizer="local" --cgroups_cpu_enable_pids_and_tids_count="false"
--cgroups_enable_cfs="false" --cgroups_hierarchy="/sys/fs/cgroup" --cgroups_limit_swap="false"
--cgroups_root="mesos" --container_disk_watch_interval="15secs" --containerizers="mesos" --credential="/tmp/Endpoint_SlaveEndpointTest_AuthorizedRequest_2_rdTxix/credential"
--default_role="*" --disk_watch_interval="1mins" --docker="docker" --docker_kill_orphans="true"
--docker_registry="https://registry-1.docker.io" --docker_remove_delay="6hrs" --docker_socket="/var/run/docker.sock"
--docker_stop_timeout="0ns" --docker_store_dir="/tmp/mesos/store/docker" --docker_volume_checkpoint_dir="/var/run/mesos/isolators/docker/volume"
--enforce_container_disk_quota="false" --executor_registration_timeout="1mins" --executor_shutdown_grace_period="5secs"
--fetcher_cache_dir="/tmp/Endpoint_SlaveEndpointTest_AuthorizedRequest_2_rdTxix/fetch" --fetcher_cache_size="2GB"
--frameworks_home="" --gc_delay="1weeks" --gc_disk_headroom="0.1" --hadoop_home="" --help="false"
--hostname_lookup="true" --http_authenticators="basic" --http_command_executor="false" --http_credentials="/tmp/Endpoint_SlaveEndpointTest_AuthorizedRequest_2_rdTxix/http_credentials"
--http_heartbeat_interval="30secs" --initialize_driver_logging="true" --isolation="posix/cpu,posix/mem"
--launcher="posix" --launcher_dir="/mesos/mesos-1.2.0/_build/src" --logbufsecs="0" --logging_level="INFO"
--max_completed_executors_per_framework="150" --oversubscribed_resources_interval="15secs"
--perf_duration="10secs" --perf_interval="1mins" --qos_correction_interval_min="0ns" --quiet="false"
--recover="reconnect" --recovery_timeout="15mins" --registration_backoff_factor="10ms" --resources="cpus:2;gpus:0;mem:1024;disk:1024;ports:[31000-32000]"
--revocable_cpu_low_priority="true" --runtime_dir="/tmp/Endpoint_SlaveEndpointTest_AuthorizedRequest_2_rdTxix"
--sandbox_directory="/mnt/mesos/sandbox" --strict="true" --switch_user="true" --systemd_enable_support="true"
--systemd_runtime_directory="/run/systemd/system" --version="false" --work_dir="/tmp/Endpoint_SlaveEndpointTest_AuthorizedRequest_2_clPvt9"
I0209 14:27:57.018075 30472 credentials.hpp:86] Loading credential for authentication from
'/tmp/Endpoint_SlaveEndpointTest_AuthorizedRequest_2_rdTxix/credential'
I0209 14:27:57.018314 30472 slave.cpp:354] Agent using credential for: test-principal
I0209 14:27:57.018340 30472 credentials.hpp:37] Loading credentials for authentication from
'/tmp/Endpoint_SlaveEndpointTest_AuthorizedRequest_2_rdTxix/http_credentials'
I0209 14:27:57.018620 30472 http.cpp:919] Using default 'basic' HTTP authenticator for realm
'mesos-agent-readonly'
I0209 14:27:57.018792 30472 http.cpp:919] Using default 'basic' HTTP authenticator for realm
'mesos-agent-readwrite'
I0209 14:27:57.019968 30472 slave.cpp:541] Agent resources: cpus(*):2; mem(*):1024; disk(*):1024;
ports(*):[31000-32000]
I0209 14:27:57.020050 30472 slave.cpp:549] Agent attributes: [  ]
I0209 14:27:57.020071 30472 slave.cpp:554] Agent hostname: 697c2b890581
I0209 14:27:57.020267 30470 status_update_manager.cpp:177] Pausing sending status updates
I0209 14:27:57.021545 30471 state.cpp:62] Recovering state from '/tmp/Endpoint_SlaveEndpointTest_AuthorizedRequest_2_clPvt9/meta'
I0209 14:27:57.021870 30470 status_update_manager.cpp:203] Recovering status update manager
I0209 14:27:57.022153 30473 containerizer.cpp:599] Recovering containerizer
I0209 14:27:57.023896 30474 provisioner.cpp:410] Provisioner recovery complete
I0209 14:27:57.024408 30464 slave.cpp:5555] Finished recovery
I0209 14:27:57.025070 30464 slave.cpp:5729] Querying resource estimator for oversubscribable
resources
I0209 14:27:57.025384 30465 slave.cpp:5743] Received oversubscribable resources {} from the
resource estimator
I0209 14:27:57.028244 30468 process.cpp:3704] Handling HTTP event for process 'slave(695)'
with path: '/slave(695)/containers'
I0209 14:27:57.029669 30472 http.cpp:871] Authorizing principal 'test-principal' to GET the
'/containers' endpoint
I0209 14:27:57.033437 30469 slave.cpp:803] Agent terminating
[       OK ] Endpoint/SlaveEndpointTest.AuthorizedRequest/2 (32 ms)
[ RUN      ] Endpoint/SlaveEndpointTest.UnauthorizedRequest/0
I0209 14:27:57.043828 30441 containerizer.cpp:220] Using isolation: posix/cpu,posix/mem,filesystem/posix,network/cni
W0209 14:27:57.044700 30441 backend.cpp:76] Failed to create 'aufs' backend: AufsBackend requires
root privileges
W0209 14:27:57.044981 30441 backend.cpp:76] Failed to create 'bind' backend: BindBackend requires
root privileges
I0209 14:27:57.045037 30441 provisioner.cpp:249] Using default backend 'copy'
I0209 14:27:57.049541 30473 slave.cpp:211] Mesos agent started on (696)@172.17.0.2:47938
I0209 14:27:57.049566 30473 slave.cpp:212] Flags at startup: --acls="" --appc_simple_discovery_uri_prefix="http://"
--appc_store_dir="/tmp/mesos/store/appc" --authenticate_http_readonly="true" --authenticate_http_readwrite="true"
--authenticatee="crammd5" --authentication_backoff_factor="1secs" --authorizer="local" --cgroups_cpu_enable_pids_and_tids_count="false"
--cgroups_enable_cfs="false" --cgroups_hierarchy="/sys/fs/cgroup" --cgroups_limit_swap="false"
--cgroups_root="mesos" --container_disk_watch_interval="15secs" --containerizers="mesos" --credential="/tmp/Endpoint_SlaveEndpointTest_UnauthorizedRequest_0_qn6yS4/credential"
--default_role="*" --disk_watch_interval="1mins" --docker="docker" --docker_kill_orphans="true"
--docker_registry="https://registry-1.docker.io" --docker_remove_delay="6hrs" --docker_socket="/var/run/docker.sock"
--docker_stop_timeout="0ns" --docker_store_dir="/tmp/mesos/store/docker" --docker_volume_checkpoint_dir="/var/run/mesos/isolators/docker/volume"
--enforce_container_disk_quota="false" --executor_registration_timeout="1mins" --executor_shutdown_grace_period="5secs"
--fetcher_cache_dir="/tmp/Endpoint_SlaveEndpointTest_UnauthorizedRequest_0_qn6yS4/fetch" --fetcher_cache_size="2GB"
--frameworks_home="" --gc_delay="1weeks" --gc_disk_headroom="0.1" --hadoop_home="" --help="false"
--hostname_lookup="true" --http_authenticators="basic" --http_command_executor="false" --http_credentials="/tmp/Endpoint_SlaveEndpointTest_UnauthorizedRequest_0_qn6yS4/http_credentials"
--http_heartbeat_interval="30secs" --initialize_driver_logging="true" --isolation="posix/cpu,posix/mem"
--launcher="posix" --launcher_dir="/mesos/mesos-1.2.0/_build/src" --logbufsecs="0" --logging_level="INFO"
--max_completed_executors_per_framework="150" --oversubscribed_resources_interval="15secs"
--perf_duration="10secs" --perf_interval="1mins" --qos_correction_interval_min="0ns" --quiet="false"
--recover="reconnect" --recovery_timeout="15mins" --registration_backoff_factor="10ms" --resources="cpus:2;gpus:0;mem:1024;disk:1024;ports:[31000-32000]"
--revocable_cpu_low_priority="true" --runtime_dir="/tmp/Endpoint_SlaveEndpointTest_UnauthorizedRequest_0_qn6yS4"
--sandbox_directory="/mnt/mesos/sandbox" --strict="true" --switch_user="true" --systemd_enable_support="true"
--systemd_runtime_directory="/run/systemd/system" --version="false" --work_dir="/tmp/Endpoint_SlaveEndpointTest_UnauthorizedRequest_0_QTxiYG"
I0209 14:27:57.050222 30473 credentials.hpp:86] Loading credential for authentication from
'/tmp/Endpoint_SlaveEndpointTest_UnauthorizedRequest_0_qn6yS4/credential'
I0209 14:27:57.050403 30473 slave.cpp:354] Agent using credential for: test-principal
I0209 14:27:57.050431 30473 credentials.hpp:37] Loading credentials for authentication from
'/tmp/Endpoint_SlaveEndpointTest_UnauthorizedRequest_0_qn6yS4/http_credentials'
I0209 14:27:57.050688 30473 http.cpp:919] Using default 'basic' HTTP authenticator for realm
'mesos-agent-readonly'
I0209 14:27:57.050887 30473 http.cpp:919] Using default 'basic' HTTP authenticator for realm
'mesos-agent-readwrite'
I0209 14:27:57.052098 30473 slave.cpp:541] Agent resources: cpus(*):2; mem(*):1024; disk(*):1024;
ports(*):[31000-32000]
I0209 14:27:57.052176 30473 slave.cpp:549] Agent attributes: [  ]
I0209 14:27:57.052192 30473 slave.cpp:554] Agent hostname: 697c2b890581
I0209 14:27:57.052350 30460 status_update_manager.cpp:177] Pausing sending status updates
I0209 14:27:57.053935 30464 state.cpp:62] Recovering state from '/tmp/Endpoint_SlaveEndpointTest_UnauthorizedRequest_0_QTxiYG/meta'
I0209 14:27:57.054258 30465 status_update_manager.cpp:203] Recovering status update manager
I0209 14:27:57.054615 30462 containerizer.cpp:599] Recovering containerizer
I0209 14:27:57.057139 30467 provisioner.cpp:410] Provisioner recovery complete
I0209 14:27:57.057584 30469 slave.cpp:5555] Finished recovery
I0209 14:27:57.058161 30469 slave.cpp:5729] Querying resource estimator for oversubscribable
resources
I0209 14:27:57.058523 30461 slave.cpp:5743] Received oversubscribable resources {} from the
resource estimator
I0209 14:27:57.061962 30461 process.cpp:3704] Handling HTTP event for process 'slave(696)'
with path: '/slave(696)/monitor/statistics'
I0209 14:27:57.063936 30463 http.cpp:871] Authorizing principal 'test-principal' to GET the
'/monitor/statistics' endpoint
I0209 14:27:57.066524 30475 slave.cpp:803] Agent terminating
[       OK ] Endpoint/SlaveEndpointTest.UnauthorizedRequest/0 (33 ms)
[ RUN      ] Endpoint/SlaveEndpointTest.UnauthorizedRequest/1
I0209 14:27:57.076078 30441 containerizer.cpp:220] Using isolation: posix/cpu,posix/mem,filesystem/posix,network/cni
W0209 14:27:57.076557 30441 backend.cpp:76] Failed to create 'aufs' backend: AufsBackend requires
root privileges
W0209 14:27:57.076691 30441 backend.cpp:76] Failed to create 'bind' backend: BindBackend requires
root privileges
I0209 14:27:57.076835 30441 provisioner.cpp:249] Using default backend 'copy'
I0209 14:27:57.080226 30464 slave.cpp:211] Mesos agent started on (697)@172.17.0.2:47938
I0209 14:27:57.080252 30464 slave.cpp:212] Flags at startup: --acls="" --appc_simple_discovery_uri_prefix="http://"
--appc_store_dir="/tmp/mesos/store/appc" --authenticate_http_readonly="true" --authenticate_http_readwrite="true"
--authenticatee="crammd5" --authentication_backoff_factor="1secs" --authorizer="local" --cgroups_cpu_enable_pids_and_tids_count="false"
--cgroups_enable_cfs="false" --cgroups_hierarchy="/sys/fs/cgroup" --cgroups_limit_swap="false"
--cgroups_root="mesos" --container_disk_watch_interval="15secs" --containerizers="mesos" --credential="/tmp/Endpoint_SlaveEndpointTest_UnauthorizedRequest_1_YdfZNC/credential"
--default_role="*" --disk_watch_interval="1mins" --docker="docker" --docker_kill_orphans="true"
--docker_registry="https://registry-1.docker.io" --docker_remove_delay="6hrs" --docker_socket="/var/run/docker.sock"
--docker_stop_timeout="0ns" --docker_store_dir="/tmp/mesos/store/docker" --docker_volume_checkpoint_dir="/var/run/mesos/isolators/docker/volume"
--enforce_container_disk_quota="false" --executor_registration_timeout="1mins" --executor_shutdown_grace_period="5secs"
--fetcher_cache_dir="/tmp/Endpoint_SlaveEndpointTest_UnauthorizedRequest_1_YdfZNC/fetch" --fetcher_cache_size="2GB"
--frameworks_home="" --gc_delay="1weeks" --gc_disk_headroom="0.1" --hadoop_home="" --help="false"
--hostname_lookup="true" --http_authenticators="basic" --http_command_executor="false" --http_credentials="/tmp/Endpoint_SlaveEndpointTest_UnauthorizedRequest_1_YdfZNC/http_credentials"
--http_heartbeat_interval="30secs" --initialize_driver_logging="true" --isolation="posix/cpu,posix/mem"
--launcher="posix" --launcher_dir="/mesos/mesos-1.2.0/_build/src" --logbufsecs="0" --logging_level="INFO"
--max_completed_executors_per_framework="150" --oversubscribed_resources_interval="15secs"
--perf_duration="10secs" --perf_interval="1mins" --qos_correction_interval_min="0ns" --quiet="false"
--recover="reconnect" --recovery_timeout="15mins" --registration_backoff_factor="10ms" --resources="cpus:2;gpus:0;mem:1024;disk:1024;ports:[31000-32000]"
--revocable_cpu_low_priority="true" --runtime_dir="/tmp/Endpoint_SlaveEndpointTest_UnauthorizedRequest_1_YdfZNC"
--sandbox_directory="/mnt/mesos/sandbox" --strict="true" --switch_user="true" --systemd_enable_support="true"
--systemd_runtime_directory="/run/systemd/system" --version="false" --work_dir="/tmp/Endpoint_SlaveEndpointTest_UnauthorizedRequest_1_dx8nOe"
I0209 14:27:57.080940 30464 credentials.hpp:86] Loading credential for authentication from
'/tmp/Endpoint_SlaveEndpointTest_UnauthorizedRequest_1_YdfZNC/credential'
I0209 14:27:57.081116 30464 slave.cpp:354] Agent using credential for: test-principal
I0209 14:27:57.081137 30464 credentials.hpp:37] Loading credentials for authentication from
'/tmp/Endpoint_SlaveEndpointTest_UnauthorizedRequest_1_YdfZNC/http_credentials'
I0209 14:27:57.081377 30464 http.cpp:919] Using default 'basic' HTTP authenticator for realm
'mesos-agent-readonly'
I0209 14:27:57.081542 30464 http.cpp:919] Using default 'basic' HTTP authenticator for realm
'mesos-agent-readwrite'
I0209 14:27:57.082803 30464 slave.cpp:541] Agent resources: cpus(*):2; mem(*):1024; disk(*):1024;
ports(*):[31000-32000]
I0209 14:27:57.082886 30464 slave.cpp:549] Agent attributes: [  ]
I0209 14:27:57.082908 30464 slave.cpp:554] Agent hostname: 697c2b890581
I0209 14:27:57.083052 30475 status_update_manager.cpp:177] Pausing sending status updates
I0209 14:27:57.084746 30473 state.cpp:62] Recovering state from '/tmp/Endpoint_SlaveEndpointTest_UnauthorizedRequest_1_dx8nOe/meta'
I0209 14:27:57.085055 30465 status_update_manager.cpp:203] Recovering status update manager
I0209 14:27:57.085271 30468 containerizer.cpp:599] Recovering containerizer
I0209 14:27:57.086585 30475 provisioner.cpp:410] Provisioner recovery complete
I0209 14:27:57.086971 30460 slave.cpp:5555] Finished recovery
I0209 14:27:57.087453 30460 slave.cpp:5729] Querying resource estimator for oversubscribable
resources
I0209 14:27:57.087748 30472 slave.cpp:5743] Received oversubscribable resources {} from the
resource estimator
I0209 14:27:57.090528 30461 process.cpp:3704] Handling HTTP event for process 'slave(697)'
with path: '/slave(697)/monitor/statistics.json'
I0209 14:27:57.091735 30473 http.cpp:871] Authorizing principal 'test-principal' to GET the
'/monitor/statistics.json' endpoint
I0209 14:27:57.094203 30472 slave.cpp:803] Agent terminating
[       OK ] Endpoint/SlaveEndpointTest.UnauthorizedRequest/1 (27 ms)
[ RUN      ] Endpoint/SlaveEndpointTest.UnauthorizedRequest/2
I0209 14:27:57.104125 30441 containerizer.cpp:220] Using isolation: posix/cpu,posix/mem,filesystem/posix,network/cni
W0209 14:27:57.104722 30441 backend.cpp:76] Failed to create 'aufs' backend: AufsBackend requires
root privileges
W0209 14:27:57.104849 30441 backend.cpp:76] Failed to create 'bind' backend: BindBackend requires
root privileges
I0209 14:27:57.104934 30441 provisioner.cpp:249] Using default backend 'copy'
I0209 14:27:57.108270 30475 slave.cpp:211] Mesos agent started on (698)@172.17.0.2:47938
I0209 14:27:57.108433 30475 slave.cpp:212] Flags at startup: --acls="" --appc_simple_discovery_uri_prefix="http://"
--appc_store_dir="/tmp/mesos/store/appc" --authenticate_http_readonly="true" --authenticate_http_readwrite="true"
--authenticatee="crammd5" --authentication_backoff_factor="1secs" --authorizer="local" --cgroups_cpu_enable_pids_and_tids_count="false"
--cgroups_enable_cfs="false" --cgroups_hierarchy="/sys/fs/cgroup" --cgroups_limit_swap="false"
--cgroups_root="mesos" --container_disk_watch_interval="15secs" --containerizers="mesos" --credential="/tmp/Endpoint_SlaveEndpointTest_UnauthorizedRequest_2_3vTq1a/credential"
--default_role="*" --disk_watch_interval="1mins" --docker="docker" --docker_kill_orphans="true"
--docker_registry="https://registry-1.docker.io" --docker_remove_delay="6hrs" --docker_socket="/var/run/docker.sock"
--docker_stop_timeout="0ns" --docker_store_dir="/tmp/mesos/store/docker" --docker_volume_checkpoint_dir="/var/run/mesos/isolators/docker/volume"
--enforce_container_disk_quota="false" --executor_registration_timeout="1mins" --executor_shutdown_grace_period="5secs"
--fetcher_cache_dir="/tmp/Endpoint_SlaveEndpointTest_UnauthorizedRequest_2_3vTq1a/fetch" --fetcher_cache_size="2GB"
--frameworks_home="" --gc_delay="1weeks" --gc_disk_headroom="0.1" --hadoop_home="" --help="false"
--hostname_lookup="true" --http_authenticators="basic" --http_command_executor="false" --http_credentials="/tmp/Endpoint_SlaveEndpointTest_UnauthorizedRequest_2_3vTq1a/http_credentials"
--http_heartbeat_interval="30secs" --initialize_driver_logging="true" --isolation="posix/cpu,posix/mem"
--launcher="posix" --launcher_dir="/mesos/mesos-1.2.0/_build/src" --logbufsecs="0" --logging_level="INFO"
--max_completed_executors_per_framework="150" --oversubscribed_resources_interval="15secs"
--perf_duration="10secs" --perf_interval="1mins" --qos_correction_interval_min="0ns" --quiet="false"
--recover="reconnect" --recovery_timeout="15mins" --registration_backoff_factor="10ms" --resources="cpus:2;gpus:0;mem:1024;disk:1024;ports:[31000-32000]"
--revocable_cpu_low_priority="true" --runtime_dir="/tmp/Endpoint_SlaveEndpointTest_UnauthorizedRequest_2_3vTq1a"
--sandbox_directory="/mnt/mesos/sandbox" --strict="true" --switch_user="true" --systemd_enable_support="true"
--systemd_runtime_directory="/run/systemd/system" --version="false" --work_dir="/tmp/Endpoint_SlaveEndpointTest_UnauthorizedRequest_2_kmOoXM"
I0209 14:27:57.108923 30475 credentials.hpp:86] Loading credential for authentication from
'/tmp/Endpoint_SlaveEndpointTest_UnauthorizedRequest_2_3vTq1a/credential'
I0209 14:27:57.109098 30475 slave.cpp:354] Agent using credential for: test-principal
I0209 14:27:57.109123 30475 credentials.hpp:37] Loading credentials for authentication from
'/tmp/Endpoint_SlaveEndpointTest_UnauthorizedRequest_2_3vTq1a/http_credentials'
I0209 14:27:57.109359 30475 http.cpp:919] Using default 'basic' HTTP authenticator for realm
'mesos-agent-readonly'
I0209 14:27:57.109506 30475 http.cpp:919] Using default 'basic' HTTP authenticator for realm
'mesos-agent-readwrite'
I0209 14:27:57.110676 30475 slave.cpp:541] Agent resources: cpus(*):2; mem(*):1024; disk(*):1024;
ports(*):[31000-32000]
I0209 14:27:57.110755 30475 slave.cpp:549] Agent attributes: [  ]
I0209 14:27:57.110775 30475 slave.cpp:554] Agent hostname: 697c2b890581
I0209 14:27:57.110910 30467 status_update_manager.cpp:177] Pausing sending status updates
I0209 14:27:57.112354 30474 state.cpp:62] Recovering state from '/tmp/Endpoint_SlaveEndpointTest_UnauthorizedRequest_2_kmOoXM/meta'
I0209 14:27:57.112745 30463 status_update_manager.cpp:203] Recovering status update manager
I0209 14:27:57.112958 30463 containerizer.cpp:599] Recovering containerizer
I0209 14:27:57.114598 30463 provisioner.cpp:410] Provisioner recovery complete
I0209 14:27:57.115074 30463 slave.cpp:5555] Finished recovery
I0209 14:27:57.115491 30463 slave.cpp:5729] Querying resource estimator for oversubscribable
resources
I0209 14:27:57.116109 30463 slave.cpp:5743] Received oversubscribable resources {} from the
resource estimator
I0209 14:27:57.118937 30466 process.cpp:3704] Handling HTTP event for process 'slave(698)'
with path: '/slave(698)/containers'
I0209 14:27:57.120262 30464 http.cpp:871] Authorizing principal 'test-principal' to GET the
'/containers' endpoint
I0209 14:27:57.126289 30470 slave.cpp:803] Agent terminating
[       OK ] Endpoint/SlaveEndpointTest.UnauthorizedRequest/2 (35 ms)
[ RUN      ] Endpoint/SlaveEndpointTest.NoAuthorizer/0
I0209 14:27:57.139089 30441 containerizer.cpp:220] Using isolation: posix/cpu,posix/mem,filesystem/posix,network/cni
W0209 14:27:57.139652 30441 backend.cpp:76] Failed to create 'aufs' backend: AufsBackend requires
root privileges
W0209 14:27:57.139770 30441 backend.cpp:76] Failed to create 'bind' backend: BindBackend requires
root privileges
I0209 14:27:57.139808 30441 provisioner.cpp:249] Using default backend 'copy'
I0209 14:27:57.141635 30441 cluster.cpp:446] Creating default 'local' authorizer
I0209 14:27:57.143381 30473 slave.cpp:211] Mesos agent started on (699)@172.17.0.2:47938
I0209 14:27:57.143419 30473 slave.cpp:212] Flags at startup: --acls="" --appc_simple_discovery_uri_prefix="http://"
--appc_store_dir="/tmp/mesos/store/appc" --authenticate_http_readonly="true" --authenticate_http_readwrite="true"
--authenticatee="crammd5" --authentication_backoff_factor="1secs" --authorizer="local" --cgroups_cpu_enable_pids_and_tids_count="false"
--cgroups_enable_cfs="false" --cgroups_hierarchy="/sys/fs/cgroup" --cgroups_limit_swap="false"
--cgroups_root="mesos" --container_disk_watch_interval="15secs" --containerizers="mesos" --credential="/tmp/Endpoint_SlaveEndpointTest_NoAuthorizer_0_VDSvAJ/credential"
--default_role="*" --disk_watch_interval="1mins" --docker="docker" --docker_kill_orphans="true"
--docker_registry="https://registry-1.docker.io" --docker_remove_delay="6hrs" --docker_socket="/var/run/docker.sock"
--docker_stop_timeout="0ns" --docker_store_dir="/tmp/mesos/store/docker" --docker_volume_checkpoint_dir="/var/run/mesos/isolators/docker/volume"
--enforce_container_disk_quota="false" --executor_registration_timeout="1mins" --executor_shutdown_grace_period="5secs"
--fetcher_cache_dir="/tmp/Endpoint_SlaveEndpointTest_NoAuthorizer_0_VDSvAJ/fetch" --fetcher_cache_size="2GB"
--frameworks_home="" --gc_delay="1weeks" --gc_disk_headroom="0.1" --hadoop_home="" --help="false"
--hostname_lookup="true" --http_authenticators="basic" --http_command_executor="false" --http_credentials="/tmp/Endpoint_SlaveEndpointTest_NoAuthorizer_0_VDSvAJ/http_credentials"
--http_heartbeat_interval="30secs" --initialize_driver_logging="true" --isolation="posix/cpu,posix/mem"
--launcher="posix" --launcher_dir="/mesos/mesos-1.2.0/_build/src" --logbufsecs="0" --logging_level="INFO"
--max_completed_executors_per_framework="150" --oversubscribed_resources_interval="15secs"
--perf_duration="10secs" --perf_interval="1mins" --qos_correction_interval_min="0ns" --quiet="false"
--recover="reconnect" --recovery_timeout="15mins" --registration_backoff_factor="10ms" --resources="cpus:2;gpus:0;mem:1024;disk:1024;ports:[31000-32000]"
--revocable_cpu_low_priority="true" --runtime_dir="/tmp/Endpoint_SlaveEndpointTest_NoAuthorizer_0_VDSvAJ"
--sandbox_directory="/mnt/mesos/sandbox" --strict="true" --switch_user="true" --systemd_enable_support="true"
--systemd_runtime_directory="/run/systemd/system" --version="false" --work_dir="/tmp/Endpoint_SlaveEndpointTest_NoAuthorizer_0_6xMNql"
I0209 14:27:57.144068 30473 credentials.hpp:86] Loading credential for authentication from
'/tmp/Endpoint_SlaveEndpointTest_NoAuthorizer_0_VDSvAJ/credential'
I0209 14:27:57.144246 30473 slave.cpp:354] Agent using credential for: test-principal
I0209 14:27:57.144268 30473 credentials.hpp:37] Loading credentials for authentication from
'/tmp/Endpoint_SlaveEndpointTest_NoAuthorizer_0_VDSvAJ/http_credentials'
I0209 14:27:57.144490 30473 http.cpp:919] Using default 'basic' HTTP authenticator for realm
'mesos-agent-readonly'
I0209 14:27:57.144695 30473 http.cpp:919] Using default 'basic' HTTP authenticator for realm
'mesos-agent-readwrite'
I0209 14:27:57.146085 30473 slave.cpp:541] Agent resources: cpus(*):2; mem(*):1024; disk(*):1024;
ports(*):[31000-32000]
I0209 14:27:57.146164 30473 slave.cpp:549] Agent attributes: [  ]
I0209 14:27:57.146178 30473 slave.cpp:554] Agent hostname: 697c2b890581
I0209 14:27:57.146318 30464 status_update_manager.cpp:177] Pausing sending status updates
I0209 14:27:57.147730 30461 state.cpp:62] Recovering state from '/tmp/Endpoint_SlaveEndpointTest_NoAuthorizer_0_6xMNql/meta'
I0209 14:27:57.147984 30460 status_update_manager.cpp:203] Recovering status update manager
I0209 14:27:57.148293 30467 containerizer.cpp:599] Recovering containerizer
I0209 14:27:57.149832 30469 provisioner.cpp:410] Provisioner recovery complete
I0209 14:27:57.150279 30468 slave.cpp:5555] Finished recovery
I0209 14:27:57.150836 30468 slave.cpp:5729] Querying resource estimator for oversubscribable
resources
I0209 14:27:57.151111 30473 slave.cpp:5743] Received oversubscribable resources {} from the
resource estimator
I0209 14:27:57.154682 30473 process.cpp:3704] Handling HTTP event for process 'slave(699)'
with path: '/slave(699)/monitor/statistics'
I0209 14:27:57.156232 30467 http.cpp:871] Authorizing principal 'test-principal' to GET the
'/monitor/statistics' endpoint
I0209 14:27:57.160183 30462 slave.cpp:803] Agent terminating
[       OK ] Endpoint/SlaveEndpointTest.NoAuthorizer/0 (31 ms)
[ RUN      ] Endpoint/SlaveEndpointTest.NoAuthorizer/1
I0209 14:27:57.170526 30441 containerizer.cpp:220] Using isolation: posix/cpu,posix/mem,filesystem/posix,network/cni
W0209 14:27:57.171002 30441 backend.cpp:76] Failed to create 'aufs' backend: AufsBackend requires
root privileges
W0209 14:27:57.171104 30441 backend.cpp:76] Failed to create 'bind' backend: BindBackend requires
root privileges
I0209 14:27:57.171145 30441 provisioner.cpp:249] Using default backend 'copy'
I0209 14:27:57.172839 30441 cluster.cpp:446] Creating default 'local' authorizer
I0209 14:27:57.174461 30465 slave.cpp:211] Mesos agent started on (700)@172.17.0.2:47938
I0209 14:27:57.174491 30465 slave.cpp:212] Flags at startup: --acls="" --appc_simple_discovery_uri_prefix="http://"
--appc_store_dir="/tmp/mesos/store/appc" --authenticate_http_readonly="true" --authenticate_http_readwrite="true"
--authenticatee="crammd5" --authentication_backoff_factor="1secs" --authorizer="local" --cgroups_cpu_enable_pids_and_tids_count="false"
--cgroups_enable_cfs="false" --cgroups_hierarchy="/sys/fs/cgroup" --cgroups_limit_swap="false"
--cgroups_root="mesos" --container_disk_watch_interval="15secs" --containerizers="mesos" --credential="/tmp/Endpoint_SlaveEndpointTest_NoAuthorizer_1_7RPwui/credential"
--default_role="*" --disk_watch_interval="1mins" --docker="docker" --docker_kill_orphans="true"
--docker_registry="https://registry-1.docker.io" --docker_remove_delay="6hrs" --docker_socket="/var/run/docker.sock"
--docker_stop_timeout="0ns" --docker_store_dir="/tmp/mesos/store/docker" --docker_volume_checkpoint_dir="/var/run/mesos/isolators/docker/volume"
--enforce_container_disk_quota="false" --executor_registration_timeout="1mins" --executor_shutdown_grace_period="5secs"
--fetcher_cache_dir="/tmp/Endpoint_SlaveEndpointTest_NoAuthorizer_1_7RPwui/fetch" --fetcher_cache_size="2GB"
--frameworks_home="" --gc_delay="1weeks" --gc_disk_headroom="0.1" --hadoop_home="" --help="false"
--hostname_lookup="true" --http_authenticators="basic" --http_command_executor="false" --http_credentials="/tmp/Endpoint_SlaveEndpointTest_NoAuthorizer_1_7RPwui/http_credentials"
--http_heartbeat_interval="30secs" --initialize_driver_logging="true" --isolation="posix/cpu,posix/mem"
--launcher="posix" --launcher_dir="/mesos/mesos-1.2.0/_build/src" --logbufsecs="0" --logging_level="INFO"
--max_completed_executors_per_framework="150" --oversubscribed_resources_interval="15secs"
--perf_duration="10secs" --perf_interval="1mins" --qos_correction_interval_min="0ns" --quiet="false"
--recover="reconnect" --recovery_timeout="15mins" --registration_backoff_factor="10ms" --resources="cpus:2;gpus:0;mem:1024;disk:1024;ports:[31000-32000]"
--revocable_cpu_low_priority="true" --runtime_dir="/tmp/Endpoint_SlaveEndpointTest_NoAuthorizer_1_7RPwui"
--sandbox_directory="/mnt/mesos/sandbox" --strict="true" --switch_user="true" --systemd_enable_support="true"
--systemd_runtime_directory="/run/systemd/system" --version="false" --work_dir="/tmp/Endpoint_SlaveEndpointTest_NoAuthorizer_1_y9oLfU"
I0209 14:27:57.175137 30465 credentials.hpp:86] Loading credential for authentication from
'/tmp/Endpoint_SlaveEndpointTest_NoAuthorizer_1_7RPwui/credential'
I0209 14:27:57.175310 30465 slave.cpp:354] Agent using credential for: test-principal
I0209 14:27:57.175333 30465 credentials.hpp:37] Loading credentials for authentication from
'/tmp/Endpoint_SlaveEndpointTest_NoAuthorizer_1_7RPwui/http_credentials'
I0209 14:27:57.175559 30465 http.cpp:919] Using default 'basic' HTTP authenticator for realm
'mesos-agent-readonly'
I0209 14:27:57.175709 30465 http.cpp:919] Using default 'basic' HTTP authenticator for realm
'mesos-agent-readwrite'
I0209 14:27:57.176921 30465 slave.cpp:541] Agent resources: cpus(*):2; mem(*):1024; disk(*):1024;
ports(*):[31000-32000]
I0209 14:27:57.177000 30465 slave.cpp:549] Agent attributes: [  ]
I0209 14:27:57.177013 30465 slave.cpp:554] Agent hostname: 697c2b890581
I0209 14:27:57.177146 30469 status_update_manager.cpp:177] Pausing sending status updates
I0209 14:27:57.178664 30467 state.cpp:62] Recovering state from '/tmp/Endpoint_SlaveEndpointTest_NoAuthorizer_1_y9oLfU/meta'
I0209 14:27:57.179033 30470 status_update_manager.cpp:203] Recovering status update manager
I0209 14:27:57.179365 30464 containerizer.cpp:599] Recovering containerizer
I0209 14:27:57.181036 30460 provisioner.cpp:410] Provisioner recovery complete
I0209 14:27:57.181529 30463 slave.cpp:5555] Finished recovery
I0209 14:27:57.182034 30463 slave.cpp:5729] Querying resource estimator for oversubscribable
resources
I0209 14:27:57.182343 30465 slave.cpp:5743] Received oversubscribable resources {} from the
resource estimator
I0209 14:27:57.185287 30466 process.cpp:3704] Handling HTTP event for process 'slave(700)'
with path: '/slave(700)/monitor/statistics.json'
I0209 14:27:57.186758 30475 http.cpp:871] Authorizing principal 'test-principal' to GET the
'/monitor/statistics.json' endpoint
I0209 14:27:57.190487 30472 slave.cpp:803] Agent terminating
[       OK ] Endpoint/SlaveEndpointTest.NoAuthorizer/1 (30 ms)
[ RUN      ] Endpoint/SlaveEndpointTest.NoAuthorizer/2
I0209 14:27:57.200532 30441 containerizer.cpp:220] Using isolation: posix/cpu,posix/mem,filesystem/posix,network/cni
W0209 14:27:57.201129 30441 backend.cpp:76] Failed to create 'aufs' backend: AufsBackend requires
root privileges
W0209 14:27:57.201244 30441 backend.cpp:76] Failed to create 'bind' backend: BindBackend requires
root privileges
I0209 14:27:57.201287 30441 provisioner.cpp:249] Using default backend 'copy'
I0209 14:27:57.203032 30441 cluster.cpp:446] Creating default 'local' authorizer
I0209 14:27:57.204674 30473 slave.cpp:211] Mesos agent started on (701)@172.17.0.2:47938
I0209 14:27:57.204704 30473 slave.cpp:212] Flags at startup: --acls="" --appc_simple_discovery_uri_prefix="http://"
--appc_store_dir="/tmp/mesos/store/appc" --authenticate_http_readonly="true" --authenticate_http_readwrite="true"
--authenticatee="crammd5" --authentication_backoff_factor="1secs" --authorizer="local" --cgroups_cpu_enable_pids_and_tids_count="false"
--cgroups_enable_cfs="false" --cgroups_hierarchy="/sys/fs/cgroup" --cgroups_limit_swap="false"
--cgroups_root="mesos" --container_disk_watch_interval="15secs" --containerizers="mesos" --credential="/tmp/Endpoint_SlaveEndpointTest_NoAuthorizer_2_ZlmkIR/credential"
--default_role="*" --disk_watch_interval="1mins" --docker="docker" --docker_kill_orphans="true"
--docker_registry="https://registry-1.docker.io" --docker_remove_delay="6hrs" --docker_socket="/var/run/docker.sock"
--docker_stop_timeout="0ns" --docker_store_dir="/tmp/mesos/store/docker" --docker_volume_checkpoint_dir="/var/run/mesos/isolators/docker/volume"
--enforce_container_disk_quota="false" --executor_registration_timeout="1mins" --executor_shutdown_grace_period="5secs"
--fetcher_cache_dir="/tmp/Endpoint_SlaveEndpointTest_NoAuthorizer_2_ZlmkIR/fetch" --fetcher_cache_size="2GB"
--frameworks_home="" --gc_delay="1weeks" --gc_disk_headroom="0.1" --hadoop_home="" --help="false"
--hostname_lookup="true" --http_authenticators="basic" --http_command_executor="false" --http_credentials="/tmp/Endpoint_SlaveEndpointTest_NoAuthorizer_2_ZlmkIR/http_credentials"
--http_heartbeat_interval="30secs" --initialize_driver_logging="true" --isolation="posix/cpu,posix/mem"
--launcher="posix" --launcher_dir="/mesos/mesos-1.2.0/_build/src" --logbufsecs="0" --logging_level="INFO"
--max_completed_executors_per_framework="150" --oversubscribed_resources_interval="15secs"
--perf_duration="10secs" --perf_interval="1mins" --qos_correction_interval_min="0ns" --quiet="false"
--recover="reconnect" --recovery_timeout="15mins" --registration_backoff_factor="10ms" --resources="cpus:2;gpus:0;mem:1024;disk:1024;ports:[31000-32000]"
--revocable_cpu_low_priority="true" --runtime_dir="/tmp/Endpoint_SlaveEndpointTest_NoAuthorizer_2_ZlmkIR"
--sandbox_directory="/mnt/mesos/sandbox" --strict="true" --switch_user="true" --systemd_enable_support="true"
--systemd_runtime_directory="/run/systemd/system" --version="false" --work_dir="/tmp/Endpoint_SlaveEndpointTest_NoAuthorizer_2_eNLDot"
I0209 14:27:57.205584 30473 credentials.hpp:86] Loading credential for authentication from
'/tmp/Endpoint_SlaveEndpointTest_NoAuthorizer_2_ZlmkIR/credential'
I0209 14:27:57.205974 30473 slave.cpp:354] Agent using credential for: test-principal
I0209 14:27:57.205999 30473 credentials.hpp:37] Loading credentials for authentication from
'/tmp/Endpoint_SlaveEndpointTest_NoAuthorizer_2_ZlmkIR/http_credentials'
I0209 14:27:57.206267 30473 http.cpp:919] Using default 'basic' HTTP authenticator for realm
'mesos-agent-readonly'
I0209 14:27:57.206444 30473 http.cpp:919] Using default 'basic' HTTP authenticator for realm
'mesos-agent-readwrite'
I0209 14:27:57.207656 30473 slave.cpp:541] Agent resources: cpus(*):2; mem(*):1024; disk(*):1024;
ports(*):[31000-32000]
I0209 14:27:57.207736 30473 slave.cpp:549] Agent attributes: [  ]
I0209 14:27:57.207749 30473 slave.cpp:554] Agent hostname: 697c2b890581
I0209 14:27:57.207926 30470 status_update_manager.cpp:177] Pausing sending status updates
I0209 14:27:57.209271 30474 state.cpp:62] Recovering state from '/tmp/Endpoint_SlaveEndpointTest_NoAuthorizer_2_eNLDot/meta'
I0209 14:27:57.209604 30474 status_update_manager.cpp:203] Recovering status update manager
I0209 14:27:57.209797 30462 containerizer.cpp:599] Recovering containerizer
I0209 14:27:57.211403 30464 provisioner.cpp:410] Provisioner recovery complete
I0209 14:27:57.211763 30472 slave.cpp:5555] Finished recovery
I0209 14:27:57.212318 30472 slave.cpp:5729] Querying resource estimator for oversubscribable
resources
I0209 14:27:57.212631 30460 slave.cpp:5743] Received oversubscribable resources {} from the
resource estimator
I0209 14:27:57.215342 30468 process.cpp:3704] Handling HTTP event for process 'slave(701)'
with path: '/slave(701)/containers'
I0209 14:27:57.216994 30462 http.cpp:871] Authorizing principal 'test-principal' to GET the
'/containers' endpoint
I0209 14:27:57.221319 30467 slave.cpp:803] Agent terminating
[       OK ] Endpoint/SlaveEndpointTest.NoAuthorizer/2 (31 ms)
[----------] 9 tests from Endpoint/SlaveEndpointTest (299 ms total)

[----------] Global test environment tear-down
[==========] 1490 tests from 168 test cases ran. (449461 ms total)
[  PASSED  ] 1489 tests.
[  FAILED  ] 1 test, listed below:
[  FAILED  ] OversubscriptionTest.RescindRevocableOfferWithIncreasedRevocable

 1 FAILED TEST
  YOU HAVE 11 DISABLED TESTS

make[4]: *** [check-local] Error 1
make[4]: Leaving directory `/mesos/mesos-1.2.0/_build/src'
make[3]: *** [check-am] Error 2
make[3]: Leaving directory `/mesos/mesos-1.2.0/_build/src'
make[2]: *** [check] Error 2
make[2]: Leaving directory `/mesos/mesos-1.2.0/_build/src'
make[1]: *** [check-recursive] Error 1
make[1]: Leaving directory `/mesos/mesos-1.2.0/_build'
make: *** [distcheck] Error 1
+ docker rmi mesos-1486647656-12958
Untagged: mesos-1486647656-12958:latest
Deleted: sha256:e47ddfb15859e46ad7bc0f6475cc9cfe10ea616dbb727f70ea639ba86b9ca245
Deleted: sha256:9e7179d9ad73f105f836e14ad167ccebb660bb93a46bf59886b15f0168a27386
Deleted: sha256:4f79aead788f73312e385be5abbf11c8a688705fec6dd8eb1a9386d6512a0c51
Deleted: sha256:94501862ad3fc636a69f21b6dcc71f23f09d2ae23a71bd4c1bfb1e6d3f8bfe58
Deleted: sha256:97a0fc5493fc7dc6ccabd27d51433b4fba2f4b47ec061d83cf5bea40e39bd6ba
Deleted: sha256:09e1dcf8f37d5a57ada64b46f4f61276182ef8f37f89422883be2da03ef8a019
Deleted: sha256:74fa947d1fef58bd5ee3d727875026b5cacc3dcd9fb7df1677cf94eec8e5d3d8
Deleted: sha256:6ebc993b86a6adffc6c787b4db6e519905ac26e131edba87d77889b517efcac9
Deleted: sha256:294d8e7f512b89dac3803eeace47841909f37a609486116625822ca496416618
Deleted: sha256:3b402287d2a43d95e9c5c06376657a484690acdc9cd6d087d3d9f8cf92ca4bee
Deleted: sha256:ec598c90894996ca2074377eca4d5fa8dd1ed4f294d45cbd1a89b5243bc5b487
Deleted: sha256:efa916bb5036755370a178377be7da35196f127e71c459ee4b9bbb65a0ed53d2
Deleted: sha256:5c298d892aefb09639bd1454f065e2503f42e9f59d60e095a4c27533728f6b81
Deleted: sha256:5172e94e1cdb2f844bb36f9aa555898193f2ae70d9c87fb1adec13c86f7df59e
Deleted: sha256:945ef8451c5597746ee12df074a0ca6ee1df41ab5a53e6f62522b87e44bc80d6
Deleted: sha256:56a37b29177a5c89134943bd24cc59c4e4b240d466bcf69fe929cecfbc11d57a
Deleted: sha256:45f875bc1653ccbcf28497b9a1e5dfa5ad01c3d78c56b1d28a8b6049fd4bddfd
Deleted: sha256:b050c6de02ac7b250cc807941a0e2c1eac41097f47798abf17010082024dd02b
Deleted: sha256:8233e00a9e0dab0d4ad4eb6f179f06367ddab0b175817e9b8e5e37f6aa2c4a22
Deleted: sha256:177a46601e094b2942b6daa80b328574fd28cdff02cc8c34095e0f743c4d259f
Deleted: sha256:59288c89b1b7399e8fc7ea3d2176afaa6a4e5c9fbe412b977f743f6654da13b8
Deleted: sha256:8ed775920de1dc6780b4715626cf56570643512d14177497b2967bc073e51e85
Deleted: sha256:f12f324ff01ce5a9b9e6c00a14c506e369ce0ec2543f7284466cdc5da4ece2b8
Deleted: sha256:ce090fecd07ccb6e368c65748982fced4c120d4bb0b8e748633ea05dc473ab85
Build step 'Execute shell' marked build as failure

Mime
View raw message