mesos-builds mailing list archives

Site index · List index
Message view « Date » · « Thread »
Top « Date » · « Thread »
From Apache Jenkins Server <jenk...@builds.apache.org>
Subject Build failed in Jenkins: Mesos-Buildbot » autotools,gcc,--verbose,GLOG_v=1 MESOS_VERBOSE=1,centos:7,(docker||Hadoop)&&(!ubuntu-us1)&&(!ubuntu-eu2) #3217
Date Fri, 03 Feb 2017 21:42:48 GMT
See <https://builds.apache.org/job/Mesos-Buildbot/BUILDTOOL=autotools,COMPILER=gcc,CONFIGURATION=--verbose,ENVIRONMENT=GLOG_v=1%20MESOS_VERBOSE=1,OS=centos%3A7,label_exp=(docker%7C%7CHadoop)&&(!ubuntu-us1)&&(!ubuntu-eu2)/3217/changes>

Changes:

[mpark] Added `--3way` option to `support/apply-reviews.py`.

------------------------------------------
[...truncated 173712 lines...]
I0203 21:41:31.534034 31221 containerizer.cpp:599] Recovering containerizer
I0203 21:41:31.535728 31210 provisioner.cpp:410] Provisioner recovery complete
I0203 21:41:31.536352 31214 slave.cpp:5422] Finished recovery
I0203 21:41:31.536968 31214 slave.cpp:5596] Querying resource estimator for oversubscribable
resources
I0203 21:41:31.537297 31217 slave.cpp:5610] Received oversubscribable resources {} from the
resource estimator
I0203 21:41:31.540336 31213 process.cpp:3697] Handling HTTP event for process 'slave(685)'
with path: '/slave(685)/monitor/statistics.json'
I0203 21:41:31.541893 31209 http.cpp:871] Authorizing principal 'test-principal' to GET the
'/monitor/statistics.json' endpoint
I0203 21:41:31.546838 31213 slave.cpp:801] Agent terminating
[       OK ] Endpoint/SlaveEndpointTest.AuthorizedRequest/1 (33 ms)
[ RUN      ] Endpoint/SlaveEndpointTest.AuthorizedRequest/2
I0203 21:41:31.558277 31189 containerizer.cpp:220] Using isolation: posix/cpu,posix/mem,filesystem/posix,network/cni
W0203 21:41:31.558830 31189 backend.cpp:76] Failed to create 'aufs' backend: AufsBackend requires
root privileges
W0203 21:41:31.558936 31189 backend.cpp:76] Failed to create 'bind' backend: BindBackend requires
root privileges
I0203 21:41:31.558980 31189 provisioner.cpp:249] Using default backend 'copy'
I0203 21:41:31.562744 31210 slave.cpp:209] Mesos agent started on (686)@172.17.0.2:36384
I0203 21:41:31.562765 31210 slave.cpp:210] Flags at startup: --acls="" --appc_simple_discovery_uri_prefix="http://"
--appc_store_dir="/tmp/mesos/store/appc" --authenticate_http_readonly="true" --authenticate_http_readwrite="true"
--authenticatee="crammd5" --authentication_backoff_factor="1secs" --authorizer="local" --cgroups_cpu_enable_pids_and_tids_count="false"
--cgroups_enable_cfs="false" --cgroups_hierarchy="/sys/fs/cgroup" --cgroups_limit_swap="false"
--cgroups_root="mesos" --container_disk_watch_interval="15secs" --containerizers="mesos" --credential="/tmp/Endpoint_SlaveEndpointTest_AuthorizedRequest_2_HpxhFY/credential"
--default_role="*" --disk_watch_interval="1mins" --docker="docker" --docker_kill_orphans="true"
--docker_registry="https://registry-1.docker.io" --docker_remove_delay="6hrs" --docker_socket="/var/run/docker.sock"
--docker_stop_timeout="0ns" --docker_store_dir="/tmp/mesos/store/docker" --docker_volume_checkpoint_dir="/var/run/mesos/isolators/docker/volume"
--enforce_container_disk_quota="false" --executor_registration_timeout="1mins" --executor_shutdown_grace_period="5secs"
--fetcher_cache_dir="/tmp/Endpoint_SlaveEndpointTest_AuthorizedRequest_2_HpxhFY/fetch" --fetcher_cache_size="2GB"
--frameworks_home="" --gc_delay="1weeks" --gc_disk_headroom="0.1" --hadoop_home="" --help="false"
--hostname_lookup="true" --http_authenticators="basic" --http_command_executor="false" --http_credentials="/tmp/Endpoint_SlaveEndpointTest_AuthorizedRequest_2_HpxhFY/http_credentials"
--http_heartbeat_interval="30secs" --initialize_driver_logging="true" --isolation="posix/cpu,posix/mem"
--launcher="posix" --launcher_dir="/mesos/mesos-1.2.0/_build/src" --logbufsecs="0" --logging_level="INFO"
--max_completed_executors_per_framework="150" --oversubscribed_resources_interval="15secs"
--perf_duration="10secs" --perf_interval="1mins" --qos_correction_interval_min="0ns" --quiet="false"
--recover="reconnect" --recovery_timeout="15mins" --registration_backoff_factor="10ms" --resources="cpus:2;gpus:0;mem:1024;disk:1024;ports:[31000-32000]"
--revocable_cpu_low_priority="true" --runtime_dir="/tmp/Endpoint_SlaveEndpointTest_AuthorizedRequest_2_HpxhFY"
--sandbox_directory="/mnt/mesos/sandbox" --strict="true" --switch_user="true" --systemd_enable_support="true"
--systemd_runtime_directory="/run/systemd/system" --version="false" --work_dir="/tmp/Endpoint_SlaveEndpointTest_AuthorizedRequest_2_iNo2Xk"
I0203 21:41:31.563349 31210 credentials.hpp:86] Loading credential for authentication from
'/tmp/Endpoint_SlaveEndpointTest_AuthorizedRequest_2_HpxhFY/credential'
I0203 21:41:31.563535 31210 slave.cpp:352] Agent using credential for: test-principal
I0203 21:41:31.563560 31210 credentials.hpp:37] Loading credentials for authentication from
'/tmp/Endpoint_SlaveEndpointTest_AuthorizedRequest_2_HpxhFY/http_credentials'
I0203 21:41:31.563807 31210 http.cpp:919] Using default 'basic' HTTP authenticator for realm
'mesos-agent-readonly'
I0203 21:41:31.563951 31210 http.cpp:919] Using default 'basic' HTTP authenticator for realm
'mesos-agent-readwrite'
I0203 21:41:31.565249 31210 slave.cpp:539] Agent resources: cpus(*):2; mem(*):1024; disk(*):1024;
ports(*):[31000-32000]
I0203 21:41:31.565332 31210 slave.cpp:547] Agent attributes: [  ]
I0203 21:41:31.565352 31210 slave.cpp:552] Agent hostname: 77cbf46f266b
I0203 21:41:31.565522 31213 status_update_manager.cpp:177] Pausing sending status updates
I0203 21:41:31.567167 31209 state.cpp:60] Recovering state from '/tmp/Endpoint_SlaveEndpointTest_AuthorizedRequest_2_iNo2Xk/meta'
I0203 21:41:31.567641 31217 status_update_manager.cpp:203] Recovering status update manager
I0203 21:41:31.567868 31222 containerizer.cpp:599] Recovering containerizer
I0203 21:41:31.569501 31216 provisioner.cpp:410] Provisioner recovery complete
I0203 21:41:31.569921 31215 slave.cpp:5422] Finished recovery
I0203 21:41:31.570581 31215 slave.cpp:5596] Querying resource estimator for oversubscribable
resources
I0203 21:41:31.570935 31217 slave.cpp:5610] Received oversubscribable resources {} from the
resource estimator
I0203 21:41:31.573962 31221 process.cpp:3697] Handling HTTP event for process 'slave(686)'
with path: '/slave(686)/containers'
I0203 21:41:31.575348 31215 http.cpp:871] Authorizing principal 'test-principal' to GET the
'/containers' endpoint
I0203 21:41:31.579385 31209 slave.cpp:801] Agent terminating
[       OK ] Endpoint/SlaveEndpointTest.AuthorizedRequest/2 (31 ms)
[ RUN      ] Endpoint/SlaveEndpointTest.UnauthorizedRequest/0
I0203 21:41:31.590574 31189 containerizer.cpp:220] Using isolation: posix/cpu,posix/mem,filesystem/posix,network/cni
W0203 21:41:31.591097 31189 backend.cpp:76] Failed to create 'aufs' backend: AufsBackend requires
root privileges
W0203 21:41:31.591203 31189 backend.cpp:76] Failed to create 'bind' backend: BindBackend requires
root privileges
I0203 21:41:31.591239 31189 provisioner.cpp:249] Using default backend 'copy'
I0203 21:41:31.595034 31217 slave.cpp:209] Mesos agent started on (687)@172.17.0.2:36384
I0203 21:41:31.595059 31217 slave.cpp:210] Flags at startup: --acls="" --appc_simple_discovery_uri_prefix="http://"
--appc_store_dir="/tmp/mesos/store/appc" --authenticate_http_readonly="true" --authenticate_http_readwrite="true"
--authenticatee="crammd5" --authentication_backoff_factor="1secs" --authorizer="local" --cgroups_cpu_enable_pids_and_tids_count="false"
--cgroups_enable_cfs="false" --cgroups_hierarchy="/sys/fs/cgroup" --cgroups_limit_swap="false"
--cgroups_root="mesos" --container_disk_watch_interval="15secs" --containerizers="mesos" --credential="/tmp/Endpoint_SlaveEndpointTest_UnauthorizedRequest_0_jY1UJx/credential"
--default_role="*" --disk_watch_interval="1mins" --docker="docker" --docker_kill_orphans="true"
--docker_registry="https://registry-1.docker.io" --docker_remove_delay="6hrs" --docker_socket="/var/run/docker.sock"
--docker_stop_timeout="0ns" --docker_store_dir="/tmp/mesos/store/docker" --docker_volume_checkpoint_dir="/var/run/mesos/isolators/docker/volume"
--enforce_container_disk_quota="false" --executor_registration_timeout="1mins" --executor_shutdown_grace_period="5secs"
--fetcher_cache_dir="/tmp/Endpoint_SlaveEndpointTest_UnauthorizedRequest_0_jY1UJx/fetch" --fetcher_cache_size="2GB"
--frameworks_home="" --gc_delay="1weeks" --gc_disk_headroom="0.1" --hadoop_home="" --help="false"
--hostname_lookup="true" --http_authenticators="basic" --http_command_executor="false" --http_credentials="/tmp/Endpoint_SlaveEndpointTest_UnauthorizedRequest_0_jY1UJx/http_credentials"
--http_heartbeat_interval="30secs" --initialize_driver_logging="true" --isolation="posix/cpu,posix/mem"
--launcher="posix" --launcher_dir="/mesos/mesos-1.2.0/_build/src" --logbufsecs="0" --logging_level="INFO"
--max_completed_executors_per_framework="150" --oversubscribed_resources_interval="15secs"
--perf_duration="10secs" --perf_interval="1mins" --qos_correction_interval_min="0ns" --quiet="false"
--recover="reconnect" --recovery_timeout="15mins" --registration_backoff_factor="10ms" --resources="cpus:2;gpus:0;mem:1024;disk:1024;ports:[31000-32000]"
--revocable_cpu_low_priority="true" --runtime_dir="/tmp/Endpoint_SlaveEndpointTest_UnauthorizedRequest_0_jY1UJx"
--sandbox_directory="/mnt/mesos/sandbox" --strict="true" --switch_user="true" --systemd_enable_support="true"
--systemd_runtime_directory="/run/systemd/system" --version="false" --work_dir="/tmp/Endpoint_SlaveEndpointTest_UnauthorizedRequest_0_Y7hrXT"
I0203 21:41:31.595650 31217 credentials.hpp:86] Loading credential for authentication from
'/tmp/Endpoint_SlaveEndpointTest_UnauthorizedRequest_0_jY1UJx/credential'
I0203 21:41:31.595834 31217 slave.cpp:352] Agent using credential for: test-principal
I0203 21:41:31.595859 31217 credentials.hpp:37] Loading credentials for authentication from
'/tmp/Endpoint_SlaveEndpointTest_UnauthorizedRequest_0_jY1UJx/http_credentials'
I0203 21:41:31.596098 31217 http.cpp:919] Using default 'basic' HTTP authenticator for realm
'mesos-agent-readonly'
I0203 21:41:31.596256 31217 http.cpp:919] Using default 'basic' HTTP authenticator for realm
'mesos-agent-readwrite'
I0203 21:41:31.597540 31217 slave.cpp:539] Agent resources: cpus(*):2; mem(*):1024; disk(*):1024;
ports(*):[31000-32000]
I0203 21:41:31.597622 31217 slave.cpp:547] Agent attributes: [  ]
I0203 21:41:31.597635 31217 slave.cpp:552] Agent hostname: 77cbf46f266b
I0203 21:41:31.597842 31221 status_update_manager.cpp:177] Pausing sending status updates
I0203 21:41:31.599503 31213 state.cpp:60] Recovering state from '/tmp/Endpoint_SlaveEndpointTest_UnauthorizedRequest_0_Y7hrXT/meta'
I0203 21:41:31.599843 31220 status_update_manager.cpp:203] Recovering status update manager
I0203 21:41:31.600075 31220 containerizer.cpp:599] Recovering containerizer
I0203 21:41:31.601491 31209 provisioner.cpp:410] Provisioner recovery complete
I0203 21:41:31.601989 31218 slave.cpp:5422] Finished recovery
I0203 21:41:31.602635 31218 slave.cpp:5596] Querying resource estimator for oversubscribable
resources
I0203 21:41:31.603042 31215 slave.cpp:5610] Received oversubscribable resources {} from the
resource estimator
I0203 21:41:31.606041 31216 process.cpp:3697] Handling HTTP event for process 'slave(687)'
with path: '/slave(687)/monitor/statistics'
I0203 21:41:31.607645 31221 http.cpp:871] Authorizing principal 'test-principal' to GET the
'/monitor/statistics' endpoint
I0203 21:41:31.610165 31214 slave.cpp:801] Agent terminating
[       OK ] Endpoint/SlaveEndpointTest.UnauthorizedRequest/0 (30 ms)
[ RUN      ] Endpoint/SlaveEndpointTest.UnauthorizedRequest/1
I0203 21:41:31.622105 31189 containerizer.cpp:220] Using isolation: posix/cpu,posix/mem,filesystem/posix,network/cni
W0203 21:41:31.622750 31189 backend.cpp:76] Failed to create 'aufs' backend: AufsBackend requires
root privileges
W0203 21:41:31.622865 31189 backend.cpp:76] Failed to create 'bind' backend: BindBackend requires
root privileges
I0203 21:41:31.622906 31189 provisioner.cpp:249] Using default backend 'copy'
I0203 21:41:31.627122 31216 slave.cpp:209] Mesos agent started on (688)@172.17.0.2:36384
I0203 21:41:31.627166 31216 slave.cpp:210] Flags at startup: --acls="" --appc_simple_discovery_uri_prefix="http://"
--appc_store_dir="/tmp/mesos/store/appc" --authenticate_http_readonly="true" --authenticate_http_readwrite="true"
--authenticatee="crammd5" --authentication_backoff_factor="1secs" --authorizer="local" --cgroups_cpu_enable_pids_and_tids_count="false"
--cgroups_enable_cfs="false" --cgroups_hierarchy="/sys/fs/cgroup" --cgroups_limit_swap="false"
--cgroups_root="mesos" --container_disk_watch_interval="15secs" --containerizers="mesos" --credential="/tmp/Endpoint_SlaveEndpointTest_UnauthorizedRequest_1_TcvJ86/credential"
--default_role="*" --disk_watch_interval="1mins" --docker="docker" --docker_kill_orphans="true"
--docker_registry="https://registry-1.docker.io" --docker_remove_delay="6hrs" --docker_socket="/var/run/docker.sock"
--docker_stop_timeout="0ns" --docker_store_dir="/tmp/mesos/store/docker" --docker_volume_checkpoint_dir="/var/run/mesos/isolators/docker/volume"
--enforce_container_disk_quota="false" --executor_registration_timeout="1mins" --executor_shutdown_grace_period="5secs"
--fetcher_cache_dir="/tmp/Endpoint_SlaveEndpointTest_UnauthorizedRequest_1_TcvJ86/fetch" --fetcher_cache_size="2GB"
--frameworks_home="" --gc_delay="1weeks" --gc_disk_headroom="0.1" --hadoop_home="" --help="false"
--hostname_lookup="true" --http_authenticators="basic" --http_command_executor="false" --http_credentials="/tmp/Endpoint_SlaveEndpointTest_UnauthorizedRequest_1_TcvJ86/http_credentials"
--http_heartbeat_interval="30secs" --initialize_driver_logging="true" --isolation="posix/cpu,posix/mem"
--launcher="posix" --launcher_dir="/mesos/mesos-1.2.0/_build/src" --logbufsecs="0" --logging_level="INFO"
--max_completed_executors_per_framework="150" --oversubscribed_resources_interval="15secs"
--perf_duration="10secs" --perf_interval="1mins" --qos_correction_interval_min="0ns" --quiet="false"
--recover="reconnect" --recovery_timeout="15mins" --registration_backoff_factor="10ms" --resources="cpus:2;gpus:0;mem:1024;disk:1024;ports:[31000-32000]"
--revocable_cpu_low_priority="true" --runtime_dir="/tmp/Endpoint_SlaveEndpointTest_UnauthorizedRequest_1_TcvJ86"
--sandbox_directory="/mnt/mesos/sandbox" --strict="true" --switch_user="true" --systemd_enable_support="true"
--systemd_runtime_directory="/run/systemd/system" --version="false" --work_dir="/tmp/Endpoint_SlaveEndpointTest_UnauthorizedRequest_1_0bgfht"
I0203 21:41:31.627794 31216 credentials.hpp:86] Loading credential for authentication from
'/tmp/Endpoint_SlaveEndpointTest_UnauthorizedRequest_1_TcvJ86/credential'
I0203 21:41:31.628006 31216 slave.cpp:352] Agent using credential for: test-principal
I0203 21:41:31.628028 31216 credentials.hpp:37] Loading credentials for authentication from
'/tmp/Endpoint_SlaveEndpointTest_UnauthorizedRequest_1_TcvJ86/http_credentials'
I0203 21:41:31.628257 31216 http.cpp:919] Using default 'basic' HTTP authenticator for realm
'mesos-agent-readonly'
I0203 21:41:31.628427 31216 http.cpp:919] Using default 'basic' HTTP authenticator for realm
'mesos-agent-readwrite'
I0203 21:41:31.629829 31216 slave.cpp:539] Agent resources: cpus(*):2; mem(*):1024; disk(*):1024;
ports(*):[31000-32000]
I0203 21:41:31.629910 31216 slave.cpp:547] Agent attributes: [  ]
I0203 21:41:31.629923 31216 slave.cpp:552] Agent hostname: 77cbf46f266b
I0203 21:41:31.630061 31212 status_update_manager.cpp:177] Pausing sending status updates
I0203 21:41:31.631685 31215 state.cpp:60] Recovering state from '/tmp/Endpoint_SlaveEndpointTest_UnauthorizedRequest_1_0bgfht/meta'
I0203 21:41:31.632072 31220 status_update_manager.cpp:203] Recovering status update manager
I0203 21:41:31.632354 31223 containerizer.cpp:599] Recovering containerizer
I0203 21:41:31.633968 31217 provisioner.cpp:410] Provisioner recovery complete
I0203 21:41:31.634418 31222 slave.cpp:5422] Finished recovery
I0203 21:41:31.635026 31222 slave.cpp:5596] Querying resource estimator for oversubscribable
resources
I0203 21:41:31.635386 31218 slave.cpp:5610] Received oversubscribable resources {} from the
resource estimator
I0203 21:41:31.638381 31216 process.cpp:3697] Handling HTTP event for process 'slave(688)'
with path: '/slave(688)/monitor/statistics.json'
I0203 21:41:31.639896 31223 http.cpp:871] Authorizing principal 'test-principal' to GET the
'/monitor/statistics.json' endpoint
I0203 21:41:31.643151 31223 slave.cpp:801] Agent terminating
[       OK ] Endpoint/SlaveEndpointTest.UnauthorizedRequest/1 (32 ms)
[ RUN      ] Endpoint/SlaveEndpointTest.UnauthorizedRequest/2
I0203 21:41:31.654109 31189 containerizer.cpp:220] Using isolation: posix/cpu,posix/mem,filesystem/posix,network/cni
W0203 21:41:31.654811 31189 backend.cpp:76] Failed to create 'aufs' backend: AufsBackend requires
root privileges
W0203 21:41:31.654923 31189 backend.cpp:76] Failed to create 'bind' backend: BindBackend requires
root privileges
I0203 21:41:31.654963 31189 provisioner.cpp:249] Using default backend 'copy'
I0203 21:41:31.658707 31214 slave.cpp:209] Mesos agent started on (689)@172.17.0.2:36384
I0203 21:41:31.658751 31214 slave.cpp:210] Flags at startup: --acls="" --appc_simple_discovery_uri_prefix="http://"
--appc_store_dir="/tmp/mesos/store/appc" --authenticate_http_readonly="true" --authenticate_http_readwrite="true"
--authenticatee="crammd5" --authentication_backoff_factor="1secs" --authorizer="local" --cgroups_cpu_enable_pids_and_tids_count="false"
--cgroups_enable_cfs="false" --cgroups_hierarchy="/sys/fs/cgroup" --cgroups_limit_swap="false"
--cgroups_root="mesos" --container_disk_watch_interval="15secs" --containerizers="mesos" --credential="/tmp/Endpoint_SlaveEndpointTest_UnauthorizedRequest_2_39boSG/credential"
--default_role="*" --disk_watch_interval="1mins" --docker="docker" --docker_kill_orphans="true"
--docker_registry="https://registry-1.docker.io" --docker_remove_delay="6hrs" --docker_socket="/var/run/docker.sock"
--docker_stop_timeout="0ns" --docker_store_dir="/tmp/mesos/store/docker" --docker_volume_checkpoint_dir="/var/run/mesos/isolators/docker/volume"
--enforce_container_disk_quota="false" --executor_registration_timeout="1mins" --executor_shutdown_grace_period="5secs"
--fetcher_cache_dir="/tmp/Endpoint_SlaveEndpointTest_UnauthorizedRequest_2_39boSG/fetch" --fetcher_cache_size="2GB"
--frameworks_home="" --gc_delay="1weeks" --gc_disk_headroom="0.1" --hadoop_home="" --help="false"
--hostname_lookup="true" --http_authenticators="basic" --http_command_executor="false" --http_credentials="/tmp/Endpoint_SlaveEndpointTest_UnauthorizedRequest_2_39boSG/http_credentials"
--http_heartbeat_interval="30secs" --initialize_driver_logging="true" --isolation="posix/cpu,posix/mem"
--launcher="posix" --launcher_dir="/mesos/mesos-1.2.0/_build/src" --logbufsecs="0" --logging_level="INFO"
--max_completed_executors_per_framework="150" --oversubscribed_resources_interval="15secs"
--perf_duration="10secs" --perf_interval="1mins" --qos_correction_interval_min="0ns" --quiet="false"
--recover="reconnect" --recovery_timeout="15mins" --registration_backoff_factor="10ms" --resources="cpus:2;gpus:0;mem:1024;disk:1024;ports:[31000-32000]"
--revocable_cpu_low_priority="true" --runtime_dir="/tmp/Endpoint_SlaveEndpointTest_UnauthorizedRequest_2_39boSG"
--sandbox_directory="/mnt/mesos/sandbox" --strict="true" --switch_user="true" --systemd_enable_support="true"
--systemd_runtime_directory="/run/systemd/system" --version="false" --work_dir="/tmp/Endpoint_SlaveEndpointTest_UnauthorizedRequest_2_MrpIV2"
I0203 21:41:31.659653 31214 credentials.hpp:86] Loading credential for authentication from
'/tmp/Endpoint_SlaveEndpointTest_UnauthorizedRequest_2_39boSG/credential'
I0203 21:41:31.659871 31214 slave.cpp:352] Agent using credential for: test-principal
I0203 21:41:31.659893 31214 credentials.hpp:37] Loading credentials for authentication from
'/tmp/Endpoint_SlaveEndpointTest_UnauthorizedRequest_2_39boSG/http_credentials'
I0203 21:41:31.660121 31214 http.cpp:919] Using default 'basic' HTTP authenticator for realm
'mesos-agent-readonly'
I0203 21:41:31.660291 31214 http.cpp:919] Using default 'basic' HTTP authenticator for realm
'mesos-agent-readwrite'
I0203 21:41:31.661792 31214 slave.cpp:539] Agent resources: cpus(*):2; mem(*):1024; disk(*):1024;
ports(*):[31000-32000]
I0203 21:41:31.661876 31214 slave.cpp:547] Agent attributes: [  ]
I0203 21:41:31.661888 31214 slave.cpp:552] Agent hostname: 77cbf46f266b
I0203 21:41:31.662051 31219 status_update_manager.cpp:177] Pausing sending status updates
I0203 21:41:31.663848 31221 state.cpp:60] Recovering state from '/tmp/Endpoint_SlaveEndpointTest_UnauthorizedRequest_2_MrpIV2/meta'
I0203 21:41:31.664289 31209 status_update_manager.cpp:203] Recovering status update manager
I0203 21:41:31.664646 31223 containerizer.cpp:599] Recovering containerizer
I0203 21:41:31.666299 31216 provisioner.cpp:410] Provisioner recovery complete
I0203 21:41:31.666791 31221 slave.cpp:5422] Finished recovery
I0203 21:41:31.667253 31221 slave.cpp:5596] Querying resource estimator for oversubscribable
resources
I0203 21:41:31.667502 31215 slave.cpp:5610] Received oversubscribable resources {} from the
resource estimator
I0203 21:41:31.670413 31220 process.cpp:3697] Handling HTTP event for process 'slave(689)'
with path: '/slave(689)/containers'
I0203 21:41:31.671898 31215 http.cpp:871] Authorizing principal 'test-principal' to GET the
'/containers' endpoint
I0203 21:41:31.675009 31208 slave.cpp:801] Agent terminating
[       OK ] Endpoint/SlaveEndpointTest.UnauthorizedRequest/2 (31 ms)
[ RUN      ] Endpoint/SlaveEndpointTest.NoAuthorizer/0
I0203 21:41:31.686043 31189 containerizer.cpp:220] Using isolation: posix/cpu,posix/mem,filesystem/posix,network/cni
W0203 21:41:31.686496 31189 backend.cpp:76] Failed to create 'aufs' backend: AufsBackend requires
root privileges
W0203 21:41:31.686581 31189 backend.cpp:76] Failed to create 'bind' backend: BindBackend requires
root privileges
I0203 21:41:31.686611 31189 provisioner.cpp:249] Using default backend 'copy'
I0203 21:41:31.687993 31189 cluster.cpp:446] Creating default 'local' authorizer
I0203 21:41:31.689558 31208 slave.cpp:209] Mesos agent started on (690)@172.17.0.2:36384
I0203 21:41:31.689582 31208 slave.cpp:210] Flags at startup: --acls="" --appc_simple_discovery_uri_prefix="http://"
--appc_store_dir="/tmp/mesos/store/appc" --authenticate_http_readonly="true" --authenticate_http_readwrite="true"
--authenticatee="crammd5" --authentication_backoff_factor="1secs" --authorizer="local" --cgroups_cpu_enable_pids_and_tids_count="false"
--cgroups_enable_cfs="false" --cgroups_hierarchy="/sys/fs/cgroup" --cgroups_limit_swap="false"
--cgroups_root="mesos" --container_disk_watch_interval="15secs" --containerizers="mesos" --credential="/tmp/Endpoint_SlaveEndpointTest_NoAuthorizer_0_HcPLWg/credential"
--default_role="*" --disk_watch_interval="1mins" --docker="docker" --docker_kill_orphans="true"
--docker_registry="https://registry-1.docker.io" --docker_remove_delay="6hrs" --docker_socket="/var/run/docker.sock"
--docker_stop_timeout="0ns" --docker_store_dir="/tmp/mesos/store/docker" --docker_volume_checkpoint_dir="/var/run/mesos/isolators/docker/volume"
--enforce_container_disk_quota="false" --executor_registration_timeout="1mins" --executor_shutdown_grace_period="5secs"
--fetcher_cache_dir="/tmp/Endpoint_SlaveEndpointTest_NoAuthorizer_0_HcPLWg/fetch" --fetcher_cache_size="2GB"
--frameworks_home="" --gc_delay="1weeks" --gc_disk_headroom="0.1" --hadoop_home="" --help="false"
--hostname_lookup="true" --http_authenticators="basic" --http_command_executor="false" --http_credentials="/tmp/Endpoint_SlaveEndpointTest_NoAuthorizer_0_HcPLWg/http_credentials"
--http_heartbeat_interval="30secs" --initialize_driver_logging="true" --isolation="posix/cpu,posix/mem"
--launcher="posix" --launcher_dir="/mesos/mesos-1.2.0/_build/src" --logbufsecs="0" --logging_level="INFO"
--max_completed_executors_per_framework="150" --oversubscribed_resources_interval="15secs"
--perf_duration="10secs" --perf_interval="1mins" --qos_correction_interval_min="0ns" --quiet="false"
--recover="reconnect" --recovery_timeout="15mins" --registration_backoff_factor="10ms" --resources="cpus:2;gpus:0;mem:1024;disk:1024;ports:[31000-32000]"
--revocable_cpu_low_priority="true" --runtime_dir="/tmp/Endpoint_SlaveEndpointTest_NoAuthorizer_0_HcPLWg"
--sandbox_directory="/mnt/mesos/sandbox" --strict="true" --switch_user="true" --systemd_enable_support="true"
--systemd_runtime_directory="/run/systemd/system" --version="false" --work_dir="/tmp/Endpoint_SlaveEndpointTest_NoAuthorizer_0_E9uWUC"
I0203 21:41:31.690203 31208 credentials.hpp:86] Loading credential for authentication from
'/tmp/Endpoint_SlaveEndpointTest_NoAuthorizer_0_HcPLWg/credential'
I0203 21:41:31.690340 31208 slave.cpp:352] Agent using credential for: test-principal
I0203 21:41:31.690366 31208 credentials.hpp:37] Loading credentials for authentication from
'/tmp/Endpoint_SlaveEndpointTest_NoAuthorizer_0_HcPLWg/http_credentials'
I0203 21:41:31.690582 31208 http.cpp:919] Using default 'basic' HTTP authenticator for realm
'mesos-agent-readonly'
I0203 21:41:31.690703 31208 http.cpp:919] Using default 'basic' HTTP authenticator for realm
'mesos-agent-readwrite'
I0203 21:41:31.691821 31208 slave.cpp:539] Agent resources: cpus(*):2; mem(*):1024; disk(*):1024;
ports(*):[31000-32000]
I0203 21:41:31.691902 31208 slave.cpp:547] Agent attributes: [  ]
I0203 21:41:31.691922 31208 slave.cpp:552] Agent hostname: 77cbf46f266b
I0203 21:41:31.692090 31220 status_update_manager.cpp:177] Pausing sending status updates
I0203 21:41:31.693532 31219 state.cpp:60] Recovering state from '/tmp/Endpoint_SlaveEndpointTest_NoAuthorizer_0_E9uWUC/meta'
I0203 21:41:31.693874 31208 status_update_manager.cpp:203] Recovering status update manager
I0203 21:41:31.694124 31219 containerizer.cpp:599] Recovering containerizer
I0203 21:41:31.695391 31208 provisioner.cpp:410] Provisioner recovery complete
I0203 21:41:31.695859 31218 slave.cpp:5422] Finished recovery
I0203 21:41:31.696300 31218 slave.cpp:5596] Querying resource estimator for oversubscribable
resources
I0203 21:41:31.696588 31212 slave.cpp:5610] Received oversubscribable resources {} from the
resource estimator
I0203 21:41:31.699749 31220 process.cpp:3697] Handling HTTP event for process 'slave(690)'
with path: '/slave(690)/monitor/statistics'
I0203 21:41:31.701079 31209 http.cpp:871] Authorizing principal 'test-principal' to GET the
'/monitor/statistics' endpoint
I0203 21:41:31.705065 31211 slave.cpp:801] Agent terminating
[       OK ] Endpoint/SlaveEndpointTest.NoAuthorizer/0 (29 ms)
[ RUN      ] Endpoint/SlaveEndpointTest.NoAuthorizer/1
I0203 21:41:31.714835 31189 containerizer.cpp:220] Using isolation: posix/cpu,posix/mem,filesystem/posix,network/cni
W0203 21:41:31.715343 31189 backend.cpp:76] Failed to create 'aufs' backend: AufsBackend requires
root privileges
W0203 21:41:31.715445 31189 backend.cpp:76] Failed to create 'bind' backend: BindBackend requires
root privileges
I0203 21:41:31.715483 31189 provisioner.cpp:249] Using default backend 'copy'
I0203 21:41:31.716948 31189 cluster.cpp:446] Creating default 'local' authorizer
I0203 21:41:31.719043 31217 slave.cpp:209] Mesos agent started on (691)@172.17.0.2:36384
I0203 21:41:31.719074 31217 slave.cpp:210] Flags at startup: --acls="" --appc_simple_discovery_uri_prefix="http://"
--appc_store_dir="/tmp/mesos/store/appc" --authenticate_http_readonly="true" --authenticate_http_readwrite="true"
--authenticatee="crammd5" --authentication_backoff_factor="1secs" --authorizer="local" --cgroups_cpu_enable_pids_and_tids_count="false"
--cgroups_enable_cfs="false" --cgroups_hierarchy="/sys/fs/cgroup" --cgroups_limit_swap="false"
--cgroups_root="mesos" --container_disk_watch_interval="15secs" --containerizers="mesos" --credential="/tmp/Endpoint_SlaveEndpointTest_NoAuthorizer_1_f0VkkR/credential"
--default_role="*" --disk_watch_interval="1mins" --docker="docker" --docker_kill_orphans="true"
--docker_registry="https://registry-1.docker.io" --docker_remove_delay="6hrs" --docker_socket="/var/run/docker.sock"
--docker_stop_timeout="0ns" --docker_store_dir="/tmp/mesos/store/docker" --docker_volume_checkpoint_dir="/var/run/mesos/isolators/docker/volume"
--enforce_container_disk_quota="false" --executor_registration_timeout="1mins" --executor_shutdown_grace_period="5secs"
--fetcher_cache_dir="/tmp/Endpoint_SlaveEndpointTest_NoAuthorizer_1_f0VkkR/fetch" --fetcher_cache_size="2GB"
--frameworks_home="" --gc_delay="1weeks" --gc_disk_headroom="0.1" --hadoop_home="" --help="false"
--hostname_lookup="true" --http_authenticators="basic" --http_command_executor="false" --http_credentials="/tmp/Endpoint_SlaveEndpointTest_NoAuthorizer_1_f0VkkR/http_credentials"
--http_heartbeat_interval="30secs" --initialize_driver_logging="true" --isolation="posix/cpu,posix/mem"
--launcher="posix" --launcher_dir="/mesos/mesos-1.2.0/_build/src" --logbufsecs="0" --logging_level="INFO"
--max_completed_executors_per_framework="150" --oversubscribed_resources_interval="15secs"
--perf_duration="10secs" --perf_interval="1mins" --qos_correction_interval_min="0ns" --quiet="false"
--recover="reconnect" --recovery_timeout="15mins" --registration_backoff_factor="10ms" --resources="cpus:2;gpus:0;mem:1024;disk:1024;ports:[31000-32000]"
--revocable_cpu_low_priority="true" --runtime_dir="/tmp/Endpoint_SlaveEndpointTest_NoAuthorizer_1_f0VkkR"
--sandbox_directory="/mnt/mesos/sandbox" --strict="true" --switch_user="true" --systemd_enable_support="true"
--systemd_runtime_directory="/run/systemd/system" --version="false" --work_dir="/tmp/Endpoint_SlaveEndpointTest_NoAuthorizer_1_A9JHdd"
I0203 21:41:31.719789 31217 credentials.hpp:86] Loading credential for authentication from
'/tmp/Endpoint_SlaveEndpointTest_NoAuthorizer_1_f0VkkR/credential'
I0203 21:41:31.719971 31217 slave.cpp:352] Agent using credential for: test-principal
I0203 21:41:31.720001 31217 credentials.hpp:37] Loading credentials for authentication from
'/tmp/Endpoint_SlaveEndpointTest_NoAuthorizer_1_f0VkkR/http_credentials'
I0203 21:41:31.720206 31217 http.cpp:919] Using default 'basic' HTTP authenticator for realm
'mesos-agent-readonly'
I0203 21:41:31.720382 31217 http.cpp:919] Using default 'basic' HTTP authenticator for realm
'mesos-agent-readwrite'
I0203 21:41:31.721549 31217 slave.cpp:539] Agent resources: cpus(*):2; mem(*):1024; disk(*):1024;
ports(*):[31000-32000]
I0203 21:41:31.721627 31217 slave.cpp:547] Agent attributes: [  ]
I0203 21:41:31.721640 31217 slave.cpp:552] Agent hostname: 77cbf46f266b
I0203 21:41:31.721776 31211 status_update_manager.cpp:177] Pausing sending status updates
I0203 21:41:31.723194 31208 state.cpp:60] Recovering state from '/tmp/Endpoint_SlaveEndpointTest_NoAuthorizer_1_A9JHdd/meta'
I0203 21:41:31.723582 31216 status_update_manager.cpp:203] Recovering status update manager
I0203 21:41:31.723906 31214 containerizer.cpp:599] Recovering containerizer
I0203 21:41:31.725628 31211 provisioner.cpp:410] Provisioner recovery complete
I0203 21:41:31.726039 31219 slave.cpp:5422] Finished recovery
I0203 21:41:31.726608 31219 slave.cpp:5596] Querying resource estimator for oversubscribable
resources
I0203 21:41:31.727002 31212 slave.cpp:5610] Received oversubscribable resources {} from the
resource estimator
I0203 21:41:31.729873 31214 process.cpp:3697] Handling HTTP event for process 'slave(691)'
with path: '/slave(691)/monitor/statistics.json'
I0203 21:41:31.731292 31208 http.cpp:871] Authorizing principal 'test-principal' to GET the
'/monitor/statistics.json' endpoint
I0203 21:41:31.735656 31217 slave.cpp:801] Agent terminating
[       OK ] Endpoint/SlaveEndpointTest.NoAuthorizer/1 (31 ms)
[ RUN      ] Endpoint/SlaveEndpointTest.NoAuthorizer/2
I0203 21:41:31.747150 31189 containerizer.cpp:220] Using isolation: posix/cpu,posix/mem,filesystem/posix,network/cni
W0203 21:41:31.747640 31189 backend.cpp:76] Failed to create 'aufs' backend: AufsBackend requires
root privileges
W0203 21:41:31.747779 31189 backend.cpp:76] Failed to create 'bind' backend: BindBackend requires
root privileges
I0203 21:41:31.747892 31189 provisioner.cpp:249] Using default backend 'copy'
I0203 21:41:31.749193 31189 cluster.cpp:446] Creating default 'local' authorizer
I0203 21:41:31.750566 31215 slave.cpp:209] Mesos agent started on (692)@172.17.0.2:36384
I0203 21:41:31.750589 31215 slave.cpp:210] Flags at startup: --acls="" --appc_simple_discovery_uri_prefix="http://"
--appc_store_dir="/tmp/mesos/store/appc" --authenticate_http_readonly="true" --authenticate_http_readwrite="true"
--authenticatee="crammd5" --authentication_backoff_factor="1secs" --authorizer="local" --cgroups_cpu_enable_pids_and_tids_count="false"
--cgroups_enable_cfs="false" --cgroups_hierarchy="/sys/fs/cgroup" --cgroups_limit_swap="false"
--cgroups_root="mesos" --container_disk_watch_interval="15secs" --containerizers="mesos" --credential="/tmp/Endpoint_SlaveEndpointTest_NoAuthorizer_2_PpZl2r/credential"
--default_role="*" --disk_watch_interval="1mins" --docker="docker" --docker_kill_orphans="true"
--docker_registry="https://registry-1.docker.io" --docker_remove_delay="6hrs" --docker_socket="/var/run/docker.sock"
--docker_stop_timeout="0ns" --docker_store_dir="/tmp/mesos/store/docker" --docker_volume_checkpoint_dir="/var/run/mesos/isolators/docker/volume"
--enforce_container_disk_quota="false" --executor_registration_timeout="1mins" --executor_shutdown_grace_period="5secs"
--fetcher_cache_dir="/tmp/Endpoint_SlaveEndpointTest_NoAuthorizer_2_PpZl2r/fetch" --fetcher_cache_size="2GB"
--frameworks_home="" --gc_delay="1weeks" --gc_disk_headroom="0.1" --hadoop_home="" --help="false"
--hostname_lookup="true" --http_authenticators="basic" --http_command_executor="false" --http_credentials="/tmp/Endpoint_SlaveEndpointTest_NoAuthorizer_2_PpZl2r/http_credentials"
--http_heartbeat_interval="30secs" --initialize_driver_logging="true" --isolation="posix/cpu,posix/mem"
--launcher="posix" --launcher_dir="/mesos/mesos-1.2.0/_build/src" --logbufsecs="0" --logging_level="INFO"
--max_completed_executors_per_framework="150" --oversubscribed_resources_interval="15secs"
--perf_duration="10secs" --perf_interval="1mins" --qos_correction_interval_min="0ns" --quiet="false"
--recover="reconnect" --recovery_timeout="15mins" --registration_backoff_factor="10ms" --resources="cpus:2;gpus:0;mem:1024;disk:1024;ports:[31000-32000]"
--revocable_cpu_low_priority="true" --runtime_dir="/tmp/Endpoint_SlaveEndpointTest_NoAuthorizer_2_PpZl2r"
--sandbox_directory="/mnt/mesos/sandbox" --strict="true" --switch_user="true" --systemd_enable_support="true"
--systemd_runtime_directory="/run/systemd/system" --version="false" --work_dir="/tmp/Endpoint_SlaveEndpointTest_NoAuthorizer_2_S56vQN"
I0203 21:41:31.751070 31215 credentials.hpp:86] Loading credential for authentication from
'/tmp/Endpoint_SlaveEndpointTest_NoAuthorizer_2_PpZl2r/credential'
I0203 21:41:31.751220 31215 slave.cpp:352] Agent using credential for: test-principal
I0203 21:41:31.751241 31215 credentials.hpp:37] Loading credentials for authentication from
'/tmp/Endpoint_SlaveEndpointTest_NoAuthorizer_2_PpZl2r/http_credentials'
I0203 21:41:31.751479 31215 http.cpp:919] Using default 'basic' HTTP authenticator for realm
'mesos-agent-readonly'
I0203 21:41:31.751618 31215 http.cpp:919] Using default 'basic' HTTP authenticator for realm
'mesos-agent-readwrite'
I0203 21:41:31.753255 31215 slave.cpp:539] Agent resources: cpus(*):2; mem(*):1024; disk(*):1024;
ports(*):[31000-32000]
I0203 21:41:31.753358 31215 slave.cpp:547] Agent attributes: [  ]
I0203 21:41:31.753372 31215 slave.cpp:552] Agent hostname: 77cbf46f266b
I0203 21:41:31.753536 31211 status_update_manager.cpp:177] Pausing sending status updates
I0203 21:41:31.755004 31223 state.cpp:60] Recovering state from '/tmp/Endpoint_SlaveEndpointTest_NoAuthorizer_2_S56vQN/meta'
I0203 21:41:31.755448 31217 status_update_manager.cpp:203] Recovering status update manager
I0203 21:41:31.755746 31210 containerizer.cpp:599] Recovering containerizer
I0203 21:41:31.757263 31209 provisioner.cpp:410] Provisioner recovery complete
I0203 21:41:31.757712 31214 slave.cpp:5422] Finished recovery
I0203 21:41:31.758111 31214 slave.cpp:5596] Querying resource estimator for oversubscribable
resources
I0203 21:41:31.758395 31211 slave.cpp:5610] Received oversubscribable resources {} from the
resource estimator
I0203 21:41:31.760946 31216 process.cpp:3697] Handling HTTP event for process 'slave(692)'
with path: '/slave(692)/containers'
I0203 21:41:31.762302 31209 http.cpp:871] Authorizing principal 'test-principal' to GET the
'/containers' endpoint
I0203 21:41:31.766325 31219 slave.cpp:801] Agent terminating
[       OK ] Endpoint/SlaveEndpointTest.NoAuthorizer/2 (29 ms)
[----------] 9 tests from Endpoint/SlaveEndpointTest (285 ms total)

[----------] Global test environment tear-down
[==========] 1467 tests from 165 test cases ran. (491799 ms total)
[  PASSED  ] 1466 tests.
[  FAILED  ] 1 test, listed below:
[  FAILED  ] FrameworkInfoValidationTest.RejectRoleChangeWithMultiRoleMasterFailover

 1 FAILED TEST
  YOU HAVE 14 DISABLED TESTS

make[4]: *** [check-local] Error 1
make[4]: Leaving directory `/mesos/mesos-1.2.0/_build/src'
make[3]: *** [check-am] Error 2
make[3]: Leaving directory `/mesos/mesos-1.2.0/_build/src'
make[2]: *** [check] Error 2
make[2]: Leaving directory `/mesos/mesos-1.2.0/_build/src'
make[1]: *** [check-recursive] Error 1
make[1]: Leaving directory `/mesos/mesos-1.2.0/_build'
make: *** [distcheck] Error 1
+ docker rmi mesos-1486155585-19325
Untagged: mesos-1486155585-19325:latest
Deleted: sha256:f90781011d9a983eb40d6dc2eb4b6ed61ba8e06df50f17f2688f147ee62b4b64
Deleted: sha256:ce9b172acab0dcc0cb3d981e1483324c9b4e2819f3077642da24fa06d7b2c433
Deleted: sha256:b54c9b4cc9cbb5836a84371e55b41b9c7758869b7767c1a01430c0b70430479f
Deleted: sha256:2ab7bfbf2118209e7aa8e19d482a55dff2cf029cbde78e200b51621aaad3df5f
Deleted: sha256:d4c17363fa5114f82223ce86ba5ad1a7799a0e9f70f649c9b6bd2c822a870875
Deleted: sha256:bcc60e87eab8156e7a0af64f1039d3aaee6e0df775d8d240535db3703330c375
Deleted: sha256:975153c04eb2b12e13ec8389f45b8004bcd68dcf330b6b466c245332322645f4
Deleted: sha256:14aeac83faa0c2fd4be6e2a59cc4129841a9ac9d9ba7cb03d2bf6b35738dbb11
Deleted: sha256:7272b10a81d952889fe13123e134a00181b9cdcb45c2944b711d268a98187ed9
Deleted: sha256:406a312dfeb4aaa064f90f7c18459b6c92b1e4f098bbeccf1d8e5893f50a4bae
Deleted: sha256:26e8a72394ca40c92d6cf6f863883d56ac44d23e9a59eb50f5ab52543900472f
Deleted: sha256:4674f68e713af06eb71ce38aa30a0fb2c9d3e130d1f958933b9a59f9ac822a60
Deleted: sha256:5b60c3b6488dd5c13404d8895b0e9d6f48b241b01b6db380f2cc1d5901d09fe5
Deleted: sha256:c032f7f36c5714f39160d5d4a7e955b868ec60e9c405cb1bfeec4f2970fc9fb6
Deleted: sha256:f0a69c75629fe276c956ec7829eb5dab67cec2b338c62d613cc90402176bedd1
Deleted: sha256:70b511783b822221d3b93d1abd3740639411b988a02769abc6aefb03c2dc9fad
Deleted: sha256:1f6a023b0ccd25655419ada9d0f888b119f6f00a334d2ac0b37497ac70657b29
Deleted: sha256:006df2a8fa0c1ed38e4da8f02d0df8271d25f288e2f44bd15be4560139f6782b
Deleted: sha256:1ea8ddeedd4eb5a977bfdc8c0a1ad6334435471e9ac4f7a1a9d0dd4152aa9d91
Deleted: sha256:c572588cc4718bada57e2873d90a096396370c522680068c5845748d47addc60
Deleted: sha256:7a56c10366317301b97aea6aaf9e2f86c72f572ea3c9f5ba2f6b14acd676e389
Deleted: sha256:43c6aa79897535099c1544a370179faebf9c5a84befc67bf11369c6b3a44ff34
Deleted: sha256:217665e0fb2ef5fbda448ad3e9713e45859e524b26e453a0193ac6080cfbd848
Deleted: sha256:23aac6fed4b2b8eb2af4da770295753a610ee266f17aa741ac997c9d8237109d
Deleted: sha256:5da508360447c660c34041c246938a8edd226eb2de55374736ff523df90a0002
Build step 'Execute shell' marked build as failure

Mime
View raw message