mesos-builds mailing list archives

Site index · List index
Message view « Date » · « Thread »
Top « Date » · « Thread »
From Apache Jenkins Server <jenk...@builds.apache.org>
Subject Build failed in Jenkins: Mesos-Buildbot » cmake,gcc,--verbose --enable-libevent --enable-ssl,GLOG_v=1 MESOS_VERBOSE=1,ubuntu:14.04,(docker||Hadoop)&&(!ubuntu-us1)&&(!ubuntu-eu2) #3322
Date Tue, 28 Feb 2017 21:44:59 GMT
See <https://builds.apache.org/job/Mesos-Buildbot/BUILDTOOL=cmake,COMPILER=gcc,CONFIGURATION=--verbose%20--enable-libevent%20--enable-ssl,ENVIRONMENT=GLOG_v=1%20MESOS_VERBOSE=1,OS=ubuntu%3A14.04,label_exp=(docker%7C%7CHadoop)&&(!ubuntu-us1)&&(!ubuntu-eu2)/3322/display/redirect?page=changes>

Changes:

[neil.conway] Relax perf version check for Arch Linux.

------------------------------------------
[...truncated 24.65 MB...]
I0228 21:44:43.529090 27109 status_update_manager.cpp:177] Pausing sending status updates
I0228 21:44:43.529341 27103 state.cpp:62] Recovering state from '/tmp/Endpoint_SlaveEndpointTest_AuthorizedRequest_1_BU1iT8/meta'
I0228 21:44:43.529553 27104 status_update_manager.cpp:203] Recovering status update manager
I0228 21:44:43.529747 27098 containerizer.cpp:599] Recovering containerizer
I0228 21:44:43.530455 27100 provisioner.cpp:410] Provisioner recovery complete
I0228 21:44:43.530601 27100 slave.cpp:5559] Finished recovery
I0228 21:44:43.530988 27100 slave.cpp:5733] Querying resource estimator for oversubscribable
resources
I0228 21:44:43.531098 27107 slave.cpp:5747] Received oversubscribable resources {} from the
resource estimator
I0228 21:44:43.532136 27105 process.cpp:3704] Handling HTTP event for process 'slave(702)'
with path: '/slave(702)/monitor/statistics.json'
I0228 21:44:43.532608 27106 http.cpp:885] Authorizing principal 'test-principal' to GET the
'/monitor/statistics.json' endpoint
I0228 21:44:43.533993 27096 slave.cpp:803] Agent terminating
I0228 21:44:43.574498 27096 containerizer.cpp:220] Using isolation: posix/cpu,posix/mem,filesystem/posix,network/cni
W0228 21:44:43.574868 27096 backend.cpp:76] Failed to create 'aufs' backend: AufsBackend requires
root privileges
W0228 21:44:43.574903 27096 backend.cpp:76] Failed to create 'bind' backend: BindBackend requires
root privileges
I0228 21:44:43.574918 27096 provisioner.cpp:249] Using default backend 'copy'
[       OK ] Endpoint/SlaveEndpointTest.AuthorizedRequest/1 (14 ms)
[ RUN      ] Endpoint/SlaveEndpointTest.AuthorizedRequest/2
I0228 21:44:43.584221 27111 slave.cpp:211] Mesos agent started on (703)@172.17.0.2:35458
I0228 21:44:43.584251 27111 slave.cpp:212] Flags at startup: --acls="" --appc_simple_discovery_uri_prefix="http://"
--appc_store_dir="/tmp/mesos/store/appc" --authenticate_http_readonly="true" --authenticate_http_readwrite="true"
--authenticatee="crammd5" --authentication_backoff_factor="1secs" --authorizer="local" --cgroups_cpu_enable_pids_and_tids_count="false"
--cgroups_enable_cfs="false" --cgroups_hierarchy="/sys/fs/cgroup" --cgroups_limit_swap="false"
--cgroups_root="mesos" --container_disk_watch_interval="15secs" --containerizers="mesos" --credential="/tmp/Endpoint_SlaveEndpointTest_AuthorizedRequest_2_jkn6VM/credential"
--default_role="*" --disk_watch_interval="1mins" --docker="docker" --docker_kill_orphans="true"
--docker_registry="https://registry-1.docker.io" --docker_remove_delay="6hrs" --docker_socket="/var/run/docker.sock"
--docker_stop_timeout="0ns" --docker_store_dir="/tmp/mesos/store/docker" --docker_volume_checkpoint_dir="/var/run/mesos/isolators/docker/volume"
--enforce_container_disk_quota="false" --executor_registration_timeout="1mins" --executor_shutdown_grace_period="5secs"
--fetcher_cache_dir="/tmp/Endpoint_SlaveEndpointTest_AuthorizedRequest_2_jkn6VM/fetch" --fetcher_cache_size="2GB"
--frameworks_home="" --gc_delay="1weeks" --gc_disk_headroom="0.1" --hadoop_home="" --help="false"
--hostname_lookup="true" --http_authenticators="basic" --http_command_executor="false" --http_credentials="/tmp/Endpoint_SlaveEndpointTest_AuthorizedRequest_2_jkn6VM/http_credentials"
--http_heartbeat_interval="30secs" --initialize_driver_logging="true" --isolation="posix/cpu,posix/mem"
--launcher="posix" --launcher_dir="/mesos/build/src" --logbufsecs="0" --logging_level="INFO"
--max_completed_executors_per_framework="150" --oversubscribed_resources_interval="15secs"
--perf_duration="10secs" --perf_interval="1mins" --qos_correction_interval_min="0ns" --quiet="false"
--recover="reconnect" --recovery_timeout="15mins" --registration_backoff_factor="10ms" --resources="cpus:2;gpus:0;mem:1024;disk:1024;ports:[31000-32000]"
--revocable_cpu_low_priority="true" --runtime_dir="/tmp/Endpoint_SlaveEndpointTest_AuthorizedRequest_2_jkn6VM"
--sandbox_directory="/mnt/mesos/sandbox" --strict="true" --switch_user="true" --systemd_enable_support="true"
--systemd_runtime_directory="/run/systemd/system" --version="false" --work_dir="/tmp/Endpoint_SlaveEndpointTest_AuthorizedRequest_2_vVClhR"
I0228 21:44:43.584627 27111 credentials.hpp:86] Loading credential for authentication from
'/tmp/Endpoint_SlaveEndpointTest_AuthorizedRequest_2_jkn6VM/credential'
I0228 21:44:43.584800 27111 slave.cpp:354] Agent using credential for: test-principal
I0228 21:44:43.584815 27111 credentials.hpp:37] Loading credentials for authentication from
'/tmp/Endpoint_SlaveEndpointTest_AuthorizedRequest_2_jkn6VM/http_credentials'
I0228 21:44:43.584944 27111 http.cpp:933] Using default 'basic' HTTP authenticator for realm
'mesos-agent-readonly'
I0228 21:44:43.587424 27111 http.cpp:933] Using default 'basic' HTTP authenticator for realm
'mesos-agent-readwrite'
I0228 21:44:43.587961 27111 slave.cpp:541] Agent resources: cpus(*):2; mem(*):1024; disk(*):1024;
ports(*):[31000-32000]
I0228 21:44:43.587996 27111 slave.cpp:549] Agent attributes: [  ]
I0228 21:44:43.588001 27111 slave.cpp:554] Agent hostname: 8afaf6520310
I0228 21:44:43.588400 27110 status_update_manager.cpp:177] Pausing sending status updates
I0228 21:44:43.588490 27111 state.cpp:62] Recovering state from '/tmp/Endpoint_SlaveEndpointTest_AuthorizedRequest_2_vVClhR/meta'
I0228 21:44:43.588852 27110 status_update_manager.cpp:203] Recovering status update manager
I0228 21:44:43.589143 27110 containerizer.cpp:599] Recovering containerizer
I0228 21:44:43.589874 27099 provisioner.cpp:410] Provisioner recovery complete
I0228 21:44:43.590251 27106 slave.cpp:5559] Finished recovery
I0228 21:44:43.603420 27106 slave.cpp:5733] Querying resource estimator for oversubscribable
resources
I0228 21:44:43.603622 27111 slave.cpp:5747] Received oversubscribable resources {} from the
resource estimator
I0228 21:44:43.604825 27102 process.cpp:3704] Handling HTTP event for process 'slave(703)'
with path: '/slave(703)/containers'
I0228 21:44:43.605484 27097 http.cpp:885] Authorizing principal 'test-principal' to GET the
'/containers' endpoint
I0228 21:44:43.607076 27108 slave.cpp:803] Agent terminating
[       OK ] Endpoint/SlaveEndpointTest.AuthorizedRequest/2 (38 ms)
[ RUN      ] Endpoint/SlaveEndpointTest.UnauthorizedRequest/0
I0228 21:44:43.655252 27096 containerizer.cpp:220] Using isolation: posix/cpu,posix/mem,filesystem/posix,network/cni
W0228 21:44:43.655534 27096 backend.cpp:76] Failed to create 'aufs' backend: AufsBackend requires
root privileges
W0228 21:44:43.655586 27096 backend.cpp:76] Failed to create 'bind' backend: BindBackend requires
root privileges
I0228 21:44:43.655668 27096 provisioner.cpp:249] Using default backend 'copy'
I0228 21:44:43.657030 27109 slave.cpp:211] Mesos agent started on (704)@172.17.0.2:35458
I0228 21:44:43.657047 27109 slave.cpp:212] Flags at startup: --acls="" --appc_simple_discovery_uri_prefix="http://"
--appc_store_dir="/tmp/mesos/store/appc" --authenticate_http_readonly="true" --authenticate_http_readwrite="true"
--authenticatee="crammd5" --authentication_backoff_factor="1secs" --authorizer="local" --cgroups_cpu_enable_pids_and_tids_count="false"
--cgroups_enable_cfs="false" --cgroups_hierarchy="/sys/fs/cgroup" --cgroups_limit_swap="false"
--cgroups_root="mesos" --container_disk_watch_interval="15secs" --containerizers="mesos" --credential="/tmp/Endpoint_SlaveEndpointTest_UnauthorizedRequest_0_fT4mhw/credential"
--default_role="*" --disk_watch_interval="1mins" --docker="docker" --docker_kill_orphans="true"
--docker_registry="https://registry-1.docker.io" --docker_remove_delay="6hrs" --docker_socket="/var/run/docker.sock"
--docker_stop_timeout="0ns" --docker_store_dir="/tmp/mesos/store/docker" --docker_volume_checkpoint_dir="/var/run/mesos/isolators/docker/volume"
--enforce_container_disk_quota="false" --executor_registration_timeout="1mins" --executor_shutdown_grace_period="5secs"
--fetcher_cache_dir="/tmp/Endpoint_SlaveEndpointTest_UnauthorizedRequest_0_fT4mhw/fetch" --fetcher_cache_size="2GB"
--frameworks_home="" --gc_delay="1weeks" --gc_disk_headroom="0.1" --hadoop_home="" --help="false"
--hostname_lookup="true" --http_authenticators="basic" --http_command_executor="false" --http_credentials="/tmp/Endpoint_SlaveEndpointTest_UnauthorizedRequest_0_fT4mhw/http_credentials"
--http_heartbeat_interval="30secs" --initialize_driver_logging="true" --isolation="posix/cpu,posix/mem"
--launcher="posix" --launcher_dir="/mesos/build/src" --logbufsecs="0" --logging_level="INFO"
--max_completed_executors_per_framework="150" --oversubscribed_resources_interval="15secs"
--perf_duration="10secs" --perf_interval="1mins" --qos_correction_interval_min="0ns" --quiet="false"
--recover="reconnect" --recovery_timeout="15mins" --registration_backoff_factor="10ms" --resources="cpus:2;gpus:0;mem:1024;disk:1024;ports:[31000-32000]"
--revocable_cpu_low_priority="true" --runtime_dir="/tmp/Endpoint_SlaveEndpointTest_UnauthorizedRequest_0_fT4mhw"
--sandbox_directory="/mnt/mesos/sandbox" --strict="true" --switch_user="true" --systemd_enable_support="true"
--systemd_runtime_directory="/run/systemd/system" --version="false" --work_dir="/tmp/Endpoint_SlaveEndpointTest_UnauthorizedRequest_0_VoaspA"
I0228 21:44:43.657369 27109 credentials.hpp:86] Loading credential for authentication from
'/tmp/Endpoint_SlaveEndpointTest_UnauthorizedRequest_0_fT4mhw/credential'
I0228 21:44:43.657476 27109 slave.cpp:354] Agent using credential for: test-principal
I0228 21:44:43.657488 27109 credentials.hpp:37] Loading credentials for authentication from
'/tmp/Endpoint_SlaveEndpointTest_UnauthorizedRequest_0_fT4mhw/http_credentials'
I0228 21:44:43.657579 27109 http.cpp:933] Using default 'basic' HTTP authenticator for realm
'mesos-agent-readonly'
I0228 21:44:43.657636 27109 http.cpp:933] Using default 'basic' HTTP authenticator for realm
'mesos-agent-readwrite'
I0228 21:44:43.658059 27109 slave.cpp:541] Agent resources: cpus(*):2; mem(*):1024; disk(*):1024;
ports(*):[31000-32000]
I0228 21:44:43.658092 27109 slave.cpp:549] Agent attributes: [  ]
I0228 21:44:43.658097 27109 slave.cpp:554] Agent hostname: 8afaf6520310
I0228 21:44:43.658169 27111 status_update_manager.cpp:177] Pausing sending status updates
I0228 21:44:43.658557 27107 state.cpp:62] Recovering state from '/tmp/Endpoint_SlaveEndpointTest_UnauthorizedRequest_0_VoaspA/meta'
I0228 21:44:43.658718 27100 status_update_manager.cpp:203] Recovering status update manager
I0228 21:44:43.658809 27107 containerizer.cpp:599] Recovering containerizer
I0228 21:44:43.659344 27103 provisioner.cpp:410] Provisioner recovery complete
I0228 21:44:43.659534 27106 slave.cpp:5559] Finished recovery
I0228 21:44:43.660009 27106 slave.cpp:5733] Querying resource estimator for oversubscribable
resources
I0228 21:44:43.660295 27102 slave.cpp:5747] Received oversubscribable resources {} from the
resource estimator
I0228 21:44:43.661280 27104 process.cpp:3704] Handling HTTP event for process 'slave(704)'
with path: '/slave(704)/monitor/statistics'
I0228 21:44:43.661842 27108 http.cpp:885] Authorizing principal 'test-principal' to GET the
'/monitor/statistics' endpoint
I0228 21:44:43.663308 27111 slave.cpp:803] Agent terminating
[       OK ] Endpoint/SlaveEndpointTest.UnauthorizedRequest/0 (14 ms)
[ RUN      ] Endpoint/SlaveEndpointTest.UnauthorizedRequest/1
I0228 21:44:43.706550 27096 containerizer.cpp:220] Using isolation: posix/cpu,posix/mem,filesystem/posix,network/cni
W0228 21:44:43.706878 27096 backend.cpp:76] Failed to create 'aufs' backend: AufsBackend requires
root privileges
W0228 21:44:43.706921 27096 backend.cpp:76] Failed to create 'bind' backend: BindBackend requires
root privileges
I0228 21:44:43.706990 27096 provisioner.cpp:249] Using default backend 'copy'
I0228 21:44:43.708156 27097 slave.cpp:211] Mesos agent started on (705)@172.17.0.2:35458
I0228 21:44:43.708174 27097 slave.cpp:212] Flags at startup: --acls="" --appc_simple_discovery_uri_prefix="http://"
--appc_store_dir="/tmp/mesos/store/appc" --authenticate_http_readonly="true" --authenticate_http_readwrite="true"
--authenticatee="crammd5" --authentication_backoff_factor="1secs" --authorizer="local" --cgroups_cpu_enable_pids_and_tids_count="false"
--cgroups_enable_cfs="false" --cgroups_hierarchy="/sys/fs/cgroup" --cgroups_limit_swap="false"
--cgroups_root="mesos" --container_disk_watch_interval="15secs" --containerizers="mesos" --credential="/tmp/Endpoint_SlaveEndpointTest_UnauthorizedRequest_1_1WZHag/credential"
--default_role="*" --disk_watch_interval="1mins" --docker="docker" --docker_kill_orphans="true"
--docker_registry="https://registry-1.docker.io" --docker_remove_delay="6hrs" --docker_socket="/var/run/docker.sock"
--docker_stop_timeout="0ns" --docker_store_dir="/tmp/mesos/store/docker" --docker_volume_checkpoint_dir="/var/run/mesos/isolators/docker/volume"
--enforce_container_disk_quota="false" --executor_registration_timeout="1mins" --executor_shutdown_grace_period="5secs"
--fetcher_cache_dir="/tmp/Endpoint_SlaveEndpointTest_UnauthorizedRequest_1_1WZHag/fetch" --fetcher_cache_size="2GB"
--frameworks_home="" --gc_delay="1weeks" --gc_disk_headroom="0.1" --hadoop_home="" --help="false"
--hostname_lookup="true" --http_authenticators="basic" --http_command_executor="false" --http_credentials="/tmp/Endpoint_SlaveEndpointTest_UnauthorizedRequest_1_1WZHag/http_credentials"
--http_heartbeat_interval="30secs" --initialize_driver_logging="true" --isolation="posix/cpu,posix/mem"
--launcher="posix" --launcher_dir="/mesos/build/src" --logbufsecs="0" --logging_level="INFO"
--max_completed_executors_per_framework="150" --oversubscribed_resources_interval="15secs"
--perf_duration="10secs" --perf_interval="1mins" --qos_correction_interval_min="0ns" --quiet="false"
--recover="reconnect" --recovery_timeout="15mins" --registration_backoff_factor="10ms" --resources="cpus:2;gpus:0;mem:1024;disk:1024;ports:[31000-32000]"
--revocable_cpu_low_priority="true" --runtime_dir="/tmp/Endpoint_SlaveEndpointTest_UnauthorizedRequest_1_1WZHag"
--sandbox_directory="/mnt/mesos/sandbox" --strict="true" --switch_user="true" --systemd_enable_support="true"
--systemd_runtime_directory="/run/systemd/system" --version="false" --work_dir="/tmp/Endpoint_SlaveEndpointTest_UnauthorizedRequest_1_7Jbuak"
I0228 21:44:43.708576 27097 credentials.hpp:86] Loading credential for authentication from
'/tmp/Endpoint_SlaveEndpointTest_UnauthorizedRequest_1_1WZHag/credential'
I0228 21:44:43.708653 27097 slave.cpp:354] Agent using credential for: test-principal
I0228 21:44:43.708662 27097 credentials.hpp:37] Loading credentials for authentication from
'/tmp/Endpoint_SlaveEndpointTest_UnauthorizedRequest_1_1WZHag/http_credentials'
I0228 21:44:43.708745 27097 http.cpp:933] Using default 'basic' HTTP authenticator for realm
'mesos-agent-readonly'
I0228 21:44:43.708782 27097 http.cpp:933] Using default 'basic' HTTP authenticator for realm
'mesos-agent-readwrite'
I0228 21:44:43.709256 27097 slave.cpp:541] Agent resources: cpus(*):2; mem(*):1024; disk(*):1024;
ports(*):[31000-32000]
I0228 21:44:43.709290 27097 slave.cpp:549] Agent attributes: [  ]
I0228 21:44:43.709296 27097 slave.cpp:554] Agent hostname: 8afaf6520310
I0228 21:44:43.709367 27099 status_update_manager.cpp:177] Pausing sending status updates
I0228 21:44:43.709710 27108 state.cpp:62] Recovering state from '/tmp/Endpoint_SlaveEndpointTest_UnauthorizedRequest_1_7Jbuak/meta'
I0228 21:44:43.710088 27097 status_update_manager.cpp:203] Recovering status update manager
I0228 21:44:43.710220 27102 containerizer.cpp:599] Recovering containerizer
I0228 21:44:43.710769 27104 provisioner.cpp:410] Provisioner recovery complete
I0228 21:44:43.710975 27100 slave.cpp:5559] Finished recovery
I0228 21:44:43.711347 27100 slave.cpp:5733] Querying resource estimator for oversubscribable
resources
I0228 21:44:43.711441 27109 slave.cpp:5747] Received oversubscribable resources {} from the
resource estimator
I0228 21:44:43.712399 27099 process.cpp:3704] Handling HTTP event for process 'slave(705)'
with path: '/slave(705)/monitor/statistics.json'
I0228 21:44:43.712713 27099 http.cpp:885] Authorizing principal 'test-principal' to GET the
'/monitor/statistics.json' endpoint
I0228 21:44:43.713444 27096 slave.cpp:803] Agent terminating
[       OK ] Endpoint/SlaveEndpointTest.UnauthorizedRequest/1 (12 ms)
[ RUN      ] Endpoint/SlaveEndpointTest.UnauthorizedRequest/2
I0228 21:44:43.727284 27096 containerizer.cpp:220] Using isolation: posix/cpu,posix/mem,filesystem/posix,network/cni
W0228 21:44:43.745620 27096 backend.cpp:76] Failed to create 'aufs' backend: AufsBackend requires
root privileges
W0228 21:44:43.745703 27096 backend.cpp:76] Failed to create 'bind' backend: BindBackend requires
root privileges
I0228 21:44:43.745719 27096 provisioner.cpp:249] Using default backend 'copy'
I0228 21:44:43.747326 27112 slave.cpp:211] Mesos agent started on (706)@172.17.0.2:35458
I0228 21:44:43.747344 27112 slave.cpp:212] Flags at startup: --acls="" --appc_simple_discovery_uri_prefix="http://"
--appc_store_dir="/tmp/mesos/store/appc" --authenticate_http_readonly="true" --authenticate_http_readwrite="true"
--authenticatee="crammd5" --authentication_backoff_factor="1secs" --authorizer="local" --cgroups_cpu_enable_pids_and_tids_count="false"
--cgroups_enable_cfs="false" --cgroups_hierarchy="/sys/fs/cgroup" --cgroups_limit_swap="false"
--cgroups_root="mesos" --container_disk_watch_interval="15secs" --containerizers="mesos" --credential="/tmp/Endpoint_SlaveEndpointTest_UnauthorizedRequest_2_7pwCm0/credential"
--default_role="*" --disk_watch_interval="1mins" --docker="docker" --docker_kill_orphans="true"
--docker_registry="https://registry-1.docker.io" --docker_remove_delay="6hrs" --docker_socket="/var/run/docker.sock"
--docker_stop_timeout="0ns" --docker_store_dir="/tmp/mesos/store/docker" --docker_volume_checkpoint_dir="/var/run/mesos/isolators/docker/volume"
--enforce_container_disk_quota="false" --executor_registration_timeout="1mins" --executor_shutdown_grace_period="5secs"
--fetcher_cache_dir="/tmp/Endpoint_SlaveEndpointTest_UnauthorizedRequest_2_7pwCm0/fetch" --fetcher_cache_size="2GB"
--frameworks_home="" --gc_delay="1weeks" --gc_disk_headroom="0.1" --hadoop_home="" --help="false"
--hostname_lookup="true" --http_authenticators="basic" --http_command_executor="false" --http_credentials="/tmp/Endpoint_SlaveEndpointTest_UnauthorizedRequest_2_7pwCm0/http_credentials"
--http_heartbeat_interval="30secs" --initialize_driver_logging="true" --isolation="posix/cpu,posix/mem"
--launcher="posix" --launcher_dir="/mesos/build/src" --logbufsecs="0" --logging_level="INFO"
--max_completed_executors_per_framework="150" --oversubscribed_resources_interval="15secs"
--perf_duration="10secs" --perf_interval="1mins" --qos_correction_interval_min="0ns" --quiet="false"
--recover="reconnect" --recovery_timeout="15mins" --registration_backoff_factor="10ms" --resources="cpus:2;gpus:0;mem:1024;disk:1024;ports:[31000-32000]"
--revocable_cpu_low_priority="true" --runtime_dir="/tmp/Endpoint_SlaveEndpointTest_UnauthorizedRequest_2_7pwCm0"
--sandbox_directory="/mnt/mesos/sandbox" --strict="true" --switch_user="true" --systemd_enable_support="true"
--systemd_runtime_directory="/run/systemd/system" --version="false" --work_dir="/tmp/Endpoint_SlaveEndpointTest_UnauthorizedRequest_2_3u4Zi4"
I0228 21:44:43.747781 27112 credentials.hpp:86] Loading credential for authentication from
'/tmp/Endpoint_SlaveEndpointTest_UnauthorizedRequest_2_7pwCm0/credential'
I0228 21:44:43.747918 27112 slave.cpp:354] Agent using credential for: test-principal
I0228 21:44:43.747956 27112 credentials.hpp:37] Loading credentials for authentication from
'/tmp/Endpoint_SlaveEndpointTest_UnauthorizedRequest_2_7pwCm0/http_credentials'
I0228 21:44:43.748116 27112 http.cpp:933] Using default 'basic' HTTP authenticator for realm
'mesos-agent-readonly'
I0228 21:44:43.748210 27112 http.cpp:933] Using default 'basic' HTTP authenticator for realm
'mesos-agent-readwrite'
I0228 21:44:43.748756 27112 slave.cpp:541] Agent resources: cpus(*):2; mem(*):1024; disk(*):1024;
ports(*):[31000-32000]
I0228 21:44:43.748853 27112 slave.cpp:549] Agent attributes: [  ]
I0228 21:44:43.748895 27112 slave.cpp:554] Agent hostname: 8afaf6520310
I0228 21:44:43.749002 27101 status_update_manager.cpp:177] Pausing sending status updates
I0228 21:44:43.749356 27101 state.cpp:62] Recovering state from '/tmp/Endpoint_SlaveEndpointTest_UnauthorizedRequest_2_3u4Zi4/meta'
I0228 21:44:43.749475 27112 status_update_manager.cpp:203] Recovering status update manager
I0228 21:44:43.749544 27101 containerizer.cpp:599] Recovering containerizer
I0228 21:44:43.750061 27101 provisioner.cpp:410] Provisioner recovery complete
I0228 21:44:43.750210 27101 slave.cpp:5559] Finished recovery
I0228 21:44:43.750665 27101 slave.cpp:5733] Querying resource estimator for oversubscribable
resources
I0228 21:44:43.750813 27101 slave.cpp:5747] Received oversubscribable resources {} from the
resource estimator
I0228 21:44:43.752411 27098 process.cpp:3704] Handling HTTP event for process 'slave(706)'
with path: '/slave(706)/containers'
I0228 21:44:43.752781 27098 http.cpp:885] Authorizing principal 'test-principal' to GET the
'/containers' endpoint
I0228 21:44:43.753815 27096 slave.cpp:803] Agent terminating
[       OK ] Endpoint/SlaveEndpointTest.UnauthorizedRequest/2 (30 ms)
[ RUN      ] Endpoint/SlaveEndpointTest.NoAuthorizer/0
I0228 21:44:43.791170 27096 containerizer.cpp:220] Using isolation: posix/cpu,posix/mem,filesystem/posix,network/cni
W0228 21:44:43.791538 27096 backend.cpp:76] Failed to create 'aufs' backend: AufsBackend requires
root privileges
W0228 21:44:43.791584 27096 backend.cpp:76] Failed to create 'bind' backend: BindBackend requires
root privileges
I0228 21:44:43.791613 27096 provisioner.cpp:249] Using default backend 'copy'
I0228 21:44:43.792286 27096 cluster.cpp:446] Creating default 'local' authorizer
I0228 21:44:43.792938 27102 slave.cpp:211] Mesos agent started on (707)@172.17.0.2:35458
I0228 21:44:43.792953 27102 slave.cpp:212] Flags at startup: --acls="" --appc_simple_discovery_uri_prefix="http://"
--appc_store_dir="/tmp/mesos/store/appc" --authenticate_http_readonly="true" --authenticate_http_readwrite="true"
--authenticatee="crammd5" --authentication_backoff_factor="1secs" --authorizer="local" --cgroups_cpu_enable_pids_and_tids_count="false"
--cgroups_enable_cfs="false" --cgroups_hierarchy="/sys/fs/cgroup" --cgroups_limit_swap="false"
--cgroups_root="mesos" --container_disk_watch_interval="15secs" --containerizers="mesos" --credential="/tmp/Endpoint_SlaveEndpointTest_NoAuthorizer_0_1ZOM9K/credential"
--default_role="*" --disk_watch_interval="1mins" --docker="docker" --docker_kill_orphans="true"
--docker_registry="https://registry-1.docker.io" --docker_remove_delay="6hrs" --docker_socket="/var/run/docker.sock"
--docker_stop_timeout="0ns" --docker_store_dir="/tmp/mesos/store/docker" --docker_volume_checkpoint_dir="/var/run/mesos/isolators/docker/volume"
--enforce_container_disk_quota="false" --executor_registration_timeout="1mins" --executor_shutdown_grace_period="5secs"
--fetcher_cache_dir="/tmp/Endpoint_SlaveEndpointTest_NoAuthorizer_0_1ZOM9K/fetch" --fetcher_cache_size="2GB"
--frameworks_home="" --gc_delay="1weeks" --gc_disk_headroom="0.1" --hadoop_home="" --help="false"
--hostname_lookup="true" --http_authenticators="basic" --http_command_executor="false" --http_credentials="/tmp/Endpoint_SlaveEndpointTest_NoAuthorizer_0_1ZOM9K/http_credentials"
--http_heartbeat_interval="30secs" --initialize_driver_logging="true" --isolation="posix/cpu,posix/mem"
--launcher="posix" --launcher_dir="/mesos/build/src" --logbufsecs="0" --logging_level="INFO"
--max_completed_executors_per_framework="150" --oversubscribed_resources_interval="15secs"
--perf_duration="10secs" --perf_interval="1mins" --qos_correction_interval_min="0ns" --quiet="false"
--recover="reconnect" --recovery_timeout="15mins" --registration_backoff_factor="10ms" --resources="cpus:2;gpus:0;mem:1024;disk:1024;ports:[31000-32000]"
--revocable_cpu_low_priority="true" --runtime_dir="/tmp/Endpoint_SlaveEndpointTest_NoAuthorizer_0_1ZOM9K"
--sandbox_directory="/mnt/mesos/sandbox" --strict="true" --switch_user="true" --systemd_enable_support="true"
--systemd_runtime_directory="/run/systemd/system" --version="false" --work_dir="/tmp/Endpoint_SlaveEndpointTest_NoAuthorizer_0_PFCRVO"
I0228 21:44:43.793222 27102 credentials.hpp:86] Loading credential for authentication from
'/tmp/Endpoint_SlaveEndpointTest_NoAuthorizer_0_1ZOM9K/credential'
I0228 21:44:43.793316 27102 slave.cpp:354] Agent using credential for: test-principal
I0228 21:44:43.793329 27102 credentials.hpp:37] Loading credentials for authentication from
'/tmp/Endpoint_SlaveEndpointTest_NoAuthorizer_0_1ZOM9K/http_credentials'
I0228 21:44:43.793421 27102 http.cpp:933] Using default 'basic' HTTP authenticator for realm
'mesos-agent-readonly'
I0228 21:44:43.793474 27102 http.cpp:933] Using default 'basic' HTTP authenticator for realm
'mesos-agent-readwrite'
I0228 21:44:43.793921 27102 slave.cpp:541] Agent resources: cpus(*):2; mem(*):1024; disk(*):1024;
ports(*):[31000-32000]
I0228 21:44:43.793956 27102 slave.cpp:549] Agent attributes: [  ]
I0228 21:44:43.793961 27102 slave.cpp:554] Agent hostname: 8afaf6520310
I0228 21:44:43.794067 27099 status_update_manager.cpp:177] Pausing sending status updates
I0228 21:44:43.794441 27097 state.cpp:62] Recovering state from '/tmp/Endpoint_SlaveEndpointTest_NoAuthorizer_0_PFCRVO/meta'
I0228 21:44:43.794589 27101 status_update_manager.cpp:203] Recovering status update manager
I0228 21:44:43.794756 27103 containerizer.cpp:599] Recovering containerizer
I0228 21:44:43.795285 27106 provisioner.cpp:410] Provisioner recovery complete
I0228 21:44:43.795452 27106 slave.cpp:5559] Finished recovery
I0228 21:44:43.795863 27106 slave.cpp:5733] Querying resource estimator for oversubscribable
resources
I0228 21:44:43.795994 27098 slave.cpp:5747] Received oversubscribable resources {} from the
resource estimator
I0228 21:44:43.796717 27110 process.cpp:3704] Handling HTTP event for process 'slave(707)'
with path: '/slave(707)/monitor/statistics'
I0228 21:44:43.797092 27098 http.cpp:885] Authorizing principal 'test-principal' to GET the
'/monitor/statistics' endpoint
I0228 21:44:43.798135 27109 slave.cpp:803] Agent terminating
[       OK ] Endpoint/SlaveEndpointTest.NoAuthorizer/0 (12 ms)
[ RUN      ] Endpoint/SlaveEndpointTest.NoAuthorizer/1
I0228 21:44:43.824394 27096 containerizer.cpp:220] Using isolation: posix/cpu,posix/mem,filesystem/posix,network/cni
W0228 21:44:43.824687 27096 backend.cpp:76] Failed to create 'aufs' backend: AufsBackend requires
root privileges
W0228 21:44:43.824723 27096 backend.cpp:76] Failed to create 'bind' backend: BindBackend requires
root privileges
I0228 21:44:43.824740 27096 provisioner.cpp:249] Using default backend 'copy'
I0228 21:44:43.825320 27096 cluster.cpp:446] Creating default 'local' authorizer
I0228 21:44:43.825872 27112 slave.cpp:211] Mesos agent started on (708)@172.17.0.2:35458
I0228 21:44:43.825887 27112 slave.cpp:212] Flags at startup: --acls="" --appc_simple_discovery_uri_prefix="http://"
--appc_store_dir="/tmp/mesos/store/appc" --authenticate_http_readonly="true" --authenticate_http_readwrite="true"
--authenticatee="crammd5" --authentication_backoff_factor="1secs" --authorizer="local" --cgroups_cpu_enable_pids_and_tids_count="false"
--cgroups_enable_cfs="false" --cgroups_hierarchy="/sys/fs/cgroup" --cgroups_limit_swap="false"
--cgroups_root="mesos" --container_disk_watch_interval="15secs" --containerizers="mesos" --credential="/tmp/Endpoint_SlaveEndpointTest_NoAuthorizer_1_pzLJkw/credential"
--default_role="*" --disk_watch_interval="1mins" --docker="docker" --docker_kill_orphans="true"
--docker_registry="https://registry-1.docker.io" --docker_remove_delay="6hrs" --docker_socket="/var/run/docker.sock"
--docker_stop_timeout="0ns" --docker_store_dir="/tmp/mesos/store/docker" --docker_volume_checkpoint_dir="/var/run/mesos/isolators/docker/volume"
--enforce_container_disk_quota="false" --executor_registration_timeout="1mins" --executor_shutdown_grace_period="5secs"
--fetcher_cache_dir="/tmp/Endpoint_SlaveEndpointTest_NoAuthorizer_1_pzLJkw/fetch" --fetcher_cache_size="2GB"
--frameworks_home="" --gc_delay="1weeks" --gc_disk_headroom="0.1" --hadoop_home="" --help="false"
--hostname_lookup="true" --http_authenticators="basic" --http_command_executor="false" --http_credentials="/tmp/Endpoint_SlaveEndpointTest_NoAuthorizer_1_pzLJkw/http_credentials"
--http_heartbeat_interval="30secs" --initialize_driver_logging="true" --isolation="posix/cpu,posix/mem"
--launcher="posix" --launcher_dir="/mesos/build/src" --logbufsecs="0" --logging_level="INFO"
--max_completed_executors_per_framework="150" --oversubscribed_resources_interval="15secs"
--perf_duration="10secs" --perf_interval="1mins" --qos_correction_interval_min="0ns" --quiet="false"
--recover="reconnect" --recovery_timeout="15mins" --registration_backoff_factor="10ms" --resources="cpus:2;gpus:0;mem:1024;disk:1024;ports:[31000-32000]"
--revocable_cpu_low_priority="true" --runtime_dir="/tmp/Endpoint_SlaveEndpointTest_NoAuthorizer_1_pzLJkw"
--sandbox_directory="/mnt/mesos/sandbox" --strict="true" --switch_user="true" --systemd_enable_support="true"
--systemd_runtime_directory="/run/systemd/system" --version="false" --work_dir="/tmp/Endpoint_SlaveEndpointTest_NoAuthorizer_1_38vl1z"
I0228 21:44:43.826171 27112 credentials.hpp:86] Loading credential for authentication from
'/tmp/Endpoint_SlaveEndpointTest_NoAuthorizer_1_pzLJkw/credential'
I0228 21:44:43.826269 27112 slave.cpp:354] Agent using credential for: test-principal
I0228 21:44:43.826280 27112 credentials.hpp:37] Loading credentials for authentication from
'/tmp/Endpoint_SlaveEndpointTest_NoAuthorizer_1_pzLJkw/http_credentials'
I0228 21:44:43.826373 27112 http.cpp:933] Using default 'basic' HTTP authenticator for realm
'mesos-agent-readonly'
I0228 21:44:43.826534 27112 http.cpp:933] Using default 'basic' HTTP authenticator for realm
'mesos-agent-readwrite'
I0228 21:44:43.827009 27112 slave.cpp:541] Agent resources: cpus(*):2; mem(*):1024; disk(*):1024;
ports(*):[31000-32000]
I0228 21:44:43.827044 27112 slave.cpp:549] Agent attributes: [  ]
I0228 21:44:43.827050 27112 slave.cpp:554] Agent hostname: 8afaf6520310
I0228 21:44:43.827170 27097 status_update_manager.cpp:177] Pausing sending status updates
I0228 21:44:43.827486 27102 state.cpp:62] Recovering state from '/tmp/Endpoint_SlaveEndpointTest_NoAuthorizer_1_38vl1z/meta'
I0228 21:44:43.827635 27104 status_update_manager.cpp:203] Recovering status update manager
I0228 21:44:43.827689 27104 containerizer.cpp:599] Recovering containerizer
I0228 21:44:43.828234 27106 provisioner.cpp:410] Provisioner recovery complete
I0228 21:44:43.828419 27107 slave.cpp:5559] Finished recovery
I0228 21:44:43.828862 27107 slave.cpp:5733] Querying resource estimator for oversubscribable
resources
I0228 21:44:43.828994 27108 slave.cpp:5747] Received oversubscribable resources {} from the
resource estimator
I0228 21:44:43.829692 27101 process.cpp:3704] Handling HTTP event for process 'slave(708)'
with path: '/slave(708)/monitor/statistics.json'
I0228 21:44:43.830070 27104 http.cpp:885] Authorizing principal 'test-principal' to GET the
'/monitor/statistics.json' endpoint
I0228 21:44:43.831176 27100 slave.cpp:803] Agent terminating
[       OK ] Endpoint/SlaveEndpointTest.NoAuthorizer/1 (41 ms)
[ RUN      ] Endpoint/SlaveEndpointTest.NoAuthorizer/2
I0228 21:44:43.866438 27096 containerizer.cpp:220] Using isolation: posix/cpu,posix/mem,filesystem/posix,network/cni
W0228 21:44:43.866739 27096 backend.cpp:76] Failed to create 'aufs' backend: AufsBackend requires
root privileges
W0228 21:44:43.866780 27096 backend.cpp:76] Failed to create 'bind' backend: BindBackend requires
root privileges
I0228 21:44:43.866799 27096 provisioner.cpp:249] Using default backend 'copy'
I0228 21:44:43.867439 27096 cluster.cpp:446] Creating default 'local' authorizer
I0228 21:44:43.867974 27105 slave.cpp:211] Mesos agent started on (709)@172.17.0.2:35458
I0228 21:44:43.867987 27105 slave.cpp:212] Flags at startup: --acls="" --appc_simple_discovery_uri_prefix="http://"
--appc_store_dir="/tmp/mesos/store/appc" --authenticate_http_readonly="true" --authenticate_http_readwrite="true"
--authenticatee="crammd5" --authentication_backoff_factor="1secs" --authorizer="local" --cgroups_cpu_enable_pids_and_tids_count="false"
--cgroups_enable_cfs="false" --cgroups_hierarchy="/sys/fs/cgroup" --cgroups_limit_swap="false"
--cgroups_root="mesos" --container_disk_watch_interval="15secs" --containerizers="mesos" --credential="/tmp/Endpoint_SlaveEndpointTest_NoAuthorizer_2_pNzyVh/credential"
--default_role="*" --disk_watch_interval="1mins" --docker="docker" --docker_kill_orphans="true"
--docker_registry="https://registry-1.docker.io" --docker_remove_delay="6hrs" --docker_socket="/var/run/docker.sock"
--docker_stop_timeout="0ns" --docker_store_dir="/tmp/mesos/store/docker" --docker_volume_checkpoint_dir="/var/run/mesos/isolators/docker/volume"
--enforce_container_disk_quota="false" --executor_registration_timeout="1mins" --executor_shutdown_grace_period="5secs"
--fetcher_cache_dir="/tmp/Endpoint_SlaveEndpointTest_NoAuthorizer_2_pNzyVh/fetch" --fetcher_cache_size="2GB"
--frameworks_home="" --gc_delay="1weeks" --gc_disk_headroom="0.1" --hadoop_home="" --help="false"
--hostname_lookup="true" --http_authenticators="basic" --http_command_executor="false" --http_credentials="/tmp/Endpoint_SlaveEndpointTest_NoAuthorizer_2_pNzyVh/http_credentials"
--http_heartbeat_interval="30secs" --initialize_driver_logging="true" --isolation="posix/cpu,posix/mem"
--launcher="posix" --launcher_dir="/mesos/build/src" --logbufsecs="0" --logging_level="INFO"
--max_completed_executors_per_framework="150" --oversubscribed_resources_interval="15secs"
--perf_duration="10secs" --perf_interval="1mins" --qos_correction_interval_min="0ns" --quiet="false"
--recover="reconnect" --recovery_timeout="15mins" --registration_backoff_factor="10ms" --resources="cpus:2;gpus:0;mem:1024;disk:1024;ports:[31000-32000]"
--revocable_cpu_low_priority="true" --runtime_dir="/tmp/Endpoint_SlaveEndpointTest_NoAuthorizer_2_pNzyVh"
--sandbox_directory="/mnt/mesos/sandbox" --strict="true" --switch_user="true" --systemd_enable_support="true"
--systemd_runtime_directory="/run/systemd/system" --version="false" --work_dir="/tmp/Endpoint_SlaveEndpointTest_NoAuthorizer_2_VmCkvl"
I0228 21:44:43.868263 27105 credentials.hpp:86] Loading credential for authentication from
'/tmp/Endpoint_SlaveEndpointTest_NoAuthorizer_2_pNzyVh/credential'
I0228 21:44:43.868350 27105 slave.cpp:354] Agent using credential for: test-principal
I0228 21:44:43.868363 27105 credentials.hpp:37] Loading credentials for authentication from
'/tmp/Endpoint_SlaveEndpointTest_NoAuthorizer_2_pNzyVh/http_credentials'
I0228 21:44:43.868448 27105 http.cpp:933] Using default 'basic' HTTP authenticator for realm
'mesos-agent-readonly'
I0228 21:44:43.868513 27105 http.cpp:933] Using default 'basic' HTTP authenticator for realm
'mesos-agent-readwrite'
I0228 21:44:43.868914 27105 slave.cpp:541] Agent resources: cpus(*):2; mem(*):1024; disk(*):1024;
ports(*):[31000-32000]
I0228 21:44:43.868952 27105 slave.cpp:549] Agent attributes: [  ]
I0228 21:44:43.868960 27105 slave.cpp:554] Agent hostname: 8afaf6520310
I0228 21:44:43.869079 27102 status_update_manager.cpp:177] Pausing sending status updates
I0228 21:44:43.869379 27097 state.cpp:62] Recovering state from '/tmp/Endpoint_SlaveEndpointTest_NoAuthorizer_2_VmCkvl/meta'
I0228 21:44:43.869566 27097 status_update_manager.cpp:203] Recovering status update manager
I0228 21:44:43.869668 27098 containerizer.cpp:599] Recovering containerizer
I0228 21:44:43.870122 27108 provisioner.cpp:410] Provisioner recovery complete
I0228 21:44:43.870319 27111 slave.cpp:5559] Finished recovery
I0228 21:44:43.870657 27111 slave.cpp:5733] Querying resource estimator for oversubscribable
resources
I0228 21:44:43.870765 27099 slave.cpp:5747] Received oversubscribable resources {} from the
resource estimator
I0228 21:44:43.871367 27104 process.cpp:3704] Handling HTTP event for process 'slave(709)'
with path: '/slave(709)/containers'
I0228 21:44:43.871793 27097 http.cpp:885] Authorizing principal 'test-principal' to GET the
'/containers' endpoint
I0228 21:44:43.872969 27109 slave.cpp:803] Agent terminating
[       OK ] Endpoint/SlaveEndpointTest.NoAuthorizer/2 (11 ms)
[----------] 9 tests from Endpoint/SlaveEndpointTest (447 ms total)

[----------] Global test environment tear-down
[==========] 1464 tests from 161 test cases ran. (501780 ms total)
[  PASSED  ] 1463 tests.
[  FAILED  ] 1 test, listed below:
[  FAILED  ] ContentType/AgentAPITest.LaunchNestedContainerSessionWithTTY/0, where GetParam()
= application/x-protobuf

 1 FAILED TEST
  YOU HAVE 12 DISABLED TESTS

make[3]: *** [CMakeFiles/check] Error 1
make[3]: Leaving directory `/mesos/build'
make[2]: Leaving directory `/mesos/build'
make[2]: *** [CMakeFiles/check.dir/all] Error 2
make[1]: Leaving directory `/mesos/build'
make[1]: *** [CMakeFiles/check.dir/rule] Error 2
make: *** [check] Error 2
+ docker rmi mesos-1488313581-19897
Untagged: mesos-1488313581-19897:latest
Deleted: sha256:b9e8d64c6881ae66c6e9d8a6c7468a1afda351b9e169a55c6461144f79caff72
Deleted: sha256:bc7994634096048ab4fc21585d74882aa9091abc26690c32274d68e0cde24488
Deleted: sha256:bc8cd817bfd84ca9de4ebf42bbf269dab39036daed54eb8959c4de2c2b9ea99c
Deleted: sha256:84000f80c9d916e24bbc0fb78532959c4e7cb917472354f744d6a371019c92b2
Deleted: sha256:83aa3b7c89e57440f81c2670f256886e5c5c6ad668fc1938e982b81c32d3c5a7
Deleted: sha256:ce9de31024b451d5f731dc44677acd5f4071030d8d0cde072a318831861d610d
Deleted: sha256:0aee43b039a9d1869817d54b2c8602811d0906d7299fdf261f1328aa8f3c55d6
Deleted: sha256:385ce707631cf68e7f8998464785952762bba48bc58a304ee3efbf61652b56cc
Deleted: sha256:19f43fac8b55f24bebe6038ddf451b56ecf532062586112fd16c26d8abde5c26
Deleted: sha256:57f03fcf671679462945a721927dd136605a5f595b9ffc29772dea70c15a4dd3
Deleted: sha256:f1ac290b3dfc4b9ed5971e4a9defcc9a13ee776bf7bc9efff745b662d5e73a0c
Deleted: sha256:5d1d11929e1cfbfad9aad05f6b61de2562ce9f8bfceccc5c68276621415690e6
Deleted: sha256:7f9992386f113ccb4f05279c05db1631dd7472d0d4bbd3abd9a6e0f608859868
Deleted: sha256:3a4df0567401fc4d0cb7166679119428f1d575179dc238b7addd926b606817fc
Deleted: sha256:78f3e915673ae6d3ef3140f9e0ef7c8bd14e77603c8c6d7f69528b1a6c8008fd
Deleted: sha256:fefe5c8a4461c9478693a037ef50006df84651265d696eeb400fa9f653b3b808
Deleted: sha256:263e7fe579e38001bf8a35f863f91755d0dead535ec11339c1e914ecb374145d
Deleted: sha256:106dd53dc46c68f81bb3616c093a9d5f478bdacc00d78625b94ed8524d6fbe21
Deleted: sha256:4d10a0ea816d8dfa0ef7fe2389a66d8cde74a7136b99fd9a0d55ca1a3b11effe
Deleted: sha256:5d61082c7e2d9a905b8c533240e3e0a224ffd921f17102d4a7d6ed37fac3791a
Deleted: sha256:ef57d9d9676bdc2d1f817021e8bc1e77d3363df7557aedd6712147ee61f54cfa
Deleted: sha256:e68e88ab2e53aed231de04066a3e3148c5182b9614d1ca0a115d5761422d1330
Deleted: sha256:7629aba1d30a26a3599bfa6e1bbe6a14bb11fcf73493e172b4c9670db881ea6e
Deleted: sha256:73a1040ac74e192899a025f7ec40f74ad38a1c05db4f06fb95f5811ae39622da
Build step 'Execute shell' marked build as failure

Mime
View raw message