mesos-builds mailing list archives

Site index · List index
Message view « Date » · « Thread »
Top « Date » · « Thread »
From Apache Jenkins Server <jenk...@builds.apache.org>
Subject Build failed in Jenkins: Mesos-Buildbot » cmake,clang,--verbose,GLOG_v=1 MESOS_VERBOSE=1,ubuntu:14.04,(docker||Hadoop)&&(!ubuntu-us1)&&(!ubuntu-eu2) #3276
Date Fri, 17 Feb 2017 08:02:18 GMT
See <https://builds.apache.org/job/Mesos-Buildbot/BUILDTOOL=cmake,COMPILER=clang,CONFIGURATION=--verbose,ENVIRONMENT=GLOG_v=1%20MESOS_VERBOSE=1,OS=ubuntu%3A14.04,label_exp=(docker%7C%7CHadoop)&&(!ubuntu-us1)&&(!ubuntu-eu2)/3276/changes>

Changes:

[josephwu] Fixed signed comparison warning in stout/protobuf.hpp.

[josephwu] Fixed signed comparison warning in libprocess/src/encoder.hpp.

------------------------------------------
[...truncated 168651 lines...]
I0217 08:02:12.590463 24852 status_update_manager.cpp:177] Pausing sending status updates
I0217 08:02:12.590819 24853 state.cpp:62] Recovering state from '/tmp/Endpoint_SlaveEndpointTest_AuthorizedRequest_1_1Hva4d/meta'
I0217 08:02:12.590955 24864 status_update_manager.cpp:203] Recovering status update manager
I0217 08:02:12.591115 24852 containerizer.cpp:599] Recovering containerizer
I0217 08:02:12.591766 24852 provisioner.cpp:410] Provisioner recovery complete
I0217 08:02:12.591977 24852 slave.cpp:5555] Finished recovery
I0217 08:02:12.592466 24852 slave.cpp:5729] Querying resource estimator for oversubscribable
resources
I0217 08:02:12.592624 24855 slave.cpp:5743] Received oversubscribable resources {} from the
resource estimator
I0217 08:02:12.593189 24863 process.cpp:3704] Handling HTTP event for process 'slave(693)'
with path: '/slave(693)/monitor/statistics.json'
I0217 08:02:12.593608 24854 http.cpp:871] Authorizing principal 'test-principal' to GET the
'/monitor/statistics.json' endpoint
I0217 08:02:12.595041 24853 slave.cpp:803] Agent terminating
[       OK ] Endpoint/SlaveEndpointTest.AuthorizedRequest/1 (11 ms)
[ RUN      ] Endpoint/SlaveEndpointTest.AuthorizedRequest/2
I0217 08:02:12.600654 24850 containerizer.cpp:220] Using isolation: posix/cpu,posix/mem,filesystem/posix,network/cni
W0217 08:02:12.600982 24850 backend.cpp:76] Failed to create 'aufs' backend: AufsBackend requires
root privileges
W0217 08:02:12.601040 24850 backend.cpp:76] Failed to create 'bind' backend: BindBackend requires
root privileges
I0217 08:02:12.601114 24850 provisioner.cpp:249] Using default backend 'copy'
I0217 08:02:12.602237 24852 slave.cpp:211] Mesos agent started on (694)@172.17.0.2:55324
I0217 08:02:12.602272 24852 slave.cpp:212] Flags at startup: --acls="" --appc_simple_discovery_uri_prefix="http://"
--appc_store_dir="/tmp/mesos/store/appc" --authenticate_http_readonly="true" --authenticate_http_readwrite="true"
--authenticatee="crammd5" --authentication_backoff_factor="1secs" --authorizer="local" --cgroups_cpu_enable_pids_and_tids_count="false"
--cgroups_enable_cfs="false" --cgroups_hierarchy="/sys/fs/cgroup" --cgroups_limit_swap="false"
--cgroups_root="mesos" --container_disk_watch_interval="15secs" --containerizers="mesos" --credential="/tmp/Endpoint_SlaveEndpointTest_AuthorizedRequest_2_tIkG3a/credential"
--default_role="*" --disk_watch_interval="1mins" --docker="docker" --docker_kill_orphans="true"
--docker_registry="https://registry-1.docker.io" --docker_remove_delay="6hrs" --docker_socket="/var/run/docker.sock"
--docker_stop_timeout="0ns" --docker_store_dir="/tmp/mesos/store/docker" --docker_volume_checkpoint_dir="/var/run/mesos/isolators/docker/volume"
--enforce_container_disk_quota="false" --executor_registration_timeout="1mins" --executor_shutdown_grace_period="5secs"
--fetcher_cache_dir="/tmp/Endpoint_SlaveEndpointTest_AuthorizedRequest_2_tIkG3a/fetch" --fetcher_cache_size="2GB"
--frameworks_home="" --gc_delay="1weeks" --gc_disk_headroom="0.1" --hadoop_home="" --help="false"
--hostname_lookup="true" --http_authenticators="basic" --http_command_executor="false" --http_credentials="/tmp/Endpoint_SlaveEndpointTest_AuthorizedRequest_2_tIkG3a/http_credentials"
--http_heartbeat_interval="30secs" --initialize_driver_logging="true" --isolation="posix/cpu,posix/mem"
--launcher="posix" --launcher_dir="/mesos/build/src" --logbufsecs="0" --logging_level="INFO"
--max_completed_executors_per_framework="150" --oversubscribed_resources_interval="15secs"
--perf_duration="10secs" --perf_interval="1mins" --qos_correction_interval_min="0ns" --quiet="false"
--recover="reconnect" --recovery_timeout="15mins" --registration_backoff_factor="10ms" --resources="cpus:2;gpus:0;mem:1024;disk:1024;ports:[31000-32000]"
--revocable_cpu_low_priority="true" --runtime_dir="/tmp/Endpoint_SlaveEndpointTest_AuthorizedRequest_2_tIkG3a"
--sandbox_directory="/mnt/mesos/sandbox" --strict="true" --switch_user="true" --systemd_enable_support="true"
--systemd_runtime_directory="/run/systemd/system" --version="false" --work_dir="/tmp/Endpoint_SlaveEndpointTest_AuthorizedRequest_2_RZTjEb"
I0217 08:02:12.602663 24852 credentials.hpp:86] Loading credential for authentication from
'/tmp/Endpoint_SlaveEndpointTest_AuthorizedRequest_2_tIkG3a/credential'
I0217 08:02:12.602771 24852 slave.cpp:354] Agent using credential for: test-principal
I0217 08:02:12.602792 24852 credentials.hpp:37] Loading credentials for authentication from
'/tmp/Endpoint_SlaveEndpointTest_AuthorizedRequest_2_tIkG3a/http_credentials'
I0217 08:02:12.602921 24852 http.cpp:919] Using default 'basic' HTTP authenticator for realm
'mesos-agent-readonly'
I0217 08:02:12.602985 24852 http.cpp:919] Using default 'basic' HTTP authenticator for realm
'mesos-agent-readwrite'
I0217 08:02:12.603425 24852 slave.cpp:541] Agent resources: cpus(*):2; mem(*):1024; disk(*):1024;
ports(*):[31000-32000]
I0217 08:02:12.603456 24852 slave.cpp:549] Agent attributes: [  ]
I0217 08:02:12.603462 24852 slave.cpp:554] Agent hostname: 953da132c577
I0217 08:02:12.603539 24858 status_update_manager.cpp:177] Pausing sending status updates
I0217 08:02:12.603735 24858 state.cpp:62] Recovering state from '/tmp/Endpoint_SlaveEndpointTest_AuthorizedRequest_2_RZTjEb/meta'
I0217 08:02:12.603889 24865 status_update_manager.cpp:203] Recovering status update manager
I0217 08:02:12.604104 24864 containerizer.cpp:599] Recovering containerizer
I0217 08:02:12.604758 24861 provisioner.cpp:410] Provisioner recovery complete
I0217 08:02:12.605022 24862 slave.cpp:5555] Finished recovery
I0217 08:02:12.605451 24862 slave.cpp:5729] Querying resource estimator for oversubscribable
resources
I0217 08:02:12.605548 24862 slave.cpp:5743] Received oversubscribable resources {} from the
resource estimator
I0217 08:02:12.606385 24851 process.cpp:3704] Handling HTTP event for process 'slave(694)'
with path: '/slave(694)/containers'
I0217 08:02:12.606875 24858 http.cpp:871] Authorizing principal 'test-principal' to GET the
'/containers' endpoint
I0217 08:02:12.608456 24852 slave.cpp:803] Agent terminating
[       OK ] Endpoint/SlaveEndpointTest.AuthorizedRequest/2 (13 ms)
[ RUN      ] Endpoint/SlaveEndpointTest.UnauthorizedRequest/0
I0217 08:02:12.613684 24850 containerizer.cpp:220] Using isolation: posix/cpu,posix/mem,filesystem/posix,network/cni
W0217 08:02:12.613963 24850 backend.cpp:76] Failed to create 'aufs' backend: AufsBackend requires
root privileges
W0217 08:02:12.614001 24850 backend.cpp:76] Failed to create 'bind' backend: BindBackend requires
root privileges
I0217 08:02:12.614012 24850 provisioner.cpp:249] Using default backend 'copy'
I0217 08:02:12.615319 24856 slave.cpp:211] Mesos agent started on (695)@172.17.0.2:55324
I0217 08:02:12.615347 24856 slave.cpp:212] Flags at startup: --acls="" --appc_simple_discovery_uri_prefix="http://"
--appc_store_dir="/tmp/mesos/store/appc" --authenticate_http_readonly="true" --authenticate_http_readwrite="true"
--authenticatee="crammd5" --authentication_backoff_factor="1secs" --authorizer="local" --cgroups_cpu_enable_pids_and_tids_count="false"
--cgroups_enable_cfs="false" --cgroups_hierarchy="/sys/fs/cgroup" --cgroups_limit_swap="false"
--cgroups_root="mesos" --container_disk_watch_interval="15secs" --containerizers="mesos" --credential="/tmp/Endpoint_SlaveEndpointTest_UnauthorizedRequest_0_t65sO8/credential"
--default_role="*" --disk_watch_interval="1mins" --docker="docker" --docker_kill_orphans="true"
--docker_registry="https://registry-1.docker.io" --docker_remove_delay="6hrs" --docker_socket="/var/run/docker.sock"
--docker_stop_timeout="0ns" --docker_store_dir="/tmp/mesos/store/docker" --docker_volume_checkpoint_dir="/var/run/mesos/isolators/docker/volume"
--enforce_container_disk_quota="false" --executor_registration_timeout="1mins" --executor_shutdown_grace_period="5secs"
--fetcher_cache_dir="/tmp/Endpoint_SlaveEndpointTest_UnauthorizedRequest_0_t65sO8/fetch" --fetcher_cache_size="2GB"
--frameworks_home="" --gc_delay="1weeks" --gc_disk_headroom="0.1" --hadoop_home="" --help="false"
--hostname_lookup="true" --http_authenticators="basic" --http_command_executor="false" --http_credentials="/tmp/Endpoint_SlaveEndpointTest_UnauthorizedRequest_0_t65sO8/http_credentials"
--http_heartbeat_interval="30secs" --initialize_driver_logging="true" --isolation="posix/cpu,posix/mem"
--launcher="posix" --launcher_dir="/mesos/build/src" --logbufsecs="0" --logging_level="INFO"
--max_completed_executors_per_framework="150" --oversubscribed_resources_interval="15secs"
--perf_duration="10secs" --perf_interval="1mins" --qos_correction_interval_min="0ns" --quiet="false"
--recover="reconnect" --recovery_timeout="15mins" --registration_backoff_factor="10ms" --resources="cpus:2;gpus:0;mem:1024;disk:1024;ports:[31000-32000]"
--revocable_cpu_low_priority="true" --runtime_dir="/tmp/Endpoint_SlaveEndpointTest_UnauthorizedRequest_0_t65sO8"
--sandbox_directory="/mnt/mesos/sandbox" --strict="true" --switch_user="true" --systemd_enable_support="true"
--systemd_runtime_directory="/run/systemd/system" --version="false" --work_dir="/tmp/Endpoint_SlaveEndpointTest_UnauthorizedRequest_0_b4NVm9"
I0217 08:02:12.615768 24856 credentials.hpp:86] Loading credential for authentication from
'/tmp/Endpoint_SlaveEndpointTest_UnauthorizedRequest_0_t65sO8/credential'
I0217 08:02:12.615877 24856 slave.cpp:354] Agent using credential for: test-principal
I0217 08:02:12.615897 24856 credentials.hpp:37] Loading credentials for authentication from
'/tmp/Endpoint_SlaveEndpointTest_UnauthorizedRequest_0_t65sO8/http_credentials'
I0217 08:02:12.616061 24856 http.cpp:919] Using default 'basic' HTTP authenticator for realm
'mesos-agent-readonly'
I0217 08:02:12.616148 24856 http.cpp:919] Using default 'basic' HTTP authenticator for realm
'mesos-agent-readwrite'
I0217 08:02:12.616767 24856 slave.cpp:541] Agent resources: cpus(*):2; mem(*):1024; disk(*):1024;
ports(*):[31000-32000]
I0217 08:02:12.616811 24856 slave.cpp:549] Agent attributes: [  ]
I0217 08:02:12.616817 24856 slave.cpp:554] Agent hostname: 953da132c577
I0217 08:02:12.616894 24862 status_update_manager.cpp:177] Pausing sending status updates
I0217 08:02:12.617214 24853 state.cpp:62] Recovering state from '/tmp/Endpoint_SlaveEndpointTest_UnauthorizedRequest_0_b4NVm9/meta'
I0217 08:02:12.617480 24853 status_update_manager.cpp:203] Recovering status update manager
I0217 08:02:12.617645 24857 containerizer.cpp:599] Recovering containerizer
I0217 08:02:12.618278 24858 provisioner.cpp:410] Provisioner recovery complete
I0217 08:02:12.618549 24858 slave.cpp:5555] Finished recovery
I0217 08:02:12.619040 24858 slave.cpp:5729] Querying resource estimator for oversubscribable
resources
I0217 08:02:12.619226 24865 slave.cpp:5743] Received oversubscribable resources {} from the
resource estimator
I0217 08:02:12.620061 24862 process.cpp:3704] Handling HTTP event for process 'slave(695)'
with path: '/slave(695)/monitor/statistics'
I0217 08:02:12.620558 24854 http.cpp:871] Authorizing principal 'test-principal' to GET the
'/monitor/statistics' endpoint
I0217 08:02:12.621695 24855 slave.cpp:803] Agent terminating
[       OK ] Endpoint/SlaveEndpointTest.UnauthorizedRequest/0 (13 ms)
[ RUN      ] Endpoint/SlaveEndpointTest.UnauthorizedRequest/1
I0217 08:02:12.626467 24850 containerizer.cpp:220] Using isolation: posix/cpu,posix/mem,filesystem/posix,network/cni
W0217 08:02:12.626729 24850 backend.cpp:76] Failed to create 'aufs' backend: AufsBackend requires
root privileges
W0217 08:02:12.626765 24850 backend.cpp:76] Failed to create 'bind' backend: BindBackend requires
root privileges
I0217 08:02:12.626775 24850 provisioner.cpp:249] Using default backend 'copy'
I0217 08:02:12.627885 24853 slave.cpp:211] Mesos agent started on (696)@172.17.0.2:55324
I0217 08:02:12.627928 24853 slave.cpp:212] Flags at startup: --acls="" --appc_simple_discovery_uri_prefix="http://"
--appc_store_dir="/tmp/mesos/store/appc" --authenticate_http_readonly="true" --authenticate_http_readwrite="true"
--authenticatee="crammd5" --authentication_backoff_factor="1secs" --authorizer="local" --cgroups_cpu_enable_pids_and_tids_count="false"
--cgroups_enable_cfs="false" --cgroups_hierarchy="/sys/fs/cgroup" --cgroups_limit_swap="false"
--cgroups_root="mesos" --container_disk_watch_interval="15secs" --containerizers="mesos" --credential="/tmp/Endpoint_SlaveEndpointTest_UnauthorizedRequest_1_xY2IH6/credential"
--default_role="*" --disk_watch_interval="1mins" --docker="docker" --docker_kill_orphans="true"
--docker_registry="https://registry-1.docker.io" --docker_remove_delay="6hrs" --docker_socket="/var/run/docker.sock"
--docker_stop_timeout="0ns" --docker_store_dir="/tmp/mesos/store/docker" --docker_volume_checkpoint_dir="/var/run/mesos/isolators/docker/volume"
--enforce_container_disk_quota="false" --executor_registration_timeout="1mins" --executor_shutdown_grace_period="5secs"
--fetcher_cache_dir="/tmp/Endpoint_SlaveEndpointTest_UnauthorizedRequest_1_xY2IH6/fetch" --fetcher_cache_size="2GB"
--frameworks_home="" --gc_delay="1weeks" --gc_disk_headroom="0.1" --hadoop_home="" --help="false"
--hostname_lookup="true" --http_authenticators="basic" --http_command_executor="false" --http_credentials="/tmp/Endpoint_SlaveEndpointTest_UnauthorizedRequest_1_xY2IH6/http_credentials"
--http_heartbeat_interval="30secs" --initialize_driver_logging="true" --isolation="posix/cpu,posix/mem"
--launcher="posix" --launcher_dir="/mesos/build/src" --logbufsecs="0" --logging_level="INFO"
--max_completed_executors_per_framework="150" --oversubscribed_resources_interval="15secs"
--perf_duration="10secs" --perf_interval="1mins" --qos_correction_interval_min="0ns" --quiet="false"
--recover="reconnect" --recovery_timeout="15mins" --registration_backoff_factor="10ms" --resources="cpus:2;gpus:0;mem:1024;disk:1024;ports:[31000-32000]"
--revocable_cpu_low_priority="true" --runtime_dir="/tmp/Endpoint_SlaveEndpointTest_UnauthorizedRequest_1_xY2IH6"
--sandbox_directory="/mnt/mesos/sandbox" --strict="true" --switch_user="true" --systemd_enable_support="true"
--systemd_runtime_directory="/run/systemd/system" --version="false" --work_dir="/tmp/Endpoint_SlaveEndpointTest_UnauthorizedRequest_1_VRZ6d7"
I0217 08:02:12.628451 24853 credentials.hpp:86] Loading credential for authentication from
'/tmp/Endpoint_SlaveEndpointTest_UnauthorizedRequest_1_xY2IH6/credential'
I0217 08:02:12.628564 24853 slave.cpp:354] Agent using credential for: test-principal
I0217 08:02:12.628582 24853 credentials.hpp:37] Loading credentials for authentication from
'/tmp/Endpoint_SlaveEndpointTest_UnauthorizedRequest_1_xY2IH6/http_credentials'
I0217 08:02:12.628708 24853 http.cpp:919] Using default 'basic' HTTP authenticator for realm
'mesos-agent-readonly'
I0217 08:02:12.628763 24853 http.cpp:919] Using default 'basic' HTTP authenticator for realm
'mesos-agent-readwrite'
I0217 08:02:12.629297 24853 slave.cpp:541] Agent resources: cpus(*):2; mem(*):1024; disk(*):1024;
ports(*):[31000-32000]
I0217 08:02:12.629343 24853 slave.cpp:549] Agent attributes: [  ]
I0217 08:02:12.629354 24853 slave.cpp:554] Agent hostname: 953da132c577
I0217 08:02:12.629508 24864 status_update_manager.cpp:177] Pausing sending status updates
I0217 08:02:12.629853 24858 state.cpp:62] Recovering state from '/tmp/Endpoint_SlaveEndpointTest_UnauthorizedRequest_1_VRZ6d7/meta'
I0217 08:02:12.629981 24859 status_update_manager.cpp:203] Recovering status update manager
I0217 08:02:12.630067 24855 containerizer.cpp:599] Recovering containerizer
I0217 08:02:12.630539 24854 provisioner.cpp:410] Provisioner recovery complete
I0217 08:02:12.630766 24855 slave.cpp:5555] Finished recovery
I0217 08:02:12.631103 24855 slave.cpp:5729] Querying resource estimator for oversubscribable
resources
I0217 08:02:12.631243 24852 slave.cpp:5743] Received oversubscribable resources {} from the
resource estimator
I0217 08:02:12.631849 24863 process.cpp:3704] Handling HTTP event for process 'slave(696)'
with path: '/slave(696)/monitor/statistics.json'
I0217 08:02:12.632246 24866 http.cpp:871] Authorizing principal 'test-principal' to GET the
'/monitor/statistics.json' endpoint
I0217 08:02:12.633194 24850 slave.cpp:803] Agent terminating
[       OK ] Endpoint/SlaveEndpointTest.UnauthorizedRequest/1 (11 ms)
[ RUN      ] Endpoint/SlaveEndpointTest.UnauthorizedRequest/2
I0217 08:02:12.637658 24850 containerizer.cpp:220] Using isolation: posix/cpu,posix/mem,filesystem/posix,network/cni
W0217 08:02:12.637910 24850 backend.cpp:76] Failed to create 'aufs' backend: AufsBackend requires
root privileges
W0217 08:02:12.637951 24850 backend.cpp:76] Failed to create 'bind' backend: BindBackend requires
root privileges
I0217 08:02:12.637969 24850 provisioner.cpp:249] Using default backend 'copy'
I0217 08:02:12.639086 24855 slave.cpp:211] Mesos agent started on (697)@172.17.0.2:55324
I0217 08:02:12.639111 24855 slave.cpp:212] Flags at startup: --acls="" --appc_simple_discovery_uri_prefix="http://"
--appc_store_dir="/tmp/mesos/store/appc" --authenticate_http_readonly="true" --authenticate_http_readwrite="true"
--authenticatee="crammd5" --authentication_backoff_factor="1secs" --authorizer="local" --cgroups_cpu_enable_pids_and_tids_count="false"
--cgroups_enable_cfs="false" --cgroups_hierarchy="/sys/fs/cgroup" --cgroups_limit_swap="false"
--cgroups_root="mesos" --container_disk_watch_interval="15secs" --containerizers="mesos" --credential="/tmp/Endpoint_SlaveEndpointTest_UnauthorizedRequest_2_xNWrI4/credential"
--default_role="*" --disk_watch_interval="1mins" --docker="docker" --docker_kill_orphans="true"
--docker_registry="https://registry-1.docker.io" --docker_remove_delay="6hrs" --docker_socket="/var/run/docker.sock"
--docker_stop_timeout="0ns" --docker_store_dir="/tmp/mesos/store/docker" --docker_volume_checkpoint_dir="/var/run/mesos/isolators/docker/volume"
--enforce_container_disk_quota="false" --executor_registration_timeout="1mins" --executor_shutdown_grace_period="5secs"
--fetcher_cache_dir="/tmp/Endpoint_SlaveEndpointTest_UnauthorizedRequest_2_xNWrI4/fetch" --fetcher_cache_size="2GB"
--frameworks_home="" --gc_delay="1weeks" --gc_disk_headroom="0.1" --hadoop_home="" --help="false"
--hostname_lookup="true" --http_authenticators="basic" --http_command_executor="false" --http_credentials="/tmp/Endpoint_SlaveEndpointTest_UnauthorizedRequest_2_xNWrI4/http_credentials"
--http_heartbeat_interval="30secs" --initialize_driver_logging="true" --isolation="posix/cpu,posix/mem"
--launcher="posix" --launcher_dir="/mesos/build/src" --logbufsecs="0" --logging_level="INFO"
--max_completed_executors_per_framework="150" --oversubscribed_resources_interval="15secs"
--perf_duration="10secs" --perf_interval="1mins" --qos_correction_interval_min="0ns" --quiet="false"
--recover="reconnect" --recovery_timeout="15mins" --registration_backoff_factor="10ms" --resources="cpus:2;gpus:0;mem:1024;disk:1024;ports:[31000-32000]"
--revocable_cpu_low_priority="true" --runtime_dir="/tmp/Endpoint_SlaveEndpointTest_UnauthorizedRequest_2_xNWrI4"
--sandbox_directory="/mnt/mesos/sandbox" --strict="true" --switch_user="true" --systemd_enable_support="true"
--systemd_runtime_directory="/run/systemd/system" --version="false" --work_dir="/tmp/Endpoint_SlaveEndpointTest_UnauthorizedRequest_2_Hqh0c5"
I0217 08:02:12.639431 24855 credentials.hpp:86] Loading credential for authentication from
'/tmp/Endpoint_SlaveEndpointTest_UnauthorizedRequest_2_xNWrI4/credential'
I0217 08:02:12.639511 24855 slave.cpp:354] Agent using credential for: test-principal
I0217 08:02:12.639528 24855 credentials.hpp:37] Loading credentials for authentication from
'/tmp/Endpoint_SlaveEndpointTest_UnauthorizedRequest_2_xNWrI4/http_credentials'
I0217 08:02:12.639634 24855 http.cpp:919] Using default 'basic' HTTP authenticator for realm
'mesos-agent-readonly'
I0217 08:02:12.639691 24855 http.cpp:919] Using default 'basic' HTTP authenticator for realm
'mesos-agent-readwrite'
I0217 08:02:12.640121 24855 slave.cpp:541] Agent resources: cpus(*):2; mem(*):1024; disk(*):1024;
ports(*):[31000-32000]
I0217 08:02:12.640156 24855 slave.cpp:549] Agent attributes: [  ]
I0217 08:02:12.640163 24855 slave.cpp:554] Agent hostname: 953da132c577
I0217 08:02:12.640261 24856 status_update_manager.cpp:177] Pausing sending status updates
I0217 08:02:12.640558 24854 state.cpp:62] Recovering state from '/tmp/Endpoint_SlaveEndpointTest_UnauthorizedRequest_2_Hqh0c5/meta'
I0217 08:02:12.640799 24851 status_update_manager.cpp:203] Recovering status update manager
I0217 08:02:12.640892 24860 containerizer.cpp:599] Recovering containerizer
I0217 08:02:12.641422 24860 provisioner.cpp:410] Provisioner recovery complete
I0217 08:02:12.641638 24862 slave.cpp:5555] Finished recovery
I0217 08:02:12.641957 24862 slave.cpp:5729] Querying resource estimator for oversubscribable
resources
I0217 08:02:12.642041 24864 slave.cpp:5743] Received oversubscribable resources {} from the
resource estimator
I0217 08:02:12.642745 24861 process.cpp:3704] Handling HTTP event for process 'slave(697)'
with path: '/slave(697)/containers'
I0217 08:02:12.643126 24851 http.cpp:871] Authorizing principal 'test-principal' to GET the
'/containers' endpoint
I0217 08:02:12.644451 24857 slave.cpp:803] Agent terminating
[       OK ] Endpoint/SlaveEndpointTest.UnauthorizedRequest/2 (11 ms)
[ RUN      ] Endpoint/SlaveEndpointTest.NoAuthorizer/0
I0217 08:02:12.648731 24850 containerizer.cpp:220] Using isolation: posix/cpu,posix/mem,filesystem/posix,network/cni
W0217 08:02:12.648960 24850 backend.cpp:76] Failed to create 'aufs' backend: AufsBackend requires
root privileges
W0217 08:02:12.648994 24850 backend.cpp:76] Failed to create 'bind' backend: BindBackend requires
root privileges
I0217 08:02:12.649006 24850 provisioner.cpp:249] Using default backend 'copy'
I0217 08:02:12.649544 24850 cluster.cpp:446] Creating default 'local' authorizer
I0217 08:02:12.650012 24856 slave.cpp:211] Mesos agent started on (698)@172.17.0.2:55324
I0217 08:02:12.650035 24856 slave.cpp:212] Flags at startup: --acls="" --appc_simple_discovery_uri_prefix="http://"
--appc_store_dir="/tmp/mesos/store/appc" --authenticate_http_readonly="true" --authenticate_http_readwrite="true"
--authenticatee="crammd5" --authentication_backoff_factor="1secs" --authorizer="local" --cgroups_cpu_enable_pids_and_tids_count="false"
--cgroups_enable_cfs="false" --cgroups_hierarchy="/sys/fs/cgroup" --cgroups_limit_swap="false"
--cgroups_root="mesos" --container_disk_watch_interval="15secs" --containerizers="mesos" --credential="/tmp/Endpoint_SlaveEndpointTest_NoAuthorizer_0_hoGjQ2/credential"
--default_role="*" --disk_watch_interval="1mins" --docker="docker" --docker_kill_orphans="true"
--docker_registry="https://registry-1.docker.io" --docker_remove_delay="6hrs" --docker_socket="/var/run/docker.sock"
--docker_stop_timeout="0ns" --docker_store_dir="/tmp/mesos/store/docker" --docker_volume_checkpoint_dir="/var/run/mesos/isolators/docker/volume"
--enforce_container_disk_quota="false" --executor_registration_timeout="1mins" --executor_shutdown_grace_period="5secs"
--fetcher_cache_dir="/tmp/Endpoint_SlaveEndpointTest_NoAuthorizer_0_hoGjQ2/fetch" --fetcher_cache_size="2GB"
--frameworks_home="" --gc_delay="1weeks" --gc_disk_headroom="0.1" --hadoop_home="" --help="false"
--hostname_lookup="true" --http_authenticators="basic" --http_command_executor="false" --http_credentials="/tmp/Endpoint_SlaveEndpointTest_NoAuthorizer_0_hoGjQ2/http_credentials"
--http_heartbeat_interval="30secs" --initialize_driver_logging="true" --isolation="posix/cpu,posix/mem"
--launcher="posix" --launcher_dir="/mesos/build/src" --logbufsecs="0" --logging_level="INFO"
--max_completed_executors_per_framework="150" --oversubscribed_resources_interval="15secs"
--perf_duration="10secs" --perf_interval="1mins" --qos_correction_interval_min="0ns" --quiet="false"
--recover="reconnect" --recovery_timeout="15mins" --registration_backoff_factor="10ms" --resources="cpus:2;gpus:0;mem:1024;disk:1024;ports:[31000-32000]"
--revocable_cpu_low_priority="true" --runtime_dir="/tmp/Endpoint_SlaveEndpointTest_NoAuthorizer_0_hoGjQ2"
--sandbox_directory="/mnt/mesos/sandbox" --strict="true" --switch_user="true" --systemd_enable_support="true"
--systemd_runtime_directory="/run/systemd/system" --version="false" --work_dir="/tmp/Endpoint_SlaveEndpointTest_NoAuthorizer_0_pJ34i3"
I0217 08:02:12.650346 24856 credentials.hpp:86] Loading credential for authentication from
'/tmp/Endpoint_SlaveEndpointTest_NoAuthorizer_0_hoGjQ2/credential'
I0217 08:02:12.650424 24856 slave.cpp:354] Agent using credential for: test-principal
I0217 08:02:12.650437 24856 credentials.hpp:37] Loading credentials for authentication from
'/tmp/Endpoint_SlaveEndpointTest_NoAuthorizer_0_hoGjQ2/http_credentials'
I0217 08:02:12.650519 24856 http.cpp:919] Using default 'basic' HTTP authenticator for realm
'mesos-agent-readonly'
I0217 08:02:12.650560 24856 http.cpp:919] Using default 'basic' HTTP authenticator for realm
'mesos-agent-readwrite'
I0217 08:02:12.650880 24856 slave.cpp:541] Agent resources: cpus(*):2; mem(*):1024; disk(*):1024;
ports(*):[31000-32000]
I0217 08:02:12.650910 24856 slave.cpp:549] Agent attributes: [  ]
I0217 08:02:12.650915 24856 slave.cpp:554] Agent hostname: 953da132c577
I0217 08:02:12.650992 24853 status_update_manager.cpp:177] Pausing sending status updates
I0217 08:02:12.651166 24856 state.cpp:62] Recovering state from '/tmp/Endpoint_SlaveEndpointTest_NoAuthorizer_0_pJ34i3/meta'
I0217 08:02:12.651298 24851 status_update_manager.cpp:203] Recovering status update manager
I0217 08:02:12.651420 24860 containerizer.cpp:599] Recovering containerizer
I0217 08:02:12.652026 24861 provisioner.cpp:410] Provisioner recovery complete
I0217 08:02:12.652216 24851 slave.cpp:5555] Finished recovery
I0217 08:02:12.652628 24851 slave.cpp:5729] Querying resource estimator for oversubscribable
resources
I0217 08:02:12.652760 24854 slave.cpp:5743] Received oversubscribable resources {} from the
resource estimator
I0217 08:02:12.653364 24860 process.cpp:3704] Handling HTTP event for process 'slave(698)'
with path: '/slave(698)/monitor/statistics'
I0217 08:02:12.653782 24865 http.cpp:871] Authorizing principal 'test-principal' to GET the
'/monitor/statistics' endpoint
I0217 08:02:12.654952 24866 slave.cpp:803] Agent terminating
[       OK ] Endpoint/SlaveEndpointTest.NoAuthorizer/0 (11 ms)
[ RUN      ] Endpoint/SlaveEndpointTest.NoAuthorizer/1
I0217 08:02:12.660012 24850 containerizer.cpp:220] Using isolation: posix/cpu,posix/mem,filesystem/posix,network/cni
W0217 08:02:12.660277 24850 backend.cpp:76] Failed to create 'aufs' backend: AufsBackend requires
root privileges
W0217 08:02:12.660315 24850 backend.cpp:76] Failed to create 'bind' backend: BindBackend requires
root privileges
I0217 08:02:12.660329 24850 provisioner.cpp:249] Using default backend 'copy'
I0217 08:02:12.661041 24850 cluster.cpp:446] Creating default 'local' authorizer
I0217 08:02:12.661486 24857 slave.cpp:211] Mesos agent started on (699)@172.17.0.2:55324
I0217 08:02:12.661509 24857 slave.cpp:212] Flags at startup: --acls="" --appc_simple_discovery_uri_prefix="http://"
--appc_store_dir="/tmp/mesos/store/appc" --authenticate_http_readonly="true" --authenticate_http_readwrite="true"
--authenticatee="crammd5" --authentication_backoff_factor="1secs" --authorizer="local" --cgroups_cpu_enable_pids_and_tids_count="false"
--cgroups_enable_cfs="false" --cgroups_hierarchy="/sys/fs/cgroup" --cgroups_limit_swap="false"
--cgroups_root="mesos" --container_disk_watch_interval="15secs" --containerizers="mesos" --credential="/tmp/Endpoint_SlaveEndpointTest_NoAuthorizer_1_3fgk50/credential"
--default_role="*" --disk_watch_interval="1mins" --docker="docker" --docker_kill_orphans="true"
--docker_registry="https://registry-1.docker.io" --docker_remove_delay="6hrs" --docker_socket="/var/run/docker.sock"
--docker_stop_timeout="0ns" --docker_store_dir="/tmp/mesos/store/docker" --docker_volume_checkpoint_dir="/var/run/mesos/isolators/docker/volume"
--enforce_container_disk_quota="false" --executor_registration_timeout="1mins" --executor_shutdown_grace_period="5secs"
--fetcher_cache_dir="/tmp/Endpoint_SlaveEndpointTest_NoAuthorizer_1_3fgk50/fetch" --fetcher_cache_size="2GB"
--frameworks_home="" --gc_delay="1weeks" --gc_disk_headroom="0.1" --hadoop_home="" --help="false"
--hostname_lookup="true" --http_authenticators="basic" --http_command_executor="false" --http_credentials="/tmp/Endpoint_SlaveEndpointTest_NoAuthorizer_1_3fgk50/http_credentials"
--http_heartbeat_interval="30secs" --initialize_driver_logging="true" --isolation="posix/cpu,posix/mem"
--launcher="posix" --launcher_dir="/mesos/build/src" --logbufsecs="0" --logging_level="INFO"
--max_completed_executors_per_framework="150" --oversubscribed_resources_interval="15secs"
--perf_duration="10secs" --perf_interval="1mins" --qos_correction_interval_min="0ns" --quiet="false"
--recover="reconnect" --recovery_timeout="15mins" --registration_backoff_factor="10ms" --resources="cpus:2;gpus:0;mem:1024;disk:1024;ports:[31000-32000]"
--revocable_cpu_low_priority="true" --runtime_dir="/tmp/Endpoint_SlaveEndpointTest_NoAuthorizer_1_3fgk50"
--sandbox_directory="/mnt/mesos/sandbox" --strict="true" --switch_user="true" --systemd_enable_support="true"
--systemd_runtime_directory="/run/systemd/system" --version="false" --work_dir="/tmp/Endpoint_SlaveEndpointTest_NoAuthorizer_1_Xvhhw1"
I0217 08:02:12.661851 24857 credentials.hpp:86] Loading credential for authentication from
'/tmp/Endpoint_SlaveEndpointTest_NoAuthorizer_1_3fgk50/credential'
I0217 08:02:12.661947 24857 slave.cpp:354] Agent using credential for: test-principal
I0217 08:02:12.661964 24857 credentials.hpp:37] Loading credentials for authentication from
'/tmp/Endpoint_SlaveEndpointTest_NoAuthorizer_1_3fgk50/http_credentials'
I0217 08:02:12.662073 24857 http.cpp:919] Using default 'basic' HTTP authenticator for realm
'mesos-agent-readonly'
I0217 08:02:12.662125 24857 http.cpp:919] Using default 'basic' HTTP authenticator for realm
'mesos-agent-readwrite'
I0217 08:02:12.662479 24857 slave.cpp:541] Agent resources: cpus(*):2; mem(*):1024; disk(*):1024;
ports(*):[31000-32000]
I0217 08:02:12.662510 24857 slave.cpp:549] Agent attributes: [  ]
I0217 08:02:12.662515 24857 slave.cpp:554] Agent hostname: 953da132c577
I0217 08:02:12.662572 24866 status_update_manager.cpp:177] Pausing sending status updates
I0217 08:02:12.662881 24865 state.cpp:62] Recovering state from '/tmp/Endpoint_SlaveEndpointTest_NoAuthorizer_1_Xvhhw1/meta'
I0217 08:02:12.663014 24861 status_update_manager.cpp:203] Recovering status update manager
I0217 08:02:12.663108 24861 containerizer.cpp:599] Recovering containerizer
I0217 08:02:12.663597 24853 provisioner.cpp:410] Provisioner recovery complete
I0217 08:02:12.663782 24862 slave.cpp:5555] Finished recovery
I0217 08:02:12.664155 24862 slave.cpp:5729] Querying resource estimator for oversubscribable
resources
I0217 08:02:12.664232 24851 slave.cpp:5743] Received oversubscribable resources {} from the
resource estimator
I0217 08:02:12.665096 24857 process.cpp:3704] Handling HTTP event for process 'slave(699)'
with path: '/slave(699)/monitor/statistics.json'
I0217 08:02:12.665537 24851 http.cpp:871] Authorizing principal 'test-principal' to GET the
'/monitor/statistics.json' endpoint
I0217 08:02:12.666792 24858 slave.cpp:803] Agent terminating
[       OK ] Endpoint/SlaveEndpointTest.NoAuthorizer/1 (11 ms)
[ RUN      ] Endpoint/SlaveEndpointTest.NoAuthorizer/2
I0217 08:02:12.671921 24850 containerizer.cpp:220] Using isolation: posix/cpu,posix/mem,filesystem/posix,network/cni
W0217 08:02:12.672269 24850 backend.cpp:76] Failed to create 'aufs' backend: AufsBackend requires
root privileges
W0217 08:02:12.672314 24850 backend.cpp:76] Failed to create 'bind' backend: BindBackend requires
root privileges
I0217 08:02:12.672327 24850 provisioner.cpp:249] Using default backend 'copy'
I0217 08:02:12.673068 24850 cluster.cpp:446] Creating default 'local' authorizer
I0217 08:02:12.673633 24854 slave.cpp:211] Mesos agent started on (700)@172.17.0.2:55324
I0217 08:02:12.673661 24854 slave.cpp:212] Flags at startup: --acls="" --appc_simple_discovery_uri_prefix="http://"
--appc_store_dir="/tmp/mesos/store/appc" --authenticate_http_readonly="true" --authenticate_http_readwrite="true"
--authenticatee="crammd5" --authentication_backoff_factor="1secs" --authorizer="local" --cgroups_cpu_enable_pids_and_tids_count="false"
--cgroups_enable_cfs="false" --cgroups_hierarchy="/sys/fs/cgroup" --cgroups_limit_swap="false"
--cgroups_root="mesos" --container_disk_watch_interval="15secs" --containerizers="mesos" --credential="/tmp/Endpoint_SlaveEndpointTest_NoAuthorizer_2_F9sQrZ/credential"
--default_role="*" --disk_watch_interval="1mins" --docker="docker" --docker_kill_orphans="true"
--docker_registry="https://registry-1.docker.io" --docker_remove_delay="6hrs" --docker_socket="/var/run/docker.sock"
--docker_stop_timeout="0ns" --docker_store_dir="/tmp/mesos/store/docker" --docker_volume_checkpoint_dir="/var/run/mesos/isolators/docker/volume"
--enforce_container_disk_quota="false" --executor_registration_timeout="1mins" --executor_shutdown_grace_period="5secs"
--fetcher_cache_dir="/tmp/Endpoint_SlaveEndpointTest_NoAuthorizer_2_F9sQrZ/fetch" --fetcher_cache_size="2GB"
--frameworks_home="" --gc_delay="1weeks" --gc_disk_headroom="0.1" --hadoop_home="" --help="false"
--hostname_lookup="true" --http_authenticators="basic" --http_command_executor="false" --http_credentials="/tmp/Endpoint_SlaveEndpointTest_NoAuthorizer_2_F9sQrZ/http_credentials"
--http_heartbeat_interval="30secs" --initialize_driver_logging="true" --isolation="posix/cpu,posix/mem"
--launcher="posix" --launcher_dir="/mesos/build/src" --logbufsecs="0" --logging_level="INFO"
--max_completed_executors_per_framework="150" --oversubscribed_resources_interval="15secs"
--perf_duration="10secs" --perf_interval="1mins" --qos_correction_interval_min="0ns" --quiet="false"
--recover="reconnect" --recovery_timeout="15mins" --registration_backoff_factor="10ms" --resources="cpus:2;gpus:0;mem:1024;disk:1024;ports:[31000-32000]"
--revocable_cpu_low_priority="true" --runtime_dir="/tmp/Endpoint_SlaveEndpointTest_NoAuthorizer_2_F9sQrZ"
--sandbox_directory="/mnt/mesos/sandbox" --strict="true" --switch_user="true" --systemd_enable_support="true"
--systemd_runtime_directory="/run/systemd/system" --version="false" --work_dir="/tmp/Endpoint_SlaveEndpointTest_NoAuthorizer_2_TpAUQZ"
I0217 08:02:12.674064 24854 credentials.hpp:86] Loading credential for authentication from
'/tmp/Endpoint_SlaveEndpointTest_NoAuthorizer_2_F9sQrZ/credential'
I0217 08:02:12.674157 24854 slave.cpp:354] Agent using credential for: test-principal
I0217 08:02:12.674172 24854 credentials.hpp:37] Loading credentials for authentication from
'/tmp/Endpoint_SlaveEndpointTest_NoAuthorizer_2_F9sQrZ/http_credentials'
I0217 08:02:12.674278 24854 http.cpp:919] Using default 'basic' HTTP authenticator for realm
'mesos-agent-readonly'
I0217 08:02:12.674332 24854 http.cpp:919] Using default 'basic' HTTP authenticator for realm
'mesos-agent-readwrite'
I0217 08:02:12.674808 24854 slave.cpp:541] Agent resources: cpus(*):2; mem(*):1024; disk(*):1024;
ports(*):[31000-32000]
I0217 08:02:12.674847 24854 slave.cpp:549] Agent attributes: [  ]
I0217 08:02:12.674854 24854 slave.cpp:554] Agent hostname: 953da132c577
I0217 08:02:12.674942 24866 status_update_manager.cpp:177] Pausing sending status updates
I0217 08:02:12.675312 24858 state.cpp:62] Recovering state from '/tmp/Endpoint_SlaveEndpointTest_NoAuthorizer_2_TpAUQZ/meta'
I0217 08:02:12.675468 24852 status_update_manager.cpp:203] Recovering status update manager
I0217 08:02:12.675688 24862 containerizer.cpp:599] Recovering containerizer
I0217 08:02:12.676240 24860 provisioner.cpp:410] Provisioner recovery complete
I0217 08:02:12.676440 24858 slave.cpp:5555] Finished recovery
I0217 08:02:12.676790 24858 slave.cpp:5729] Querying resource estimator for oversubscribable
resources
I0217 08:02:12.676909 24852 slave.cpp:5743] Received oversubscribable resources {} from the
resource estimator
I0217 08:02:12.677495 24858 process.cpp:3704] Handling HTTP event for process 'slave(700)'
with path: '/slave(700)/containers'
I0217 08:02:12.678047 24863 http.cpp:871] Authorizing principal 'test-principal' to GET the
'/containers' endpoint
I0217 08:02:12.679533 24850 slave.cpp:803] Agent terminating
[       OK ] Endpoint/SlaveEndpointTest.NoAuthorizer/2 (12 ms)
[----------] 9 tests from Endpoint/SlaveEndpointTest (108 ms total)

[----------] Global test environment tear-down
[==========] 1445 tests from 160 test cases ran. (194911 ms total)
[  PASSED  ] 1444 tests.
[  FAILED  ] 1 test, listed below:
[  FAILED  ] ContainerLoggerTest.LOGROTATE_RotateInSandbox

 1 FAILED TEST
  YOU HAVE 12 DISABLED TESTS

make[3]: *** [CMakeFiles/check] Error 1
make[3]: Leaving directory `/mesos/build'
make[2]: *** [CMakeFiles/check.dir/all] Error 2
make[2]: Leaving directory `/mesos/build'
make[1]: *** [CMakeFiles/check.dir/rule] Error 2
make[1]: Leaving directory `/mesos/build'
make: *** [check] Error 2
+ docker rmi mesos-1487316424-21972
Untagged: mesos-1487316424-21972:latest
Deleted: sha256:e13fa3ee861e580351f60e63ba57edf0fc6ab04c568f9d6b7b60ceb5f526f66b
Deleted: sha256:fa6427e814cf07e70c804e34c9601f57cff2beb616571e8a18af6344f7ac79e2
Deleted: sha256:d2bf3310273a434000af05b292bcb2f0600aaacc792efad973d90ca205c686f2
Deleted: sha256:7d6dba58b230d847747571259bdceac6899cb5a8225980d742f6a7cb3fbe41af
Deleted: sha256:1d12fe102827b14e6754919b0320d9ffc32b7af4b56f50e1fac5a16cefe88b5b
Deleted: sha256:7d18a8522e9a69edfd5b0bd5a809a37377b0e8a35b7bc3e28ffea286080d51a4
Deleted: sha256:2e31e718c25d480189ee625d845a60d209715d78272cb08614a6a5ddf1b15037
Deleted: sha256:d624f7dcd3bb2178be44af835ac8f88229e653bb049d8c0b02271f247b39743a
Deleted: sha256:cec8658ea6807354c75de81897f1809bf858584f3614617fa8f02b2637dd4e1b
Deleted: sha256:94723b11ca9375e26866cb151c280c78452e0c221300614671b31847a8370ac2
Deleted: sha256:221a8753fd5fa651b4e9be408ca0687bc771262c806be67414c31339b59fcade
Deleted: sha256:dd7929fec16e130471c82f962fa526d444c0fe92e48834d8384b7cb49ac011aa
Deleted: sha256:475a2299001f35290ca26c1c0e083d9cbb96207c2d5ac7073bdaa494fe1bd4ba
Deleted: sha256:f33679083c9e0855ceac97d3a9a6433c42041ccd724f1094032153e76407be5d
Deleted: sha256:9c68c01c3fdc0eb56392555d4c32bec3095e8ad54f05dae03b9a217ecee36389
Deleted: sha256:2b1f8eb413678dde462ef6140a1edb36bc0caccdd34ee4dd937eb3913713d36b
Deleted: sha256:63df0075aeb57c2dedf95cc04293d7ae016702d347214ee547ee05de2d9c422c
Deleted: sha256:bc57b179e539ea3cd2a5289a87ef123869f9ca426578671cc3643c91c35f6421
Deleted: sha256:87cb376a5e1354d0fce3bfcc3abde5f075f27332067281e8529981ff07b2404b
Deleted: sha256:6d150d66ffcc7bbe305e11c0870c96e432569a300f25966ca5716a22661b87eb
Deleted: sha256:3170f758d0ae13255f93227eb19bcc2d2cef49947c3a57d9be1c9213685bc43f
Deleted: sha256:22f4a92f38432acc36cb7f97d0b57e4e5ba3e222037c0b51aa57ec0d0efb3c4d
Deleted: sha256:854c9ebc538664ff12c7e5c1c1df940ad534838e62535b13b3ec336df373495b
Deleted: sha256:b9a49bcfd8f9aa6aa78f462f0e7a806ca1f54698cf08f2f587d25c28e04b9915
Build step 'Execute shell' marked build as failure

Mime
View raw message