mesos-builds mailing list archives

Site index · List index
Message view « Date » · « Thread »
Top « Date » · « Thread »
From Apache Jenkins Server <jenk...@builds.apache.org>
Subject Build failed in Jenkins: Mesos-Buildbot » autotools,gcc,--verbose --enable-libevent --enable-ssl,GLOG_v=1 MESOS_VERBOSE=1,centos:7,(docker||Hadoop)&&(!ubuntu-us1)&&(!ubuntu-eu2) #3252
Date Thu, 09 Feb 2017 23:52:50 GMT
See <https://builds.apache.org/job/Mesos-Buildbot/BUILDTOOL=autotools,COMPILER=gcc,CONFIGURATION=--verbose%20--enable-libevent%20--enable-ssl,ENVIRONMENT=GLOG_v=1%20MESOS_VERBOSE=1,OS=centos%3A7,label_exp=(docker%7C%7CHadoop)&&(!ubuntu-us1)&&(!ubuntu-eu2)/3252/changes>

Changes:

[gyliu513] Enabled suppress offer per role.

[gyliu513] Enabled `ReviveOffersMessage` support revive per role.

[gyliu513] Augmented master `Revive` API to accept `Call::Revive`.

[gyliu513] Enabled revive offer per role.

[xujyan] Add support for the ELF .interp section.

[xujyan] Capture ELF interpreters in the ldd utility.

[xujyan] Revert "Revert "Use the stout ELF parser to collect rootfs files."".

------------------------------------------
[...truncated 13131 lines...]
I0209 23:52:37.716728 28007 openssl.cpp:429] Will not verify peer certificate!
NOTE: Set LIBPROCESS_SSL_VERIFY_CERT=1 to enable peer certificate verification
I0209 23:52:37.716735 28007 openssl.cpp:435] Will only verify peer certificate if presented!
NOTE: Set LIBPROCESS_SSL_REQUIRE_CERT=1 to require peer certificate verification
I0209 23:52:37.730118 28007 process.cpp:1246] libprocess is initialized on 172.17.0.3:47218
with 16 worker threads
I0209 23:52:37.735487 29203 process.cpp:3704] Handling HTTP event for process '(89)' with
path: '/(89)/post'
I0209 23:52:37.778839 29201 process.cpp:3704] Handling HTTP event for process '(89)' with
path: '/(89)/post'
[       OK ] Scheme/HTTPTest.Post/0 (453 ms)
[ RUN      ] Scheme/HTTPTest.Post/1
I0209 23:52:37.821259 28007 process.cpp:1246] libprocess is initialized on 172.17.0.3:35187
with 16 worker threads
I0209 23:52:37.822767 29216 process.cpp:3704] Handling HTTP event for process '(90)' with
path: '/(90)/post'
I0209 23:52:37.834581 29223 process.cpp:3704] Handling HTTP event for process '(90)' with
path: '/(90)/post'
[       OK ] Scheme/HTTPTest.Post/1 (19 ms)
[ RUN      ] Scheme/HTTPTest.Delete/0
I0209 23:52:38.273438 28007 openssl.cpp:419] CA file path is unspecified! NOTE: Set CA file
path with LIBPROCESS_SSL_CA_FILE=<filepath>
I0209 23:52:38.273461 28007 openssl.cpp:424] CA directory path unspecified! NOTE: Set CA directory
path with LIBPROCESS_SSL_CA_DIR=<dirpath>
I0209 23:52:38.273466 28007 openssl.cpp:429] Will not verify peer certificate!
NOTE: Set LIBPROCESS_SSL_VERIFY_CERT=1 to enable peer certificate verification
I0209 23:52:38.273473 28007 openssl.cpp:435] Will only verify peer certificate if presented!
NOTE: Set LIBPROCESS_SSL_REQUIRE_CERT=1 to require peer certificate verification
I0209 23:52:38.276278 28007 process.cpp:1246] libprocess is initialized on 172.17.0.3:60177
with 16 worker threads
I0209 23:52:38.281440 29248 process.cpp:3704] Handling HTTP event for process '(91)' with
path: '/(91)/delete'
[       OK ] Scheme/HTTPTest.Delete/0 (446 ms)
[ RUN      ] Scheme/HTTPTest.Delete/1
I0209 23:52:38.285328 28007 process.cpp:1246] libprocess is initialized on 172.17.0.3:47747
with 16 worker threads
I0209 23:52:38.286223 29250 process.cpp:3704] Handling HTTP event for process '(92)' with
path: '/(92)/delete'
[       OK ] Scheme/HTTPTest.Delete/1 (4 ms)
[ RUN      ] Scheme/HTTPTest.Request/0
I0209 23:52:38.595206 28007 openssl.cpp:419] CA file path is unspecified! NOTE: Set CA file
path with LIBPROCESS_SSL_CA_FILE=<filepath>
I0209 23:52:38.595230 28007 openssl.cpp:424] CA directory path unspecified! NOTE: Set CA directory
path with LIBPROCESS_SSL_CA_DIR=<dirpath>
I0209 23:52:38.595235 28007 openssl.cpp:429] Will not verify peer certificate!
NOTE: Set LIBPROCESS_SSL_VERIFY_CERT=1 to enable peer certificate verification
I0209 23:52:38.595239 28007 openssl.cpp:435] Will only verify peer certificate if presented!
NOTE: Set LIBPROCESS_SSL_REQUIRE_CERT=1 to require peer certificate verification
I0209 23:52:38.602149 28007 process.cpp:1246] libprocess is initialized on 172.17.0.3:41247
with 16 worker threads
I0209 23:52:38.607517 29280 process.cpp:3704] Handling HTTP event for process '(93)' with
path: '/(93)/request'
[       OK ] Scheme/HTTPTest.Request/0 (322 ms)
[ RUN      ] Scheme/HTTPTest.Request/1
I0209 23:52:38.617696 28007 process.cpp:1246] libprocess is initialized on 172.17.0.3:59689
with 16 worker threads
I0209 23:52:38.618676 29288 process.cpp:3704] Handling HTTP event for process '(94)' with
path: '/(94)/request'
[       OK ] Scheme/HTTPTest.Request/1 (11 ms)
[ RUN      ] Scheme/HTTPTest.QueryEncodeDecode/0
I0209 23:52:39.034658 28007 openssl.cpp:419] CA file path is unspecified! NOTE: Set CA file
path with LIBPROCESS_SSL_CA_FILE=<filepath>
I0209 23:52:39.034683 28007 openssl.cpp:424] CA directory path unspecified! NOTE: Set CA directory
path with LIBPROCESS_SSL_CA_DIR=<dirpath>
I0209 23:52:39.034689 28007 openssl.cpp:429] Will not verify peer certificate!
NOTE: Set LIBPROCESS_SSL_VERIFY_CERT=1 to enable peer certificate verification
I0209 23:52:39.034695 28007 openssl.cpp:435] Will only verify peer certificate if presented!
NOTE: Set LIBPROCESS_SSL_REQUIRE_CERT=1 to require peer certificate verification
I0209 23:52:39.037281 28007 process.cpp:1246] libprocess is initialized on 172.17.0.3:43242
with 16 worker threads
[       OK ] Scheme/HTTPTest.QueryEncodeDecode/0 (417 ms)
[ RUN      ] Scheme/HTTPTest.QueryEncodeDecode/1
I0209 23:52:39.050175 28007 process.cpp:1246] libprocess is initialized on 172.17.0.3:44276
with 16 worker threads
[       OK ] Scheme/HTTPTest.QueryEncodeDecode/1 (13 ms)
[ RUN      ] Scheme/HTTPTest.Headers/0
I0209 23:52:39.413156 28007 openssl.cpp:419] CA file path is unspecified! NOTE: Set CA file
path with LIBPROCESS_SSL_CA_FILE=<filepath>
I0209 23:52:39.413178 28007 openssl.cpp:424] CA directory path unspecified! NOTE: Set CA directory
path with LIBPROCESS_SSL_CA_DIR=<dirpath>
I0209 23:52:39.413184 28007 openssl.cpp:429] Will not verify peer certificate!
NOTE: Set LIBPROCESS_SSL_VERIFY_CERT=1 to enable peer certificate verification
I0209 23:52:39.413188 28007 openssl.cpp:435] Will only verify peer certificate if presented!
NOTE: Set LIBPROCESS_SSL_REQUIRE_CERT=1 to require peer certificate verification
I0209 23:52:39.415917 28007 process.cpp:1246] libprocess is initialized on 172.17.0.3:59062
with 16 worker threads
[       OK ] Scheme/HTTPTest.Headers/0 (366 ms)
[ RUN      ] Scheme/HTTPTest.Headers/1
I0209 23:52:39.418736 28007 process.cpp:1246] libprocess is initialized on 172.17.0.3:38867
with 16 worker threads
[       OK ] Scheme/HTTPTest.Headers/1 (3 ms)
[ RUN      ] Scheme/HTTPTest.CaseInsensitiveHeaders/0
I0209 23:52:39.526715 28007 openssl.cpp:419] CA file path is unspecified! NOTE: Set CA file
path with LIBPROCESS_SSL_CA_FILE=<filepath>
I0209 23:52:39.526739 28007 openssl.cpp:424] CA directory path unspecified! NOTE: Set CA directory
path with LIBPROCESS_SSL_CA_DIR=<dirpath>
I0209 23:52:39.526747 28007 openssl.cpp:429] Will not verify peer certificate!
NOTE: Set LIBPROCESS_SSL_VERIFY_CERT=1 to enable peer certificate verification
I0209 23:52:39.526754 28007 openssl.cpp:435] Will only verify peer certificate if presented!
NOTE: Set LIBPROCESS_SSL_REQUIRE_CERT=1 to require peer certificate verification
I0209 23:52:39.530902 28007 process.cpp:1246] libprocess is initialized on 172.17.0.3:48171
with 16 worker threads
[       OK ] Scheme/HTTPTest.CaseInsensitiveHeaders/0 (112 ms)
[ RUN      ] Scheme/HTTPTest.CaseInsensitiveHeaders/1
I0209 23:52:39.538260 28007 process.cpp:1246] libprocess is initialized on 172.17.0.3:40794
with 16 worker threads
[       OK ] Scheme/HTTPTest.CaseInsensitiveHeaders/1 (7 ms)
[ RUN      ] Scheme/HTTPTest.WWWAuthenticateHeader/0
I0209 23:52:39.675724 28007 openssl.cpp:419] CA file path is unspecified! NOTE: Set CA file
path with LIBPROCESS_SSL_CA_FILE=<filepath>
I0209 23:52:39.675745 28007 openssl.cpp:424] CA directory path unspecified! NOTE: Set CA directory
path with LIBPROCESS_SSL_CA_DIR=<dirpath>
I0209 23:52:39.675750 28007 openssl.cpp:429] Will not verify peer certificate!
NOTE: Set LIBPROCESS_SSL_VERIFY_CERT=1 to enable peer certificate verification
I0209 23:52:39.675755 28007 openssl.cpp:435] Will only verify peer certificate if presented!
NOTE: Set LIBPROCESS_SSL_REQUIRE_CERT=1 to require peer certificate verification
I0209 23:52:39.683642 28007 process.cpp:1246] libprocess is initialized on 172.17.0.3:34788
with 16 worker threads
[       OK ] Scheme/HTTPTest.WWWAuthenticateHeader/0 (146 ms)
[ RUN      ] Scheme/HTTPTest.WWWAuthenticateHeader/1
I0209 23:52:39.690450 28007 process.cpp:1246] libprocess is initialized on 172.17.0.3:33129
with 16 worker threads
[       OK ] Scheme/HTTPTest.WWWAuthenticateHeader/1 (6 ms)
[ RUN      ] Scheme/HTTPTest.Accepts/0
I0209 23:52:40.415710 28007 openssl.cpp:419] CA file path is unspecified! NOTE: Set CA file
path with LIBPROCESS_SSL_CA_FILE=<filepath>
I0209 23:52:40.415735 28007 openssl.cpp:424] CA directory path unspecified! NOTE: Set CA directory
path with LIBPROCESS_SSL_CA_DIR=<dirpath>
I0209 23:52:40.415741 28007 openssl.cpp:429] Will not verify peer certificate!
NOTE: Set LIBPROCESS_SSL_VERIFY_CERT=1 to enable peer certificate verification
I0209 23:52:40.415745 28007 openssl.cpp:435] Will only verify peer certificate if presented!
NOTE: Set LIBPROCESS_SSL_REQUIRE_CERT=1 to require peer certificate verification
I0209 23:52:40.417785 28007 process.cpp:1246] libprocess is initialized on 172.17.0.3:58440
with 16 worker threads
[       OK ] Scheme/HTTPTest.Accepts/0 (728 ms)
[ RUN      ] Scheme/HTTPTest.Accepts/1
I0209 23:52:40.420827 28007 process.cpp:1246] libprocess is initialized on 172.17.0.3:42388
with 16 worker threads
[       OK ] Scheme/HTTPTest.Accepts/1 (3 ms)
I0209 23:52:40.430297 28007 process.cpp:1246] libprocess is initialized on 172.17.0.3:56554
with 16 worker threads
[----------] 42 tests from Scheme/HTTPTest (8389 ms total)

[----------] 4 tests from Encryption/NetSocketTest
[ RUN      ] Encryption/NetSocketTest.EOFBeforeRecv/0
I0209 23:52:40.783998 28007 openssl.cpp:419] CA file path is unspecified! NOTE: Set CA file
path with LIBPROCESS_SSL_CA_FILE=<filepath>
I0209 23:52:40.784021 28007 openssl.cpp:424] CA directory path unspecified! NOTE: Set CA directory
path with LIBPROCESS_SSL_CA_DIR=<dirpath>
I0209 23:52:40.784026 28007 openssl.cpp:429] Will not verify peer certificate!
NOTE: Set LIBPROCESS_SSL_VERIFY_CERT=1 to enable peer certificate verification
I0209 23:52:40.784031 28007 openssl.cpp:435] Will only verify peer certificate if presented!
NOTE: Set LIBPROCESS_SSL_REQUIRE_CERT=1 to require peer certificate verification
I0209 23:52:40.786335 28007 process.cpp:1246] libprocess is initialized on 172.17.0.3:37563
with 16 worker threads
[       OK ] Encryption/NetSocketTest.EOFBeforeRecv/0 (399 ms)
[ RUN      ] Encryption/NetSocketTest.EOFBeforeRecv/1
I0209 23:52:40.838009 28007 process.cpp:1246] libprocess is initialized on 172.17.0.3:54453
with 16 worker threads
[       OK ] Encryption/NetSocketTest.EOFBeforeRecv/1 (10 ms)
[ RUN      ] Encryption/NetSocketTest.EOFAfterRecv/0
I0209 23:52:41.072222 28007 openssl.cpp:419] CA file path is unspecified! NOTE: Set CA file
path with LIBPROCESS_SSL_CA_FILE=<filepath>
I0209 23:52:41.072248 28007 openssl.cpp:424] CA directory path unspecified! NOTE: Set CA directory
path with LIBPROCESS_SSL_CA_DIR=<dirpath>
I0209 23:52:41.072254 28007 openssl.cpp:429] Will not verify peer certificate!
NOTE: Set LIBPROCESS_SSL_VERIFY_CERT=1 to enable peer certificate verification
I0209 23:52:41.072258 28007 openssl.cpp:435] Will only verify peer certificate if presented!
NOTE: Set LIBPROCESS_SSL_REQUIRE_CERT=1 to require peer certificate verification
I0209 23:52:41.085166 28007 process.cpp:1246] libprocess is initialized on 172.17.0.3:60851
with 16 worker threads
[       OK ] Encryption/NetSocketTest.EOFAfterRecv/0 (291 ms)
[ RUN      ] Encryption/NetSocketTest.EOFAfterRecv/1
I0209 23:52:41.133333 28007 process.cpp:1246] libprocess is initialized on 172.17.0.3:52559
with 16 worker threads
[       OK ] Encryption/NetSocketTest.EOFAfterRecv/1 (5 ms)
I0209 23:52:41.139102 28007 process.cpp:1246] libprocess is initialized on 172.17.0.3:54189
with 16 worker threads
[----------] 4 tests from Encryption/NetSocketTest (705 ms total)

[----------] 6 tests from SSLVerifyIPAdd/SSLTest
[ RUN      ] SSLVerifyIPAdd/SSLTest.BasicSameProcess/0
I0209 23:52:41.480868 28007 openssl.cpp:429] Will not verify peer certificate!
NOTE: Set LIBPROCESS_SSL_VERIFY_CERT=1 to enable peer certificate verification
I0209 23:52:41.480891 28007 openssl.cpp:449] LIBPROCESS_SSL_REQUIRE_CERT implies peer certificate
verification.
LIBPROCESS_SSL_VERIFY_CERT set to true
I0209 23:52:41.481003 28007 openssl.cpp:478] Using CA file: /tmp/OdjC5M/cert.pem
I0209 23:52:41.481016 28007 openssl.cpp:481] Using CA dir: /tmp/OdjC5M
[       OK ] SSLVerifyIPAdd/SSLTest.BasicSameProcess/0 (351 ms)
[ RUN      ] SSLVerifyIPAdd/SSLTest.BasicSameProcess/1
I0209 23:52:41.764394 28007 openssl.cpp:429] Will not verify peer certificate!
NOTE: Set LIBPROCESS_SSL_VERIFY_CERT=1 to enable peer certificate verification
I0209 23:52:41.764423 28007 openssl.cpp:441] Will use IP address verification in subject alternative
name certificate extension.
I0209 23:52:41.764430 28007 openssl.cpp:449] LIBPROCESS_SSL_REQUIRE_CERT implies peer certificate
verification.
LIBPROCESS_SSL_VERIFY_CERT set to true
I0209 23:52:41.764534 28007 openssl.cpp:478] Using CA file: /tmp/gZwTIW/cert.pem
I0209 23:52:41.764549 28007 openssl.cpp:481] Using CA dir: /tmp/gZwTIW
[       OK ] SSLVerifyIPAdd/SSLTest.BasicSameProcess/1 (287 ms)
[ RUN      ] SSLVerifyIPAdd/SSLTest.BasicSameProcessUnix/0
I0209 23:52:42.163573 28007 openssl.cpp:429] Will not verify peer certificate!
NOTE: Set LIBPROCESS_SSL_VERIFY_CERT=1 to enable peer certificate verification
I0209 23:52:42.163606 28007 openssl.cpp:435] Will only verify peer certificate if presented!
NOTE: Set LIBPROCESS_SSL_REQUIRE_CERT=1 to require peer certificate verification
[       OK ] SSLVerifyIPAdd/SSLTest.BasicSameProcessUnix/0 (393 ms)
[ RUN      ] SSLVerifyIPAdd/SSLTest.BasicSameProcessUnix/1
I0209 23:52:42.361490 28007 openssl.cpp:429] Will not verify peer certificate!
NOTE: Set LIBPROCESS_SSL_VERIFY_CERT=1 to enable peer certificate verification
I0209 23:52:42.361516 28007 openssl.cpp:435] Will only verify peer certificate if presented!
NOTE: Set LIBPROCESS_SSL_REQUIRE_CERT=1 to require peer certificate verification
I0209 23:52:42.361523 28007 openssl.cpp:441] Will use IP address verification in subject alternative
name certificate extension.
[       OK ] SSLVerifyIPAdd/SSLTest.BasicSameProcessUnix/1 (199 ms)
[ RUN      ] SSLVerifyIPAdd/SSLTest.RequireCertificate/0
I0209 23:52:42.755347 28007 openssl.cpp:424] CA directory path unspecified! NOTE: Set CA directory
path with LIBPROCESS_SSL_CA_DIR=<dirpath>
I0209 23:52:42.755373 28007 openssl.cpp:429] Will not verify peer certificate!
NOTE: Set LIBPROCESS_SSL_VERIFY_CERT=1 to enable peer certificate verification
I0209 23:52:42.755379 28007 openssl.cpp:449] LIBPROCESS_SSL_REQUIRE_CERT implies peer certificate
verification.
LIBPROCESS_SSL_VERIFY_CERT set to true
I0209 23:52:42.755481 28007 openssl.cpp:478] Using CA file: /tmp/znzysu/cert.pem
WARNING: Logging before InitGoogleLogging() is written to STDERR
I0209 23:52:42.766540 29573 openssl.cpp:424] CA directory path unspecified! NOTE: Set CA directory
path with LIBPROCESS_SSL_CA_DIR=<dirpath>
I0209 23:52:42.766640 29573 openssl.cpp:429] Will not verify peer certificate!
NOTE: Set LIBPROCESS_SSL_VERIFY_CERT=1 to enable peer certificate verification
I0209 23:52:42.766647 29573 openssl.cpp:449] LIBPROCESS_SSL_REQUIRE_CERT implies peer certificate
verification.
LIBPROCESS_SSL_VERIFY_CERT set to true
I0209 23:52:42.766801 29573 openssl.cpp:478] Using CA file: /tmp/znzysu/cert.pem
[       OK ] SSLVerifyIPAdd/SSLTest.RequireCertificate/0 (478 ms)
[ RUN      ] SSLVerifyIPAdd/SSLTest.RequireCertificate/1
I0209 23:52:43.127837 28007 openssl.cpp:424] CA directory path unspecified! NOTE: Set CA directory
path with LIBPROCESS_SSL_CA_DIR=<dirpath>
I0209 23:52:43.127861 28007 openssl.cpp:429] Will not verify peer certificate!
NOTE: Set LIBPROCESS_SSL_VERIFY_CERT=1 to enable peer certificate verification
I0209 23:52:43.127867 28007 openssl.cpp:441] Will use IP address verification in subject alternative
name certificate extension.
I0209 23:52:43.127871 28007 openssl.cpp:449] LIBPROCESS_SSL_REQUIRE_CERT implies peer certificate
verification.
LIBPROCESS_SSL_VERIFY_CERT set to true
I0209 23:52:43.127972 28007 openssl.cpp:478] Using CA file: /tmp/atYoEH/cert.pem
WARNING: Logging before InitGoogleLogging() is written to STDERR
I0209 23:52:43.144168 29591 openssl.cpp:424] CA directory path unspecified! NOTE: Set CA directory
path with LIBPROCESS_SSL_CA_DIR=<dirpath>
I0209 23:52:43.144361 29591 openssl.cpp:429] Will not verify peer certificate!
NOTE: Set LIBPROCESS_SSL_VERIFY_CERT=1 to enable peer certificate verification
I0209 23:52:43.144374 29591 openssl.cpp:441] Will use IP address verification in subject alternative
name certificate extension.
I0209 23:52:43.144407 29591 openssl.cpp:449] LIBPROCESS_SSL_REQUIRE_CERT implies peer certificate
verification.
LIBPROCESS_SSL_VERIFY_CERT set to true
I0209 23:52:43.144683 29591 openssl.cpp:478] Using CA file: /tmp/atYoEH/cert.pem
[       OK ] SSLVerifyIPAdd/SSLTest.RequireCertificate/1 (403 ms)
[----------] 6 tests from SSLVerifyIPAdd/SSLTest (2112 ms total)

[----------] Global test environment tear-down
[==========] 234 tests from 36 test cases ran. (24997 ms total)
[  PASSED  ] 233 tests.
[  FAILED  ] 1 test, listed below:
[  FAILED  ] FutureTest.After3

 1 FAILED TEST
  YOU HAVE 2 DISABLED TESTS

make[7]: *** [check-local] Error 1
make[7]: Leaving directory `/mesos/mesos-1.2.0/_build/3rdparty/libprocess'
make[6]: *** [check-am] Error 2
make[6]: Leaving directory `/mesos/mesos-1.2.0/_build/3rdparty/libprocess'
make[5]: *** [check-recursive] Error 1
make[5]: Leaving directory `/mesos/mesos-1.2.0/_build/3rdparty/libprocess'
make[4]: *** [check] Error 2
make[4]: Leaving directory `/mesos/mesos-1.2.0/_build/3rdparty/libprocess'
make[3]: *** [check-recursive] Error 1
make[3]: Leaving directory `/mesos/mesos-1.2.0/_build/3rdparty'
make[2]: *** [check] Error 2
make[2]: Leaving directory `/mesos/mesos-1.2.0/_build/3rdparty'
make[1]: *** [check-recursive] Error 1
make[1]: Leaving directory `/mesos/mesos-1.2.0/_build'
make: *** [distcheck] Error 1
+ docker rmi mesos-1486683243-13612
Untagged: mesos-1486683243-13612:latest
Deleted: sha256:a218a1825b77419cb427ef0ba6ba99cd390ea23fa0b0b819cb242820d241f860
Deleted: sha256:ffd785a2be1d366e6a32632b9e6bf9dc89e1249e72d79b5812905b6d27e09f1e
Deleted: sha256:80544ce05dc54790a2405ff577511445d4855edca011cfa60d050f517f285cf0
Deleted: sha256:ce1a8a7d3940a844a3d8e73881cde7f24d817de4a1b37eb4d38be2f5a8169f88
Deleted: sha256:af6d048a59262e8ecaa08e7382d97b17e82164ca1cef796fd21097bc2a04ee9c
Deleted: sha256:c8a585d1b07aa473b1c7a18e2a66e357d42d96a1a7e579473ddf86828f2ff136
Deleted: sha256:97968e82b681e5bb5d69d011d94019cc400af92896eba39bb93e7560cd9293b1
Deleted: sha256:f81498e909fd510da2a535bb7fcd0cefe25483fa35fa3fb549a61453a3133632
Deleted: sha256:7bbee7c7926c50720a84a9cd01993489d4cda78c3725cacc469f954eb680151b
Deleted: sha256:23b12e010403b600ccbff7ed3f96a3294d2706f624a283ef263a6c63f381c13a
Deleted: sha256:a683f9b2baa049acc36e33f39f8a73a763a3f60f63133cf1509fa4dc6e5f8c34
Deleted: sha256:b8cdd1efe658d2599622d21749393faf6db66aa4f3af1eedbe1905ffb7df8c5d
Deleted: sha256:dc01703c5bb492ee9fec3f37a9959afac93362784f7e69d1d1192e8881f097c2
Deleted: sha256:8cf992ebce442f71df66381a7387f8a5408230415367278a7717d1045fafa8b9
Deleted: sha256:c9eb76bae8fbe5cec706182385a94fc115ec0f11c3a9f27bc1876dd2e8040477
Deleted: sha256:89dfdaa43b1d4b2666cf7c1565f75eca89187534f62ec9ff3c97f11dd4fb7bb0
Deleted: sha256:1c4078267d2c76dfc12f8a07d3f80500a410ed0185566fe5a0eee0f844f8bd8a
Deleted: sha256:fd8a3f263c0d84ee1a17f2763c8070bd48e01dffbeed720a15ce1ea1b6649ef1
Deleted: sha256:eb65213c2e0c40f42790762051bd58a2003529fcb1d7390486618c7fc63ff869
Deleted: sha256:e3b4a70d2810b6475f591cc9ce12bff76aad138a175ddbec88adc9c0f3fa8708
Deleted: sha256:38694706f63abab63e0f583e908bf801ad24359868e8bea877263568cc8ed4df
Deleted: sha256:34d319baa36795dc552adf80b33f5904907a231d5188d5fcbd6c694d9cc6cc6f
Deleted: sha256:9ca5438f2b1f2618d4891012fdc5fe16bb9a21e5757f40a43c67e206ede0689b
Deleted: sha256:88240ace99a5fe95c1784b7ddbf5808e093e5e680bcf2247c9118dfe4c09f37b
Deleted: sha256:b180c9a6c5e217b219d99ebd637c2f2444a827f393004e341ed379120072eb07
Build step 'Execute shell' marked build as failure

Mime
View raw message