mesos-builds mailing list archives

Site index · List index
Message view « Date » · « Thread »
Top « Date » · « Thread »
From Apache Jenkins Server <jenk...@builds.apache.org>
Subject Build failed in Jenkins: Mesos-Buildbot » cmake,gcc,--verbose --enable-libevent --enable-ssl,GLOG_v=1 MESOS_VERBOSE=1,ubuntu:14.04,(docker||Hadoop)&&(!ubuntu-us1)&&(!ubuntu-eu2) #3223
Date Sun, 05 Feb 2017 01:01:55 GMT
See <https://builds.apache.org/job/Mesos-Buildbot/BUILDTOOL=cmake,COMPILER=gcc,CONFIGURATION=--verbose%20--enable-libevent%20--enable-ssl,ENVIRONMENT=GLOG_v=1%20MESOS_VERBOSE=1,OS=ubuntu%3A14.04,label_exp=(docker%7C%7CHadoop)&&(!ubuntu-us1)&&(!ubuntu-eu2)/3223/changes>

Changes:

[bmahler] Fixed a regression in the balloon framework test.

------------------------------------------
[...truncated 181440 lines...]
I0205 01:01:19.570075 27133 status_update_manager.cpp:177] Pausing sending status updates
I0205 01:01:19.570392 27136 state.cpp:60] Recovering state from '/tmp/Endpoint_SlaveEndpointTest_AuthorizedRequest_1_DQFo65/meta'
I0205 01:01:19.570638 27142 status_update_manager.cpp:203] Recovering status update manager
I0205 01:01:19.570719 27136 containerizer.cpp:599] Recovering containerizer
I0205 01:01:19.571393 27132 provisioner.cpp:410] Provisioner recovery complete
I0205 01:01:19.571610 27140 slave.cpp:5499] Finished recovery
I0205 01:01:19.572916 27140 slave.cpp:5673] Querying resource estimator for oversubscribable
resources
I0205 01:01:19.573149 27146 slave.cpp:5687] Received oversubscribable resources {} from the
resource estimator
I0205 01:01:19.573940 27137 process.cpp:3697] Handling HTTP event for process 'slave(690)'
with path: '/slave(690)/monitor/statistics.json'
I0205 01:01:19.574561 27141 http.cpp:871] Authorizing principal 'test-principal' to GET the
'/monitor/statistics.json' endpoint
I0205 01:01:19.576740 27136 slave.cpp:803] Agent terminating
[       OK ] Endpoint/SlaveEndpointTest.AuthorizedRequest/1 (15 ms)
[ RUN      ] Endpoint/SlaveEndpointTest.AuthorizedRequest/2
I0205 01:01:19.582484 27130 containerizer.cpp:220] Using isolation: posix/cpu,posix/mem,filesystem/posix,network/cni
W0205 01:01:19.582849 27130 backend.cpp:76] Failed to create 'aufs' backend: AufsBackend requires
root privileges
W0205 01:01:19.582891 27130 backend.cpp:76] Failed to create 'bind' backend: BindBackend requires
root privileges
I0205 01:01:19.582904 27130 provisioner.cpp:249] Using default backend 'copy'
I0205 01:01:19.584237 27132 slave.cpp:211] Mesos agent started on (691)@172.17.0.3:49813
I0205 01:01:19.584261 27132 slave.cpp:212] Flags at startup: --acls="" --appc_simple_discovery_uri_prefix="http://"
--appc_store_dir="/tmp/mesos/store/appc" --authenticate_http_readonly="true" --authenticate_http_readwrite="true"
--authenticatee="crammd5" --authentication_backoff_factor="1secs" --authorizer="local" --cgroups_cpu_enable_pids_and_tids_count="false"
--cgroups_enable_cfs="false" --cgroups_hierarchy="/sys/fs/cgroup" --cgroups_limit_swap="false"
--cgroups_root="mesos" --container_disk_watch_interval="15secs" --containerizers="mesos" --credential="/tmp/Endpoint_SlaveEndpointTest_AuthorizedRequest_2_rs8hae/credential"
--default_role="*" --disk_watch_interval="1mins" --docker="docker" --docker_kill_orphans="true"
--docker_registry="https://registry-1.docker.io" --docker_remove_delay="6hrs" --docker_socket="/var/run/docker.sock"
--docker_stop_timeout="0ns" --docker_store_dir="/tmp/mesos/store/docker" --docker_volume_checkpoint_dir="/var/run/mesos/isolators/docker/volume"
--enforce_container_disk_quota="false" --executor_registration_timeout="1mins" --executor_shutdown_grace_period="5secs"
--fetcher_cache_dir="/tmp/Endpoint_SlaveEndpointTest_AuthorizedRequest_2_rs8hae/fetch" --fetcher_cache_size="2GB"
--frameworks_home="" --gc_delay="1weeks" --gc_disk_headroom="0.1" --hadoop_home="" --help="false"
--hostname_lookup="true" --http_authenticators="basic" --http_command_executor="false" --http_credentials="/tmp/Endpoint_SlaveEndpointTest_AuthorizedRequest_2_rs8hae/http_credentials"
--http_heartbeat_interval="30secs" --initialize_driver_logging="true" --isolation="posix/cpu,posix/mem"
--launcher="posix" --launcher_dir="/mesos/build/src" --logbufsecs="0" --logging_level="INFO"
--max_completed_executors_per_framework="150" --oversubscribed_resources_interval="15secs"
--perf_duration="10secs" --perf_interval="1mins" --qos_correction_interval_min="0ns" --quiet="false"
--recover="reconnect" --recovery_timeout="15mins" --registration_backoff_factor="10ms" --resources="cpus:2;gpus:0;mem:1024;disk:1024;ports:[31000-32000]"
--revocable_cpu_low_priority="true" --runtime_dir="/tmp/Endpoint_SlaveEndpointTest_AuthorizedRequest_2_rs8hae"
--sandbox_directory="/mnt/mesos/sandbox" --strict="true" --switch_user="true" --systemd_enable_support="true"
--systemd_runtime_directory="/run/systemd/system" --version="false" --work_dir="/tmp/Endpoint_SlaveEndpointTest_AuthorizedRequest_2_njKE8Z"
I0205 01:01:19.584861 27132 credentials.hpp:86] Loading credential for authentication from
'/tmp/Endpoint_SlaveEndpointTest_AuthorizedRequest_2_rs8hae/credential'
I0205 01:01:19.584988 27132 slave.cpp:354] Agent using credential for: test-principal
I0205 01:01:19.585008 27132 credentials.hpp:37] Loading credentials for authentication from
'/tmp/Endpoint_SlaveEndpointTest_AuthorizedRequest_2_rs8hae/http_credentials'
I0205 01:01:19.585124 27132 http.cpp:919] Using default 'basic' HTTP authenticator for realm
'mesos-agent-readonly'
I0205 01:01:19.585180 27132 http.cpp:919] Using default 'basic' HTTP authenticator for realm
'mesos-agent-readwrite'
I0205 01:01:19.585639 27132 slave.cpp:541] Agent resources: cpus(*):2; mem(*):1024; disk(*):1024;
ports(*):[31000-32000]
I0205 01:01:19.585682 27132 slave.cpp:549] Agent attributes: [  ]
I0205 01:01:19.585690 27132 slave.cpp:554] Agent hostname: 74dc334d1e86
I0205 01:01:19.585886 27139 status_update_manager.cpp:177] Pausing sending status updates
I0205 01:01:19.586285 27134 state.cpp:60] Recovering state from '/tmp/Endpoint_SlaveEndpointTest_AuthorizedRequest_2_njKE8Z/meta'
I0205 01:01:19.586508 27146 status_update_manager.cpp:203] Recovering status update manager
I0205 01:01:19.586679 27145 containerizer.cpp:599] Recovering containerizer
I0205 01:01:19.587240 27145 provisioner.cpp:410] Provisioner recovery complete
I0205 01:01:19.587438 27143 slave.cpp:5499] Finished recovery
I0205 01:01:19.587851 27143 slave.cpp:5673] Querying resource estimator for oversubscribable
resources
I0205 01:01:19.587972 27131 slave.cpp:5687] Received oversubscribable resources {} from the
resource estimator
I0205 01:01:19.588816 27140 process.cpp:3697] Handling HTTP event for process 'slave(691)'
with path: '/slave(691)/containers'
I0205 01:01:19.589345 27137 http.cpp:871] Authorizing principal 'test-principal' to GET the
'/containers' endpoint
I0205 01:01:19.590721 27143 slave.cpp:803] Agent terminating
[       OK ] Endpoint/SlaveEndpointTest.AuthorizedRequest/2 (13 ms)
[ RUN      ] Endpoint/SlaveEndpointTest.UnauthorizedRequest/0
I0205 01:01:19.596163 27130 containerizer.cpp:220] Using isolation: posix/cpu,posix/mem,filesystem/posix,network/cni
W0205 01:01:19.596491 27130 backend.cpp:76] Failed to create 'aufs' backend: AufsBackend requires
root privileges
W0205 01:01:19.596540 27130 backend.cpp:76] Failed to create 'bind' backend: BindBackend requires
root privileges
I0205 01:01:19.596604 27130 provisioner.cpp:249] Using default backend 'copy'
I0205 01:01:19.597723 27146 slave.cpp:211] Mesos agent started on (692)@172.17.0.3:49813
I0205 01:01:19.597780 27146 slave.cpp:212] Flags at startup: --acls="" --appc_simple_discovery_uri_prefix="http://"
--appc_store_dir="/tmp/mesos/store/appc" --authenticate_http_readonly="true" --authenticate_http_readwrite="true"
--authenticatee="crammd5" --authentication_backoff_factor="1secs" --authorizer="local" --cgroups_cpu_enable_pids_and_tids_count="false"
--cgroups_enable_cfs="false" --cgroups_hierarchy="/sys/fs/cgroup" --cgroups_limit_swap="false"
--cgroups_root="mesos" --container_disk_watch_interval="15secs" --containerizers="mesos" --credential="/tmp/Endpoint_SlaveEndpointTest_UnauthorizedRequest_0_27zoo8/credential"
--default_role="*" --disk_watch_interval="1mins" --docker="docker" --docker_kill_orphans="true"
--docker_registry="https://registry-1.docker.io" --docker_remove_delay="6hrs" --docker_socket="/var/run/docker.sock"
--docker_stop_timeout="0ns" --docker_store_dir="/tmp/mesos/store/docker" --docker_volume_checkpoint_dir="/var/run/mesos/isolators/docker/volume"
--enforce_container_disk_quota="false" --executor_registration_timeout="1mins" --executor_shutdown_grace_period="5secs"
--fetcher_cache_dir="/tmp/Endpoint_SlaveEndpointTest_UnauthorizedRequest_0_27zoo8/fetch" --fetcher_cache_size="2GB"
--frameworks_home="" --gc_delay="1weeks" --gc_disk_headroom="0.1" --hadoop_home="" --help="false"
--hostname_lookup="true" --http_authenticators="basic" --http_command_executor="false" --http_credentials="/tmp/Endpoint_SlaveEndpointTest_UnauthorizedRequest_0_27zoo8/http_credentials"
--http_heartbeat_interval="30secs" --initialize_driver_logging="true" --isolation="posix/cpu,posix/mem"
--launcher="posix" --launcher_dir="/mesos/build/src" --logbufsecs="0" --logging_level="INFO"
--max_completed_executors_per_framework="150" --oversubscribed_resources_interval="15secs"
--perf_duration="10secs" --perf_interval="1mins" --qos_correction_interval_min="0ns" --quiet="false"
--recover="reconnect" --recovery_timeout="15mins" --registration_backoff_factor="10ms" --resources="cpus:2;gpus:0;mem:1024;disk:1024;ports:[31000-32000]"
--revocable_cpu_low_priority="true" --runtime_dir="/tmp/Endpoint_SlaveEndpointTest_UnauthorizedRequest_0_27zoo8"
--sandbox_directory="/mnt/mesos/sandbox" --strict="true" --switch_user="true" --systemd_enable_support="true"
--systemd_runtime_directory="/run/systemd/system" --version="false" --work_dir="/tmp/Endpoint_SlaveEndpointTest_UnauthorizedRequest_0_M7exkU"
I0205 01:01:19.598176 27146 credentials.hpp:86] Loading credential for authentication from
'/tmp/Endpoint_SlaveEndpointTest_UnauthorizedRequest_0_27zoo8/credential'
I0205 01:01:19.598268 27146 slave.cpp:354] Agent using credential for: test-principal
I0205 01:01:19.598285 27146 credentials.hpp:37] Loading credentials for authentication from
'/tmp/Endpoint_SlaveEndpointTest_UnauthorizedRequest_0_27zoo8/http_credentials'
I0205 01:01:19.598398 27146 http.cpp:919] Using default 'basic' HTTP authenticator for realm
'mesos-agent-readonly'
I0205 01:01:19.598448 27146 http.cpp:919] Using default 'basic' HTTP authenticator for realm
'mesos-agent-readwrite'
I0205 01:01:19.598965 27146 slave.cpp:541] Agent resources: cpus(*):2; mem(*):1024; disk(*):1024;
ports(*):[31000-32000]
I0205 01:01:19.599009 27146 slave.cpp:549] Agent attributes: [  ]
I0205 01:01:19.599019 27146 slave.cpp:554] Agent hostname: 74dc334d1e86
I0205 01:01:19.599090 27131 status_update_manager.cpp:177] Pausing sending status updates
I0205 01:01:19.599514 27133 state.cpp:60] Recovering state from '/tmp/Endpoint_SlaveEndpointTest_UnauthorizedRequest_0_M7exkU/meta'
I0205 01:01:19.599647 27133 status_update_manager.cpp:203] Recovering status update manager
I0205 01:01:19.599786 27132 containerizer.cpp:599] Recovering containerizer
I0205 01:01:19.600594 27132 provisioner.cpp:410] Provisioner recovery complete
I0205 01:01:19.600796 27131 slave.cpp:5499] Finished recovery
I0205 01:01:19.601205 27131 slave.cpp:5673] Querying resource estimator for oversubscribable
resources
I0205 01:01:19.601327 27143 slave.cpp:5687] Received oversubscribable resources {} from the
resource estimator
I0205 01:01:19.602025 27134 process.cpp:3697] Handling HTTP event for process 'slave(692)'
with path: '/slave(692)/monitor/statistics'
I0205 01:01:19.602674 27132 http.cpp:871] Authorizing principal 'test-principal' to GET the
'/monitor/statistics' endpoint
I0205 01:01:19.603644 27135 slave.cpp:803] Agent terminating
[       OK ] Endpoint/SlaveEndpointTest.UnauthorizedRequest/0 (13 ms)
[ RUN      ] Endpoint/SlaveEndpointTest.UnauthorizedRequest/1
I0205 01:01:19.608480 27130 containerizer.cpp:220] Using isolation: posix/cpu,posix/mem,filesystem/posix,network/cni
W0205 01:01:19.608849 27130 backend.cpp:76] Failed to create 'aufs' backend: AufsBackend requires
root privileges
W0205 01:01:19.608881 27130 backend.cpp:76] Failed to create 'bind' backend: BindBackend requires
root privileges
I0205 01:01:19.608891 27130 provisioner.cpp:249] Using default backend 'copy'
I0205 01:01:19.609899 27142 slave.cpp:211] Mesos agent started on (693)@172.17.0.3:49813
I0205 01:01:19.609915 27142 slave.cpp:212] Flags at startup: --acls="" --appc_simple_discovery_uri_prefix="http://"
--appc_store_dir="/tmp/mesos/store/appc" --authenticate_http_readonly="true" --authenticate_http_readwrite="true"
--authenticatee="crammd5" --authentication_backoff_factor="1secs" --authorizer="local" --cgroups_cpu_enable_pids_and_tids_count="false"
--cgroups_enable_cfs="false" --cgroups_hierarchy="/sys/fs/cgroup" --cgroups_limit_swap="false"
--cgroups_root="mesos" --container_disk_watch_interval="15secs" --containerizers="mesos" --credential="/tmp/Endpoint_SlaveEndpointTest_UnauthorizedRequest_1_GxQSK2/credential"
--default_role="*" --disk_watch_interval="1mins" --docker="docker" --docker_kill_orphans="true"
--docker_registry="https://registry-1.docker.io" --docker_remove_delay="6hrs" --docker_socket="/var/run/docker.sock"
--docker_stop_timeout="0ns" --docker_store_dir="/tmp/mesos/store/docker" --docker_volume_checkpoint_dir="/var/run/mesos/isolators/docker/volume"
--enforce_container_disk_quota="false" --executor_registration_timeout="1mins" --executor_shutdown_grace_period="5secs"
--fetcher_cache_dir="/tmp/Endpoint_SlaveEndpointTest_UnauthorizedRequest_1_GxQSK2/fetch" --fetcher_cache_size="2GB"
--frameworks_home="" --gc_delay="1weeks" --gc_disk_headroom="0.1" --hadoop_home="" --help="false"
--hostname_lookup="true" --http_authenticators="basic" --http_command_executor="false" --http_credentials="/tmp/Endpoint_SlaveEndpointTest_UnauthorizedRequest_1_GxQSK2/http_credentials"
--http_heartbeat_interval="30secs" --initialize_driver_logging="true" --isolation="posix/cpu,posix/mem"
--launcher="posix" --launcher_dir="/mesos/build/src" --logbufsecs="0" --logging_level="INFO"
--max_completed_executors_per_framework="150" --oversubscribed_resources_interval="15secs"
--perf_duration="10secs" --perf_interval="1mins" --qos_correction_interval_min="0ns" --quiet="false"
--recover="reconnect" --recovery_timeout="15mins" --registration_backoff_factor="10ms" --resources="cpus:2;gpus:0;mem:1024;disk:1024;ports:[31000-32000]"
--revocable_cpu_low_priority="true" --runtime_dir="/tmp/Endpoint_SlaveEndpointTest_UnauthorizedRequest_1_GxQSK2"
--sandbox_directory="/mnt/mesos/sandbox" --strict="true" --switch_user="true" --systemd_enable_support="true"
--systemd_runtime_directory="/run/systemd/system" --version="false" --work_dir="/tmp/Endpoint_SlaveEndpointTest_UnauthorizedRequest_1_OeRXEO"
I0205 01:01:19.610333 27142 credentials.hpp:86] Loading credential for authentication from
'/tmp/Endpoint_SlaveEndpointTest_UnauthorizedRequest_1_GxQSK2/credential'
I0205 01:01:19.610448 27142 slave.cpp:354] Agent using credential for: test-principal
I0205 01:01:19.610467 27142 credentials.hpp:37] Loading credentials for authentication from
'/tmp/Endpoint_SlaveEndpointTest_UnauthorizedRequest_1_GxQSK2/http_credentials'
I0205 01:01:19.610584 27142 http.cpp:919] Using default 'basic' HTTP authenticator for realm
'mesos-agent-readonly'
I0205 01:01:19.610642 27142 http.cpp:919] Using default 'basic' HTTP authenticator for realm
'mesos-agent-readwrite'
I0205 01:01:19.611057 27142 slave.cpp:541] Agent resources: cpus(*):2; mem(*):1024; disk(*):1024;
ports(*):[31000-32000]
I0205 01:01:19.611091 27142 slave.cpp:549] Agent attributes: [  ]
I0205 01:01:19.611100 27142 slave.cpp:554] Agent hostname: 74dc334d1e86
I0205 01:01:19.611205 27136 status_update_manager.cpp:177] Pausing sending status updates
I0205 01:01:19.611460 27142 state.cpp:60] Recovering state from '/tmp/Endpoint_SlaveEndpointTest_UnauthorizedRequest_1_OeRXEO/meta'
I0205 01:01:19.611726 27133 status_update_manager.cpp:203] Recovering status update manager
I0205 01:01:19.612071 27131 containerizer.cpp:599] Recovering containerizer
I0205 01:01:19.612720 27135 provisioner.cpp:410] Provisioner recovery complete
I0205 01:01:19.612984 27132 slave.cpp:5499] Finished recovery
I0205 01:01:19.613438 27132 slave.cpp:5673] Querying resource estimator for oversubscribable
resources
I0205 01:01:19.613559 27145 slave.cpp:5687] Received oversubscribable resources {} from the
resource estimator
I0205 01:01:19.614305 27144 process.cpp:3697] Handling HTTP event for process 'slave(693)'
with path: '/slave(693)/monitor/statistics.json'
I0205 01:01:19.614807 27145 http.cpp:871] Authorizing principal 'test-principal' to GET the
'/monitor/statistics.json' endpoint
I0205 01:01:19.616320 27132 slave.cpp:803] Agent terminating
[       OK ] Endpoint/SlaveEndpointTest.UnauthorizedRequest/1 (13 ms)
[ RUN      ] Endpoint/SlaveEndpointTest.UnauthorizedRequest/2
I0205 01:01:19.622270 27130 containerizer.cpp:220] Using isolation: posix/cpu,posix/mem,filesystem/posix,network/cni
W0205 01:01:19.622618 27130 backend.cpp:76] Failed to create 'aufs' backend: AufsBackend requires
root privileges
W0205 01:01:19.622661 27130 backend.cpp:76] Failed to create 'bind' backend: BindBackend requires
root privileges
I0205 01:01:19.622676 27130 provisioner.cpp:249] Using default backend 'copy'
I0205 01:01:19.623859 27138 slave.cpp:211] Mesos agent started on (694)@172.17.0.3:49813
I0205 01:01:19.623881 27138 slave.cpp:212] Flags at startup: --acls="" --appc_simple_discovery_uri_prefix="http://"
--appc_store_dir="/tmp/mesos/store/appc" --authenticate_http_readonly="true" --authenticate_http_readwrite="true"
--authenticatee="crammd5" --authentication_backoff_factor="1secs" --authorizer="local" --cgroups_cpu_enable_pids_and_tids_count="false"
--cgroups_enable_cfs="false" --cgroups_hierarchy="/sys/fs/cgroup" --cgroups_limit_swap="false"
--cgroups_root="mesos" --container_disk_watch_interval="15secs" --containerizers="mesos" --credential="/tmp/Endpoint_SlaveEndpointTest_UnauthorizedRequest_2_EhhRfX/credential"
--default_role="*" --disk_watch_interval="1mins" --docker="docker" --docker_kill_orphans="true"
--docker_registry="https://registry-1.docker.io" --docker_remove_delay="6hrs" --docker_socket="/var/run/docker.sock"
--docker_stop_timeout="0ns" --docker_store_dir="/tmp/mesos/store/docker" --docker_volume_checkpoint_dir="/var/run/mesos/isolators/docker/volume"
--enforce_container_disk_quota="false" --executor_registration_timeout="1mins" --executor_shutdown_grace_period="5secs"
--fetcher_cache_dir="/tmp/Endpoint_SlaveEndpointTest_UnauthorizedRequest_2_EhhRfX/fetch" --fetcher_cache_size="2GB"
--frameworks_home="" --gc_delay="1weeks" --gc_disk_headroom="0.1" --hadoop_home="" --help="false"
--hostname_lookup="true" --http_authenticators="basic" --http_command_executor="false" --http_credentials="/tmp/Endpoint_SlaveEndpointTest_UnauthorizedRequest_2_EhhRfX/http_credentials"
--http_heartbeat_interval="30secs" --initialize_driver_logging="true" --isolation="posix/cpu,posix/mem"
--launcher="posix" --launcher_dir="/mesos/build/src" --logbufsecs="0" --logging_level="INFO"
--max_completed_executors_per_framework="150" --oversubscribed_resources_interval="15secs"
--perf_duration="10secs" --perf_interval="1mins" --qos_correction_interval_min="0ns" --quiet="false"
--recover="reconnect" --recovery_timeout="15mins" --registration_backoff_factor="10ms" --resources="cpus:2;gpus:0;mem:1024;disk:1024;ports:[31000-32000]"
--revocable_cpu_low_priority="true" --runtime_dir="/tmp/Endpoint_SlaveEndpointTest_UnauthorizedRequest_2_EhhRfX"
--sandbox_directory="/mnt/mesos/sandbox" --strict="true" --switch_user="true" --systemd_enable_support="true"
--systemd_runtime_directory="/run/systemd/system" --version="false" --work_dir="/tmp/Endpoint_SlaveEndpointTest_UnauthorizedRequest_2_0FWK7I"
I0205 01:01:19.624277 27138 credentials.hpp:86] Loading credential for authentication from
'/tmp/Endpoint_SlaveEndpointTest_UnauthorizedRequest_2_EhhRfX/credential'
I0205 01:01:19.624368 27138 slave.cpp:354] Agent using credential for: test-principal
I0205 01:01:19.624384 27138 credentials.hpp:37] Loading credentials for authentication from
'/tmp/Endpoint_SlaveEndpointTest_UnauthorizedRequest_2_EhhRfX/http_credentials'
I0205 01:01:19.624490 27138 http.cpp:919] Using default 'basic' HTTP authenticator for realm
'mesos-agent-readonly'
I0205 01:01:19.624567 27138 http.cpp:919] Using default 'basic' HTTP authenticator for realm
'mesos-agent-readwrite'
I0205 01:01:19.625208 27138 slave.cpp:541] Agent resources: cpus(*):2; mem(*):1024; disk(*):1024;
ports(*):[31000-32000]
I0205 01:01:19.625254 27138 slave.cpp:549] Agent attributes: [  ]
I0205 01:01:19.625262 27138 slave.cpp:554] Agent hostname: 74dc334d1e86
I0205 01:01:19.625334 27143 status_update_manager.cpp:177] Pausing sending status updates
I0205 01:01:19.625661 27143 state.cpp:60] Recovering state from '/tmp/Endpoint_SlaveEndpointTest_UnauthorizedRequest_2_0FWK7I/meta'
I0205 01:01:19.626020 27144 status_update_manager.cpp:203] Recovering status update manager
I0205 01:01:19.626155 27141 containerizer.cpp:599] Recovering containerizer
I0205 01:01:19.626773 27135 provisioner.cpp:410] Provisioner recovery complete
I0205 01:01:19.626961 27137 slave.cpp:5499] Finished recovery
I0205 01:01:19.627359 27137 slave.cpp:5673] Querying resource estimator for oversubscribable
resources
I0205 01:01:19.627495 27141 slave.cpp:5687] Received oversubscribable resources {} from the
resource estimator
I0205 01:01:19.628316 27139 process.cpp:3697] Handling HTTP event for process 'slave(694)'
with path: '/slave(694)/containers'
I0205 01:01:19.628867 27139 http.cpp:871] Authorizing principal 'test-principal' to GET the
'/containers' endpoint
I0205 01:01:19.629928 27142 slave.cpp:803] Agent terminating
[       OK ] Endpoint/SlaveEndpointTest.UnauthorizedRequest/2 (13 ms)
[ RUN      ] Endpoint/SlaveEndpointTest.NoAuthorizer/0
I0205 01:01:19.635797 27130 containerizer.cpp:220] Using isolation: posix/cpu,posix/mem,filesystem/posix,network/cni
W0205 01:01:19.636131 27130 backend.cpp:76] Failed to create 'aufs' backend: AufsBackend requires
root privileges
W0205 01:01:19.636174 27130 backend.cpp:76] Failed to create 'bind' backend: BindBackend requires
root privileges
I0205 01:01:19.636188 27130 provisioner.cpp:249] Using default backend 'copy'
I0205 01:01:19.636932 27130 cluster.cpp:446] Creating default 'local' authorizer
I0205 01:01:19.637637 27131 slave.cpp:211] Mesos agent started on (695)@172.17.0.3:49813
I0205 01:01:19.637657 27131 slave.cpp:212] Flags at startup: --acls="" --appc_simple_discovery_uri_prefix="http://"
--appc_store_dir="/tmp/mesos/store/appc" --authenticate_http_readonly="true" --authenticate_http_readwrite="true"
--authenticatee="crammd5" --authentication_backoff_factor="1secs" --authorizer="local" --cgroups_cpu_enable_pids_and_tids_count="false"
--cgroups_enable_cfs="false" --cgroups_hierarchy="/sys/fs/cgroup" --cgroups_limit_swap="false"
--cgroups_root="mesos" --container_disk_watch_interval="15secs" --containerizers="mesos" --credential="/tmp/Endpoint_SlaveEndpointTest_NoAuthorizer_0_aRPBTR/credential"
--default_role="*" --disk_watch_interval="1mins" --docker="docker" --docker_kill_orphans="true"
--docker_registry="https://registry-1.docker.io" --docker_remove_delay="6hrs" --docker_socket="/var/run/docker.sock"
--docker_stop_timeout="0ns" --docker_store_dir="/tmp/mesos/store/docker" --docker_volume_checkpoint_dir="/var/run/mesos/isolators/docker/volume"
--enforce_container_disk_quota="false" --executor_registration_timeout="1mins" --executor_shutdown_grace_period="5secs"
--fetcher_cache_dir="/tmp/Endpoint_SlaveEndpointTest_NoAuthorizer_0_aRPBTR/fetch" --fetcher_cache_size="2GB"
--frameworks_home="" --gc_delay="1weeks" --gc_disk_headroom="0.1" --hadoop_home="" --help="false"
--hostname_lookup="true" --http_authenticators="basic" --http_command_executor="false" --http_credentials="/tmp/Endpoint_SlaveEndpointTest_NoAuthorizer_0_aRPBTR/http_credentials"
--http_heartbeat_interval="30secs" --initialize_driver_logging="true" --isolation="posix/cpu,posix/mem"
--launcher="posix" --launcher_dir="/mesos/build/src" --logbufsecs="0" --logging_level="INFO"
--max_completed_executors_per_framework="150" --oversubscribed_resources_interval="15secs"
--perf_duration="10secs" --perf_interval="1mins" --qos_correction_interval_min="0ns" --quiet="false"
--recover="reconnect" --recovery_timeout="15mins" --registration_backoff_factor="10ms" --resources="cpus:2;gpus:0;mem:1024;disk:1024;ports:[31000-32000]"
--revocable_cpu_low_priority="true" --runtime_dir="/tmp/Endpoint_SlaveEndpointTest_NoAuthorizer_0_aRPBTR"
--sandbox_directory="/mnt/mesos/sandbox" --strict="true" --switch_user="true" --systemd_enable_support="true"
--systemd_runtime_directory="/run/systemd/system" --version="false" --work_dir="/tmp/Endpoint_SlaveEndpointTest_NoAuthorizer_0_WNmlJD"
I0205 01:01:19.638111 27131 credentials.hpp:86] Loading credential for authentication from
'/tmp/Endpoint_SlaveEndpointTest_NoAuthorizer_0_aRPBTR/credential'
I0205 01:01:19.638207 27131 slave.cpp:354] Agent using credential for: test-principal
I0205 01:01:19.638223 27131 credentials.hpp:37] Loading credentials for authentication from
'/tmp/Endpoint_SlaveEndpointTest_NoAuthorizer_0_aRPBTR/http_credentials'
I0205 01:01:19.638334 27131 http.cpp:919] Using default 'basic' HTTP authenticator for realm
'mesos-agent-readonly'
I0205 01:01:19.638391 27131 http.cpp:919] Using default 'basic' HTTP authenticator for realm
'mesos-agent-readwrite'
I0205 01:01:19.638898 27131 slave.cpp:541] Agent resources: cpus(*):2; mem(*):1024; disk(*):1024;
ports(*):[31000-32000]
I0205 01:01:19.638942 27131 slave.cpp:549] Agent attributes: [  ]
I0205 01:01:19.638952 27131 slave.cpp:554] Agent hostname: 74dc334d1e86
I0205 01:01:19.639044 27141 status_update_manager.cpp:177] Pausing sending status updates
I0205 01:01:19.639333 27139 state.cpp:60] Recovering state from '/tmp/Endpoint_SlaveEndpointTest_NoAuthorizer_0_WNmlJD/meta'
I0205 01:01:19.639652 27133 status_update_manager.cpp:203] Recovering status update manager
I0205 01:01:19.639726 27133 containerizer.cpp:599] Recovering containerizer
I0205 01:01:19.640398 27145 provisioner.cpp:410] Provisioner recovery complete
I0205 01:01:19.640691 27131 slave.cpp:5499] Finished recovery
I0205 01:01:19.641170 27131 slave.cpp:5673] Querying resource estimator for oversubscribable
resources
I0205 01:01:19.641434 27135 slave.cpp:5687] Received oversubscribable resources {} from the
resource estimator
I0205 01:01:19.642143 27143 process.cpp:3697] Handling HTTP event for process 'slave(695)'
with path: '/slave(695)/monitor/statistics'
I0205 01:01:19.642599 27141 http.cpp:871] Authorizing principal 'test-principal' to GET the
'/monitor/statistics' endpoint
I0205 01:01:19.644855 27130 slave.cpp:803] Agent terminating
[       OK ] Endpoint/SlaveEndpointTest.NoAuthorizer/0 (15 ms)
[ RUN      ] Endpoint/SlaveEndpointTest.NoAuthorizer/1
I0205 01:01:19.651252 27130 containerizer.cpp:220] Using isolation: posix/cpu,posix/mem,filesystem/posix,network/cni
W0205 01:01:19.651669 27130 backend.cpp:76] Failed to create 'aufs' backend: AufsBackend requires
root privileges
W0205 01:01:19.651727 27130 backend.cpp:76] Failed to create 'bind' backend: BindBackend requires
root privileges
I0205 01:01:19.651751 27130 provisioner.cpp:249] Using default backend 'copy'
I0205 01:01:19.652639 27130 cluster.cpp:446] Creating default 'local' authorizer
I0205 01:01:19.653394 27138 slave.cpp:211] Mesos agent started on (696)@172.17.0.3:49813
I0205 01:01:19.653417 27138 slave.cpp:212] Flags at startup: --acls="" --appc_simple_discovery_uri_prefix="http://"
--appc_store_dir="/tmp/mesos/store/appc" --authenticate_http_readonly="true" --authenticate_http_readwrite="true"
--authenticatee="crammd5" --authentication_backoff_factor="1secs" --authorizer="local" --cgroups_cpu_enable_pids_and_tids_count="false"
--cgroups_enable_cfs="false" --cgroups_hierarchy="/sys/fs/cgroup" --cgroups_limit_swap="false"
--cgroups_root="mesos" --container_disk_watch_interval="15secs" --containerizers="mesos" --credential="/tmp/Endpoint_SlaveEndpointTest_NoAuthorizer_1_CmE6GM/credential"
--default_role="*" --disk_watch_interval="1mins" --docker="docker" --docker_kill_orphans="true"
--docker_registry="https://registry-1.docker.io" --docker_remove_delay="6hrs" --docker_socket="/var/run/docker.sock"
--docker_stop_timeout="0ns" --docker_store_dir="/tmp/mesos/store/docker" --docker_volume_checkpoint_dir="/var/run/mesos/isolators/docker/volume"
--enforce_container_disk_quota="false" --executor_registration_timeout="1mins" --executor_shutdown_grace_period="5secs"
--fetcher_cache_dir="/tmp/Endpoint_SlaveEndpointTest_NoAuthorizer_1_CmE6GM/fetch" --fetcher_cache_size="2GB"
--frameworks_home="" --gc_delay="1weeks" --gc_disk_headroom="0.1" --hadoop_home="" --help="false"
--hostname_lookup="true" --http_authenticators="basic" --http_command_executor="false" --http_credentials="/tmp/Endpoint_SlaveEndpointTest_NoAuthorizer_1_CmE6GM/http_credentials"
--http_heartbeat_interval="30secs" --initialize_driver_logging="true" --isolation="posix/cpu,posix/mem"
--launcher="posix" --launcher_dir="/mesos/build/src" --logbufsecs="0" --logging_level="INFO"
--max_completed_executors_per_framework="150" --oversubscribed_resources_interval="15secs"
--perf_duration="10secs" --perf_interval="1mins" --qos_correction_interval_min="0ns" --quiet="false"
--recover="reconnect" --recovery_timeout="15mins" --registration_backoff_factor="10ms" --resources="cpus:2;gpus:0;mem:1024;disk:1024;ports:[31000-32000]"
--revocable_cpu_low_priority="true" --runtime_dir="/tmp/Endpoint_SlaveEndpointTest_NoAuthorizer_1_CmE6GM"
--sandbox_directory="/mnt/mesos/sandbox" --strict="true" --switch_user="true" --systemd_enable_support="true"
--systemd_runtime_directory="/run/systemd/system" --version="false" --work_dir="/tmp/Endpoint_SlaveEndpointTest_NoAuthorizer_1_a1Gkuy"
I0205 01:01:19.653830 27138 credentials.hpp:86] Loading credential for authentication from
'/tmp/Endpoint_SlaveEndpointTest_NoAuthorizer_1_CmE6GM/credential'
I0205 01:01:19.653928 27138 slave.cpp:354] Agent using credential for: test-principal
I0205 01:01:19.653944 27138 credentials.hpp:37] Loading credentials for authentication from
'/tmp/Endpoint_SlaveEndpointTest_NoAuthorizer_1_CmE6GM/http_credentials'
I0205 01:01:19.654055 27138 http.cpp:919] Using default 'basic' HTTP authenticator for realm
'mesos-agent-readonly'
I0205 01:01:19.654108 27138 http.cpp:919] Using default 'basic' HTTP authenticator for realm
'mesos-agent-readwrite'
I0205 01:01:19.654600 27138 slave.cpp:541] Agent resources: cpus(*):2; mem(*):1024; disk(*):1024;
ports(*):[31000-32000]
I0205 01:01:19.654644 27138 slave.cpp:549] Agent attributes: [  ]
I0205 01:01:19.654652 27138 slave.cpp:554] Agent hostname: 74dc334d1e86
I0205 01:01:19.654747 27140 status_update_manager.cpp:177] Pausing sending status updates
I0205 01:01:19.655072 27141 state.cpp:60] Recovering state from '/tmp/Endpoint_SlaveEndpointTest_NoAuthorizer_1_a1Gkuy/meta'
I0205 01:01:19.655331 27137 status_update_manager.cpp:203] Recovering status update manager
I0205 01:01:19.655612 27144 containerizer.cpp:599] Recovering containerizer
I0205 01:01:19.656404 27138 provisioner.cpp:410] Provisioner recovery complete
I0205 01:01:19.656760 27135 slave.cpp:5499] Finished recovery
I0205 01:01:19.657212 27135 slave.cpp:5673] Querying resource estimator for oversubscribable
resources
I0205 01:01:19.657344 27142 slave.cpp:5687] Received oversubscribable resources {} from the
resource estimator
I0205 01:01:19.658149 27131 process.cpp:3697] Handling HTTP event for process 'slave(696)'
with path: '/slave(696)/monitor/statistics.json'
I0205 01:01:19.658833 27144 http.cpp:871] Authorizing principal 'test-principal' to GET the
'/monitor/statistics.json' endpoint
I0205 01:01:19.661263 27132 slave.cpp:803] Agent terminating
[       OK ] Endpoint/SlaveEndpointTest.NoAuthorizer/1 (16 ms)
[ RUN      ] Endpoint/SlaveEndpointTest.NoAuthorizer/2
I0205 01:01:19.667424 27130 containerizer.cpp:220] Using isolation: posix/cpu,posix/mem,filesystem/posix,network/cni
W0205 01:01:19.667791 27130 backend.cpp:76] Failed to create 'aufs' backend: AufsBackend requires
root privileges
W0205 01:01:19.667834 27130 backend.cpp:76] Failed to create 'bind' backend: BindBackend requires
root privileges
I0205 01:01:19.667850 27130 provisioner.cpp:249] Using default backend 'copy'
I0205 01:01:19.668784 27130 cluster.cpp:446] Creating default 'local' authorizer
I0205 01:01:19.669312 27131 slave.cpp:211] Mesos agent started on (697)@172.17.0.3:49813
I0205 01:01:19.669335 27131 slave.cpp:212] Flags at startup: --acls="" --appc_simple_discovery_uri_prefix="http://"
--appc_store_dir="/tmp/mesos/store/appc" --authenticate_http_readonly="true" --authenticate_http_readwrite="true"
--authenticatee="crammd5" --authentication_backoff_factor="1secs" --authorizer="local" --cgroups_cpu_enable_pids_and_tids_count="false"
--cgroups_enable_cfs="false" --cgroups_hierarchy="/sys/fs/cgroup" --cgroups_limit_swap="false"
--cgroups_root="mesos" --container_disk_watch_interval="15secs" --containerizers="mesos" --credential="/tmp/Endpoint_SlaveEndpointTest_NoAuthorizer_2_gjw8EH/credential"
--default_role="*" --disk_watch_interval="1mins" --docker="docker" --docker_kill_orphans="true"
--docker_registry="https://registry-1.docker.io" --docker_remove_delay="6hrs" --docker_socket="/var/run/docker.sock"
--docker_stop_timeout="0ns" --docker_store_dir="/tmp/mesos/store/docker" --docker_volume_checkpoint_dir="/var/run/mesos/isolators/docker/volume"
--enforce_container_disk_quota="false" --executor_registration_timeout="1mins" --executor_shutdown_grace_period="5secs"
--fetcher_cache_dir="/tmp/Endpoint_SlaveEndpointTest_NoAuthorizer_2_gjw8EH/fetch" --fetcher_cache_size="2GB"
--frameworks_home="" --gc_delay="1weeks" --gc_disk_headroom="0.1" --hadoop_home="" --help="false"
--hostname_lookup="true" --http_authenticators="basic" --http_command_executor="false" --http_credentials="/tmp/Endpoint_SlaveEndpointTest_NoAuthorizer_2_gjw8EH/http_credentials"
--http_heartbeat_interval="30secs" --initialize_driver_logging="true" --isolation="posix/cpu,posix/mem"
--launcher="posix" --launcher_dir="/mesos/build/src" --logbufsecs="0" --logging_level="INFO"
--max_completed_executors_per_framework="150" --oversubscribed_resources_interval="15secs"
--perf_duration="10secs" --perf_interval="1mins" --qos_correction_interval_min="0ns" --quiet="false"
--recover="reconnect" --recovery_timeout="15mins" --registration_backoff_factor="10ms" --resources="cpus:2;gpus:0;mem:1024;disk:1024;ports:[31000-32000]"
--revocable_cpu_low_priority="true" --runtime_dir="/tmp/Endpoint_SlaveEndpointTest_NoAuthorizer_2_gjw8EH"
--sandbox_directory="/mnt/mesos/sandbox" --strict="true" --switch_user="true" --systemd_enable_support="true"
--systemd_runtime_directory="/run/systemd/system" --version="false" --work_dir="/tmp/Endpoint_SlaveEndpointTest_NoAuthorizer_2_UwLIpt"
I0205 01:01:19.669749 27131 credentials.hpp:86] Loading credential for authentication from
'/tmp/Endpoint_SlaveEndpointTest_NoAuthorizer_2_gjw8EH/credential'
I0205 01:01:19.669881 27131 slave.cpp:354] Agent using credential for: test-principal
I0205 01:01:19.669906 27131 credentials.hpp:37] Loading credentials for authentication from
'/tmp/Endpoint_SlaveEndpointTest_NoAuthorizer_2_gjw8EH/http_credentials'
I0205 01:01:19.670058 27131 http.cpp:919] Using default 'basic' HTTP authenticator for realm
'mesos-agent-readonly'
I0205 01:01:19.670116 27131 http.cpp:919] Using default 'basic' HTTP authenticator for realm
'mesos-agent-readwrite'
I0205 01:01:19.670549 27131 slave.cpp:541] Agent resources: cpus(*):2; mem(*):1024; disk(*):1024;
ports(*):[31000-32000]
I0205 01:01:19.670591 27131 slave.cpp:549] Agent attributes: [  ]
I0205 01:01:19.670600 27131 slave.cpp:554] Agent hostname: 74dc334d1e86
I0205 01:01:19.670742 27138 status_update_manager.cpp:177] Pausing sending status updates
I0205 01:01:19.671016 27141 state.cpp:60] Recovering state from '/tmp/Endpoint_SlaveEndpointTest_NoAuthorizer_2_UwLIpt/meta'
I0205 01:01:19.671279 27140 status_update_manager.cpp:203] Recovering status update manager
I0205 01:01:19.671447 27140 containerizer.cpp:599] Recovering containerizer
I0205 01:01:19.672080 27140 provisioner.cpp:410] Provisioner recovery complete
I0205 01:01:19.672327 27142 slave.cpp:5499] Finished recovery
I0205 01:01:19.672672 27142 slave.cpp:5673] Querying resource estimator for oversubscribable
resources
I0205 01:01:19.672823 27131 slave.cpp:5687] Received oversubscribable resources {} from the
resource estimator
I0205 01:01:19.673521 27144 process.cpp:3697] Handling HTTP event for process 'slave(697)'
with path: '/slave(697)/containers'
I0205 01:01:19.673972 27139 http.cpp:871] Authorizing principal 'test-principal' to GET the
'/containers' endpoint
I0205 01:01:19.675431 27139 slave.cpp:803] Agent terminating
[       OK ] Endpoint/SlaveEndpointTest.NoAuthorizer/2 (14 ms)
[----------] 9 tests from Endpoint/SlaveEndpointTest (130 ms total)

[----------] Global test environment tear-down
[==========] 1434 tests from 160 test cases ran. (250683 ms total)
[  PASSED  ] 1433 tests.
[  FAILED  ] 1 test, listed below:
[  FAILED  ] SlaveRecoveryTest/0.RecoverStatusUpdateManager, where TypeParam = mesos::internal::slave::MesosContainerizer

 1 FAILED TEST
  YOU HAVE 11 DISABLED TESTS

make[3]: Leaving directory `/mesos/build'
make[3]: *** [CMakeFiles/check] Error 1
make[2]: *** [CMakeFiles/check.dir/all] Error 2
make[2]: Leaving directory `/mesos/build'
make[1]: *** [CMakeFiles/check.dir/rule] Error 2
make[1]: Leaving directory `/mesos/build'
make: *** [check] Error 2
+ docker rmi mesos-1486253554-10546
Untagged: mesos-1486253554-10546:latest
Deleted: sha256:d14cc0f8903f95d595863a2cec150db9b9c969a4210fd04a00a1d6904f9dd118
Deleted: sha256:9710fd51edf3c1dceb51478cc39d2704e8e266f8d90d9d9d2c831b384932e399
Deleted: sha256:351d3f34e07cd31a13b82d1f1620a875ae1678e9abae6e8c95789dc923dfd91e
Deleted: sha256:849ea2d4228ae328e5ef0369959f783d9f07734cbe1d99fa18cf0a0a3956a77d
Deleted: sha256:17e24cc409a3a61337370b6905b24ebd7530e179ea1d9ecdb6f0cc06b05db13d
Deleted: sha256:adc3f1e89f1a73f756f0689000a0b18b6edabfb0e82ad461a191b286adabfd21
Deleted: sha256:90185b1b6704a0d2d6a8071d8ed459d2551c5852000625922c49d8e2eb6e6802
Deleted: sha256:17a8abd876d9692a418c91966fe1dd7549e022d48bd711250ee7bb2b5ae597a3
Deleted: sha256:82c83cb7a3341c45810fe94b7d61447628c2a2b01a3dae4ab190bd5d0cd16d50
Deleted: sha256:be99acf3b5af8af2c2262fd4380aae40c5eeb76c4ff9d92d2f55185c21a88d67
Deleted: sha256:960c23f6925d50e4bd85711eebcf391a2eca3aaf4bb893b5468304cdfaa96ce0
Deleted: sha256:ffde2f68ee8ce25e7ac37a3b8df918c175fd3088eb3f5089b70db8c234f43828
Deleted: sha256:60f321d4bcab8739a79433f95a946564f873306bfba55db5caba8466ea081cf0
Deleted: sha256:36090f28a9fafc09b8d56ab88c2466fc840bc5088386bfa9d37221b4c42a7ce3
Deleted: sha256:908c1e66b32eacef4182aeb3a041aa4c7f114a3e1db5c9ff2ec4b297676171bb
Deleted: sha256:ccf7bc09b27f6c4e84beffd99dc30001075bbab2b8ebb8e7b796645fc3d55733
Deleted: sha256:fefbfedead37e8f49f98581ff3c7f2754b148b7c0e412e386e517c14de2f16b8
Deleted: sha256:ff0baf5d822f139ba182325e16c541aff016cf54ae3bc8c9aca404d8b3c14964
Deleted: sha256:f17470536382593fce5bd73cbafaddb43bfc396b99d7802f3395aa481abf5bce
Deleted: sha256:13501c8f7123e059a9fcf13072fc331ada2c72815f297a1d21ff409c2c5044ef
Deleted: sha256:afa226903341299ae2861e80ec56455d069fe40ab493af40b1ba327bb3e0db53
Deleted: sha256:c254206ac2a38a3255063a5b26d8be0a34b2677e514dd7ce97146fcbd6d18abe
Deleted: sha256:36808e91ced7ed29d5ff2d650c70053952349d4e668bf4b6f8a1b5264f641094
Deleted: sha256:955a1651bd82d0bceab05eb4ce97bd65495c3cf377fc32050335ffc55c6bac23
Build step 'Execute shell' marked build as failure

Mime
View raw message