mesos-builds mailing list archives

Site index · List index
Message view « Date » · « Thread »
Top « Date » · « Thread »
From Apache Jenkins Server <jenk...@builds.apache.org>
Subject Build failed in Jenkins: Mesos-Buildbot » autotools,clang,--verbose --enable-libevent --enable-ssl,GLOG_v=1 MESOS_VERBOSE=1,ubuntu:14.04,(docker||Hadoop)&&(!ubuntu-us1)&&(!ubuntu-eu2) #3293
Date Wed, 22 Feb 2017 00:52:04 GMT
See <https://builds.apache.org/job/Mesos-Buildbot/BUILDTOOL=autotools,COMPILER=clang,CONFIGURATION=--verbose%20--enable-libevent%20--enable-ssl,ENVIRONMENT=GLOG_v=1%20MESOS_VERBOSE=1,OS=ubuntu%3A14.04,label_exp=(docker%7C%7CHadoop)&&(!ubuntu-us1)&&(!ubuntu-eu2)/3293/display/redirect?page=changes>

Changes:

[bmahler] Added a test to ensure framework can upgrade into MULTI_ROLE.

[bmahler] Added a test to ensure offers with different roles cannot be combined.

------------------------------------------
[...truncated 2.54 MB...]
I0222 00:51:52.845438 26751 process.cpp:3704] Handling HTTP event for process '(76)' with
path: '/(76)/body'
I0222 00:51:52.845845 26755 process.cpp:3761] Failed to process request for '/(76)/body':
failure
I0222 00:51:52.845888 26762 process.cpp:1456] Returning '500 Internal Server Error' for '/(76)/body'
(failure)
I0222 00:51:52.846482 26764 process.cpp:827] Decode failure: Connection reset by peer
E0222 00:51:52.846508 26764 process.cpp:2426] Failed to shutdown socket with fd 9: Transport
endpoint is not connected
[       OK ] Scheme/HTTPTest.Endpoints/1 (8 ms)
[ RUN      ] Scheme/HTTPTest.EndpointsHelp/0
I0222 00:51:52.981374 25974 openssl.cpp:419] CA file path is unspecified! NOTE: Set CA file
path with LIBPROCESS_SSL_CA_FILE=<filepath>
I0222 00:51:52.981400 25974 openssl.cpp:424] CA directory path unspecified! NOTE: Set CA directory
path with LIBPROCESS_SSL_CA_DIR=<dirpath>
I0222 00:51:52.981406 25974 openssl.cpp:429] Will not verify peer certificate!
NOTE: Set LIBPROCESS_SSL_VERIFY_CERT=1 to enable peer certificate verification
I0222 00:51:52.981411 25974 openssl.cpp:435] Will only verify peer certificate if presented!
NOTE: Set LIBPROCESS_SSL_REQUIRE_CERT=1 to require peer certificate verification
I0222 00:51:52.983572 25974 process.cpp:1246] libprocess is initialized on 172.17.0.3:58091
with 16 worker threads
I0222 00:51:52.988912 26771 process.cpp:3704] Handling HTTP event for process 'help' with
path: '/help'
I0222 00:51:52.994443 26774 process.cpp:3704] Handling HTTP event for process 'help' with
path: '/help'
I0222 00:51:53.000561 26765 process.cpp:3704] Handling HTTP event for process 'help' with
path: '/help/(77)/body'
I0222 00:51:53.006037 26766 process.cpp:3704] Handling HTTP event for process 'help' with
path: '/help/(77)/a/b/c'
[       OK ] Scheme/HTTPTest.EndpointsHelp/0 (161 ms)
[ RUN      ] Scheme/HTTPTest.EndpointsHelp/1
I0222 00:51:53.010015 25974 process.cpp:1246] libprocess is initialized on 172.17.0.3:45673
with 16 worker threads
I0222 00:51:53.011670 26793 process.cpp:3704] Handling HTTP event for process 'help' with
path: '/help'
I0222 00:51:53.013859 26793 process.cpp:3704] Handling HTTP event for process 'help' with
path: '/help'
I0222 00:51:53.018023 26797 process.cpp:3704] Handling HTTP event for process 'help' with
path: '/help/(78)/body'
I0222 00:51:53.019949 26784 process.cpp:3704] Handling HTTP event for process 'help' with
path: '/help/(78)/a/b/c'
[       OK ] Scheme/HTTPTest.EndpointsHelp/1 (14 ms)
[ RUN      ] Scheme/HTTPTest.EndpointsHelpRemoval/0
I0222 00:51:53.471503 25974 openssl.cpp:419] CA file path is unspecified! NOTE: Set CA file
path with LIBPROCESS_SSL_CA_FILE=<filepath>
I0222 00:51:53.471526 25974 openssl.cpp:424] CA directory path unspecified! NOTE: Set CA directory
path with LIBPROCESS_SSL_CA_DIR=<dirpath>
I0222 00:51:53.471535 25974 openssl.cpp:429] Will not verify peer certificate!
NOTE: Set LIBPROCESS_SSL_VERIFY_CERT=1 to enable peer certificate verification
I0222 00:51:53.471539 25974 openssl.cpp:435] Will only verify peer certificate if presented!
NOTE: Set LIBPROCESS_SSL_REQUIRE_CERT=1 to require peer certificate verification
I0222 00:51:53.473834 25974 process.cpp:1246] libprocess is initialized on 172.17.0.3:57259
with 16 worker threads
I0222 00:51:53.479284 26811 process.cpp:3704] Handling HTTP event for process 'help' with
path: '/help/(79)/body'
I0222 00:51:53.484606 26799 process.cpp:3704] Handling HTTP event for process 'help' with
path: '/help/(79)/bogus'
[       OK ] Scheme/HTTPTest.EndpointsHelpRemoval/0 (465 ms)
[ RUN      ] Scheme/HTTPTest.EndpointsHelpRemoval/1
I0222 00:51:53.488191 25974 process.cpp:1246] libprocess is initialized on 172.17.0.3:41087
with 16 worker threads
I0222 00:51:53.489362 26830 process.cpp:3704] Handling HTTP event for process 'help' with
path: '/help/(80)/body'
I0222 00:51:53.491236 26819 process.cpp:3704] Handling HTTP event for process 'help' with
path: '/help/(80)/bogus'
[       OK ] Scheme/HTTPTest.EndpointsHelpRemoval/1 (6 ms)
[ RUN      ] Scheme/HTTPTest.PipeEOF/0
I0222 00:51:53.993316 25974 openssl.cpp:419] CA file path is unspecified! NOTE: Set CA file
path with LIBPROCESS_SSL_CA_FILE=<filepath>
I0222 00:51:53.993340 25974 openssl.cpp:424] CA directory path unspecified! NOTE: Set CA directory
path with LIBPROCESS_SSL_CA_DIR=<dirpath>
I0222 00:51:53.993345 25974 openssl.cpp:429] Will not verify peer certificate!
NOTE: Set LIBPROCESS_SSL_VERIFY_CERT=1 to enable peer certificate verification
I0222 00:51:53.993350 25974 openssl.cpp:435] Will only verify peer certificate if presented!
NOTE: Set LIBPROCESS_SSL_REQUIRE_CERT=1 to require peer certificate verification
I0222 00:51:53.995388 25974 process.cpp:1246] libprocess is initialized on 172.17.0.3:51860
with 16 worker threads
[       OK ] Scheme/HTTPTest.PipeEOF/0 (503 ms)
[ RUN      ] Scheme/HTTPTest.PipeEOF/1
I0222 00:51:53.998358 25974 process.cpp:1246] libprocess is initialized on 172.17.0.3:36277
with 16 worker threads
[       OK ] Scheme/HTTPTest.PipeEOF/1 (4 ms)
[ RUN      ] Scheme/HTTPTest.PipeFailure/0
I0222 00:51:54.400497 25974 openssl.cpp:419] CA file path is unspecified! NOTE: Set CA file
path with LIBPROCESS_SSL_CA_FILE=<filepath>
I0222 00:51:54.400522 25974 openssl.cpp:424] CA directory path unspecified! NOTE: Set CA directory
path with LIBPROCESS_SSL_CA_DIR=<dirpath>
I0222 00:51:54.400528 25974 openssl.cpp:429] Will not verify peer certificate!
NOTE: Set LIBPROCESS_SSL_VERIFY_CERT=1 to enable peer certificate verification
I0222 00:51:54.400534 25974 openssl.cpp:435] Will only verify peer certificate if presented!
NOTE: Set LIBPROCESS_SSL_REQUIRE_CERT=1 to require peer certificate verification
I0222 00:51:54.418329 25974 process.cpp:1246] libprocess is initialized on 172.17.0.3:59261
with 16 worker threads
[       OK ] Scheme/HTTPTest.PipeFailure/0 (426 ms)
[ RUN      ] Scheme/HTTPTest.PipeFailure/1
I0222 00:51:54.428017 25974 process.cpp:1246] libprocess is initialized on 172.17.0.3:34587
with 16 worker threads
[       OK ] Scheme/HTTPTest.PipeFailure/1 (3 ms)
[ RUN      ] Scheme/HTTPTest.PipeReaderCloses/0
I0222 00:51:54.674914 25974 openssl.cpp:419] CA file path is unspecified! NOTE: Set CA file
path with LIBPROCESS_SSL_CA_FILE=<filepath>
I0222 00:51:54.674937 25974 openssl.cpp:424] CA directory path unspecified! NOTE: Set CA directory
path with LIBPROCESS_SSL_CA_DIR=<dirpath>
I0222 00:51:54.674942 25974 openssl.cpp:429] Will not verify peer certificate!
NOTE: Set LIBPROCESS_SSL_VERIFY_CERT=1 to enable peer certificate verification
I0222 00:51:54.674945 25974 openssl.cpp:435] Will only verify peer certificate if presented!
NOTE: Set LIBPROCESS_SSL_REQUIRE_CERT=1 to require peer certificate verification
I0222 00:51:54.678397 25974 process.cpp:1246] libprocess is initialized on 172.17.0.3:58248
with 16 worker threads
[       OK ] Scheme/HTTPTest.PipeReaderCloses/0 (250 ms)
[ RUN      ] Scheme/HTTPTest.PipeReaderCloses/1
I0222 00:51:54.682166 25974 process.cpp:1246] libprocess is initialized on 172.17.0.3:54179
with 16 worker threads
[       OK ] Scheme/HTTPTest.PipeReaderCloses/1 (4 ms)
[ RUN      ] Scheme/HTTPTest.Encode/0
I0222 00:51:55.102636 25974 openssl.cpp:419] CA file path is unspecified! NOTE: Set CA file
path with LIBPROCESS_SSL_CA_FILE=<filepath>
I0222 00:51:55.102661 25974 openssl.cpp:424] CA directory path unspecified! NOTE: Set CA directory
path with LIBPROCESS_SSL_CA_DIR=<dirpath>
I0222 00:51:55.102668 25974 openssl.cpp:429] Will not verify peer certificate!
NOTE: Set LIBPROCESS_SSL_VERIFY_CERT=1 to enable peer certificate verification
I0222 00:51:55.102674 25974 openssl.cpp:435] Will only verify peer certificate if presented!
NOTE: Set LIBPROCESS_SSL_REQUIRE_CERT=1 to require peer certificate verification
I0222 00:51:55.118235 25974 process.cpp:1246] libprocess is initialized on 172.17.0.3:41190
with 16 worker threads
[       OK ] Scheme/HTTPTest.Encode/0 (436 ms)
[ RUN      ] Scheme/HTTPTest.Encode/1
I0222 00:51:55.122488 25974 process.cpp:1246] libprocess is initialized on 172.17.0.3:59486
with 16 worker threads
[       OK ] Scheme/HTTPTest.Encode/1 (4 ms)
[ RUN      ] Scheme/HTTPTest.PathParse/0
I0222 00:51:55.659194 25974 openssl.cpp:419] CA file path is unspecified! NOTE: Set CA file
path with LIBPROCESS_SSL_CA_FILE=<filepath>
I0222 00:51:55.659217 25974 openssl.cpp:424] CA directory path unspecified! NOTE: Set CA directory
path with LIBPROCESS_SSL_CA_DIR=<dirpath>
I0222 00:51:55.659222 25974 openssl.cpp:429] Will not verify peer certificate!
NOTE: Set LIBPROCESS_SSL_VERIFY_CERT=1 to enable peer certificate verification
I0222 00:51:55.659226 25974 openssl.cpp:435] Will only verify peer certificate if presented!
NOTE: Set LIBPROCESS_SSL_REQUIRE_CERT=1 to require peer certificate verification
I0222 00:51:55.660915 25974 process.cpp:1246] libprocess is initialized on 172.17.0.3:35417
with 16 worker threads
[       OK ] Scheme/HTTPTest.PathParse/0 (539 ms)
[ RUN      ] Scheme/HTTPTest.PathParse/1
I0222 00:51:55.663508 25974 process.cpp:1246] libprocess is initialized on 172.17.0.3:38146
with 16 worker threads
[       OK ] Scheme/HTTPTest.PathParse/1 (2 ms)
[ RUN      ] Scheme/HTTPTest.Get/0
I0222 00:51:55.796361 25974 openssl.cpp:419] CA file path is unspecified! NOTE: Set CA file
path with LIBPROCESS_SSL_CA_FILE=<filepath>
I0222 00:51:55.796382 25974 openssl.cpp:424] CA directory path unspecified! NOTE: Set CA directory
path with LIBPROCESS_SSL_CA_DIR=<dirpath>
I0222 00:51:55.796387 25974 openssl.cpp:429] Will not verify peer certificate!
NOTE: Set LIBPROCESS_SSL_VERIFY_CERT=1 to enable peer certificate verification
I0222 00:51:55.796391 25974 openssl.cpp:435] Will only verify peer certificate if presented!
NOTE: Set LIBPROCESS_SSL_REQUIRE_CERT=1 to require peer certificate verification
I0222 00:51:55.803104 25974 process.cpp:1246] libprocess is initialized on 172.17.0.3:51702
with 16 worker threads
I0222 00:51:55.808670 27003 process.cpp:3704] Handling HTTP event for process '(81)' with
path: '/(81)/get'
I0222 00:51:55.814393 27005 process.cpp:3704] Handling HTTP event for process '(81)' with
path: '/(81)/get'
[       OK ] Scheme/HTTPTest.Get/0 (153 ms)
[ RUN      ] Scheme/HTTPTest.Get/1
I0222 00:51:55.818819 25974 process.cpp:1246] libprocess is initialized on 172.17.0.3:47138
with 16 worker threads
I0222 00:51:55.819983 27032 process.cpp:3704] Handling HTTP event for process '(82)' with
path: '/(82)/get'
I0222 00:51:55.821933 27031 process.cpp:3704] Handling HTTP event for process '(82)' with
path: '/(82)/get'
[       OK ] Scheme/HTTPTest.Get/1 (7 ms)
[ RUN      ] Scheme/HTTPTest.NestedGet/0
I0222 00:51:56.190155 25974 openssl.cpp:419] CA file path is unspecified! NOTE: Set CA file
path with LIBPROCESS_SSL_CA_FILE=<filepath>
I0222 00:51:56.190181 25974 openssl.cpp:424] CA directory path unspecified! NOTE: Set CA directory
path with LIBPROCESS_SSL_CA_DIR=<dirpath>
I0222 00:51:56.190186 25974 openssl.cpp:429] Will not verify peer certificate!
NOTE: Set LIBPROCESS_SSL_VERIFY_CERT=1 to enable peer certificate verification
I0222 00:51:56.190189 25974 openssl.cpp:435] Will only verify peer certificate if presented!
NOTE: Set LIBPROCESS_SSL_REQUIRE_CERT=1 to require peer certificate verification
I0222 00:51:56.206656 25974 process.cpp:1246] libprocess is initialized on 172.17.0.3:43552
with 16 worker threads
I0222 00:51:56.212255 27048 process.cpp:3704] Handling HTTP event for process '(83)' with
path: '/(83)//a/b/c'
I0222 00:51:56.217679 27052 process.cpp:3704] Handling HTTP event for process '(83)' with
path: '/(83)//a/b'
[       OK ] Scheme/HTTPTest.NestedGet/0 (396 ms)
[ RUN      ] Scheme/HTTPTest.NestedGet/1
I0222 00:51:56.232463 25974 process.cpp:1246] libprocess is initialized on 172.17.0.3:35158
with 16 worker threads
I0222 00:51:56.233765 27067 process.cpp:3704] Handling HTTP event for process '(84)' with
path: '/(84)//a/b/c'
I0222 00:51:56.235760 27069 process.cpp:3704] Handling HTTP event for process '(84)' with
path: '/(84)//a/b'
[       OK ] Scheme/HTTPTest.NestedGet/1 (18 ms)
[ RUN      ] Scheme/HTTPTest.StreamingGetComplete/0
I0222 00:51:56.723474 25974 openssl.cpp:419] CA file path is unspecified! NOTE: Set CA file
path with LIBPROCESS_SSL_CA_FILE=<filepath>
I0222 00:51:56.723497 25974 openssl.cpp:424] CA directory path unspecified! NOTE: Set CA directory
path with LIBPROCESS_SSL_CA_DIR=<dirpath>
I0222 00:51:56.723505 25974 openssl.cpp:429] Will not verify peer certificate!
NOTE: Set LIBPROCESS_SSL_VERIFY_CERT=1 to enable peer certificate verification
I0222 00:51:56.723510 25974 openssl.cpp:435] Will only verify peer certificate if presented!
NOTE: Set LIBPROCESS_SSL_REQUIRE_CERT=1 to require peer certificate verification
I0222 00:51:56.726073 25974 process.cpp:1246] libprocess is initialized on 172.17.0.3:54714
with 16 worker threads
I0222 00:51:56.731173 27079 process.cpp:3704] Handling HTTP event for process '(85)' with
path: '/(85)/pipe'
[       OK ] Scheme/HTTPTest.StreamingGetComplete/0 (801 ms)
[ RUN      ] Scheme/HTTPTest.StreamingGetComplete/1
I0222 00:51:57.050235 25974 process.cpp:1246] libprocess is initialized on 172.17.0.3:53553
with 16 worker threads
I0222 00:51:57.051547 27094 process.cpp:3704] Handling HTTP event for process '(86)' with
path: '/(86)/pipe'
[       OK ] Scheme/HTTPTest.StreamingGetComplete/1 (16 ms)
[ RUN      ] Scheme/HTTPTest.StreamingGetFailure/0
I0222 00:51:57.346989 25974 openssl.cpp:419] CA file path is unspecified! NOTE: Set CA file
path with LIBPROCESS_SSL_CA_FILE=<filepath>
I0222 00:51:57.347020 25974 openssl.cpp:424] CA directory path unspecified! NOTE: Set CA directory
path with LIBPROCESS_SSL_CA_DIR=<dirpath>
I0222 00:51:57.347028 25974 openssl.cpp:429] Will not verify peer certificate!
NOTE: Set LIBPROCESS_SSL_VERIFY_CERT=1 to enable peer certificate verification
I0222 00:51:57.347031 25974 openssl.cpp:435] Will only verify peer certificate if presented!
NOTE: Set LIBPROCESS_SSL_REQUIRE_CERT=1 to require peer certificate verification
I0222 00:51:57.349541 25974 process.cpp:1246] libprocess is initialized on 172.17.0.3:57045
with 16 worker threads
I0222 00:51:57.355114 27116 process.cpp:3704] Handling HTTP event for process '(87)' with
path: '/(87)/pipe'
I0222 00:51:57.393860 27107 process.cpp:1604] Failed to read from stream: oops
[       OK ] Scheme/HTTPTest.StreamingGetFailure/0 (341 ms)
[ RUN      ] Scheme/HTTPTest.StreamingGetFailure/1
I0222 00:51:57.398489 25974 process.cpp:1246] libprocess is initialized on 172.17.0.3:46321
with 16 worker threads
I0222 00:51:57.399700 27130 process.cpp:3704] Handling HTTP event for process '(88)' with
path: '/(88)/pipe'
I0222 00:51:57.401955 27131 process.cpp:1604] Failed to read from stream: oops
[       OK ] Scheme/HTTPTest.StreamingGetFailure/1 (8 ms)
[ RUN      ] Scheme/HTTPTest.PipeEquality/0
I0222 00:51:57.990458 25974 openssl.cpp:419] CA file path is unspecified! NOTE: Set CA file
path with LIBPROCESS_SSL_CA_FILE=<filepath>
I0222 00:51:57.990483 25974 openssl.cpp:424] CA directory path unspecified! NOTE: Set CA directory
path with LIBPROCESS_SSL_CA_DIR=<dirpath>
I0222 00:51:57.990487 25974 openssl.cpp:429] Will not verify peer certificate!
NOTE: Set LIBPROCESS_SSL_VERIFY_CERT=1 to enable peer certificate verification
I0222 00:51:57.990491 25974 openssl.cpp:435] Will only verify peer certificate if presented!
NOTE: Set LIBPROCESS_SSL_REQUIRE_CERT=1 to require peer certificate verification
I0222 00:51:57.992308 25974 process.cpp:1246] libprocess is initialized on 172.17.0.3:36318
with 16 worker threads
[       OK ] Scheme/HTTPTest.PipeEquality/0 (589 ms)
[ RUN      ] Scheme/HTTPTest.PipeEquality/1
I0222 00:51:58.001183 25974 process.cpp:1246] libprocess is initialized on 172.17.0.3:58609
with 16 worker threads
[       OK ] Scheme/HTTPTest.PipeEquality/1 (9 ms)
[ RUN      ] Scheme/HTTPTest.Post/0
I0222 00:51:58.243434 25974 openssl.cpp:419] CA file path is unspecified! NOTE: Set CA file
path with LIBPROCESS_SSL_CA_FILE=<filepath>
I0222 00:51:58.243456 25974 openssl.cpp:424] CA directory path unspecified! NOTE: Set CA directory
path with LIBPROCESS_SSL_CA_DIR=<dirpath>
I0222 00:51:58.243461 25974 openssl.cpp:429] Will not verify peer certificate!
NOTE: Set LIBPROCESS_SSL_VERIFY_CERT=1 to enable peer certificate verification
I0222 00:51:58.243465 25974 openssl.cpp:435] Will only verify peer certificate if presented!
NOTE: Set LIBPROCESS_SSL_REQUIRE_CERT=1 to require peer certificate verification
*** Aborted at 1487724718 (unix time) try "date -d @1487724718" if you are using GNU date
***
PC: @     0x2b8fed6d8e62 (unknown)
*** SIGSEGV (@0x2b902250f1d8) received by PID 25974 (TID 0x2b8ff5380700) from PID 575730136;
stack trace: ***
I0222 00:51:58.254366 25974 process.cpp:1246] libprocess is initialized on 172.17.0.3:59691
with 16 worker threads
    @     0x2b8feb82a330 (unknown)
    @     0x2b8fed6d8e62 (unknown)
    @     0x2b8fed6d948c (unknown)
    @           0x442f4f process::UPID::UPID()
    @           0x9f4d3e process::DispatchEvent::DispatchEvent()
I0222 00:51:58.262909 27184 process.cpp:3704] Handling HTTP event for process '(89)' with
path: '/(89)/post'
    @           0x9de7f3 process::internal::dispatch()
    @           0x9f47fd process::dispatch<>()
    @           0x9dd817 process::ProcessBase::route()
    @           0xaf57bd process::ProcessBase::route<>()
    @           0xaf3090 process::Help::initialize()
    @           0xaf3142 process::Help::initialize()
    @           0x9d8300 process::ProcessManager::resume()
    @           0x9e6b2c process::ProcessManager::init_threads()::$_2::operator()()
    @           0x9e6a35 _ZNSt12_Bind_simpleIFZN7process14ProcessManager12init_threadsEvE3$_2vEE9_M_invokeIJEEEvSt12_Index_tupleIJXspT_EEE
    @           0x9e6a05 std::_Bind_simple<>::operator()()
    @           0x9e69dc std::thread::_Impl<>::_M_run()
    @     0x2b8fed6cfa60 (unknown)
    @     0x2b8feb822184 start_thread
    @     0x2b8fedf3837d (unknown)
make[7]: *** [check-local] Segmentation fault
make[7]: Leaving directory `/mesos/mesos-1.3.0/_build/3rdparty/libprocess'
make[6]: *** [check-am] Error 2
make[6]: Leaving directory `/mesos/mesos-1.3.0/_build/3rdparty/libprocess'
make[5]: *** [check-recursive] Error 1
make[5]: Leaving directory `/mesos/mesos-1.3.0/_build/3rdparty/libprocess'
make[4]: *** [check] Error 2
make[4]: Leaving directory `/mesos/mesos-1.3.0/_build/3rdparty/libprocess'
make[3]: *** [check-recursive] Error 1
make[3]: Leaving directory `/mesos/mesos-1.3.0/_build/3rdparty'
make[2]: *** [check] Error 2
make[2]: Leaving directory `/mesos/mesos-1.3.0/_build/3rdparty'
make[1]: *** [check-recursive] Error 1
make[1]: Leaving directory `/mesos/mesos-1.3.0/_build'
make: *** [distcheck] Error 1
+ docker rmi mesos-1487722902-26153
Untagged: mesos-1487722902-26153:latest
Deleted: sha256:4cb6dec29775bf7c13b3e145794a80c708e606b11baa4c0a5c83ae9551774cb5
Deleted: sha256:d41f1ee2bb08ea706237c8cbf9fa79619567af79a2655ffb0b36a982720b5333
Deleted: sha256:406457209a56d121bb9a53ef8915fae85878a7df18994619832127d67571cd4a
Deleted: sha256:4b504f357ec7980cc4bc5a9d07d99346f935882a03b882ff3279e0b232638db4
Deleted: sha256:95014c1e0665707992bf37be13d78e0357de3dbabfaabd23e309c1e35efb8d80
Deleted: sha256:68dfe6b6e5e8858b89abbdcf7ee9cd11d03c53efd73a1e7af11c624708359368
Deleted: sha256:a09336de2ff3cda7d2fc70a8b4ebafdd12dabb6ccb45711cc77aa8b6a9b1a4f1
Deleted: sha256:c6692ef6274cb3ebf39050223786b91377c5b810215818e5617724aeb47da1bc
Deleted: sha256:fb39fc4a47ddedda212f14854d652c772d710947a9b8c11e728a3b4c6e5a392e
Deleted: sha256:6bea4ef3a301ee0acbee67ceec755911ffff71d513b9102996aef3dc9b8893cb
Deleted: sha256:fbb362f362f5c60371fed41eb6b30351101edd8f62b128ae53f9141dc5abfd7f
Deleted: sha256:e14ea002ed192104ab11dad23287b1c4d97b6d2192dc77959f4f68573a95a9c7
Deleted: sha256:80c90373dcdad26e3836bdba55cdca40e3dae14329ea16cc66698b144a6867b8
Deleted: sha256:a55e0a18ca010921fb008b3a77554dcba215230f2b4a5f52c1591029d4bad586
Deleted: sha256:0d45165ad4d415798a309873f69b9da155a8ebd96ec35ccfe7e3df4095717207
Deleted: sha256:7fc9cbbd9e8270e161d9c92c4551fe997f73b2aa7947d1d392466b2a661bc726
Deleted: sha256:486930e76bc93703c347711b825575fca3c050ec08e6bbdd2429cdee57927516
Deleted: sha256:049ac13ce40da58f66c19c26b4d45d9ff992fbf12c3cadf0812978311ec45afd
Deleted: sha256:6c3365f9b8c12a57868f992d41f9f71a6a12662cf59d9f8db789ddc5ab69f69b
Deleted: sha256:f8d53fcb8545f998b271fd7406a283e3bbe91aaf8a8697a72cc79f6ce1d8a60e
Deleted: sha256:1cd6c3787983eab4c53ee27f9c42a6522f8845ca52dc0ace1a1a571618fce3fb
Deleted: sha256:2233e943c39bb1ce76e9c61fd60e94b9f651adeaadc9978530f30d8ce9342d5a
Deleted: sha256:edb81630f95ce9756af35e7ef28aa9c7fc30d87ce8e154065be147d22d679252
Deleted: sha256:609426431de9f503ea9003700031642a0907a46ee46a351bd53794019fc245f2
Build step 'Execute shell' marked build as failure

Mime
View raw message