mesos-builds mailing list archives

Site index · List index
Message view « Date » · « Thread »
Top « Date » · « Thread »
From Apache Jenkins Server <jenk...@builds.apache.org>
Subject Build failed in Jenkins: Mesos-Reviewbot #16974
Date Sat, 04 Feb 2017 06:08:48 GMT
See <https://builds.apache.org/job/Mesos-Reviewbot/16974/>

------------------------------------------
[...truncated 70086 lines...]
I0204 06:08:40.936444 30198 exec.cpp:391] Executor received framework message
I0204 06:08:40.936534 30198 exec.cpp:400] Executor::frameworkMessage took 60382ns
I0204 06:08:40.936630 30194 slave.cpp:3060] Status update manager successfully handled status
update acknowledgement (UUID: 534edaa4-4457-4675-8ec3-656f1da4d913) for task 1 of framework
4480f52f-65fb-4185-9913-3d088ecb1a2e-0000
I0204 06:08:40.937360 30196 slave.cpp:4279] Sending message for framework 4480f52f-65fb-4185-9913-3d088ecb1a2e-0000
to scheduler-25a0ab75-946e-4266-84b8-b2949a9f1af7@172.17.0.3:40388
I0204 06:08:40.937577 30199 sched.cpp:1177] Scheduler::frameworkMessage took 58034ns
I0204 06:08:40.937988 30170 sched.cpp:2021] Asked to stop the driver
I0204 06:08:40.938087 30202 sched.cpp:1203] Stopping framework 4480f52f-65fb-4185-9913-3d088ecb1a2e-0000
I0204 06:08:40.938355 30194 master.cpp:7645] Processing TEARDOWN call for framework 4480f52f-65fb-4185-9913-3d088ecb1a2e-0000
(default) at scheduler-25a0ab75-946e-4266-84b8-b2949a9f1af7@172.17.0.3:40388
I0204 06:08:40.938405 30194 master.cpp:7657] Removing framework 4480f52f-65fb-4185-9913-3d088ecb1a2e-0000
(default) at scheduler-25a0ab75-946e-4266-84b8-b2949a9f1af7@172.17.0.3:40388
I0204 06:08:40.938441 30194 master.cpp:3080] Deactivating framework 4480f52f-65fb-4185-9913-3d088ecb1a2e-0000
(default) at scheduler-25a0ab75-946e-4266-84b8-b2949a9f1af7@172.17.0.3:40388
I0204 06:08:40.938668 30191 hierarchical.cpp:415] Deactivated framework 4480f52f-65fb-4185-9913-3d088ecb1a2e-0000
I0204 06:08:40.938724 30204 slave.cpp:2613] Asked to shut down framework 4480f52f-65fb-4185-9913-3d088ecb1a2e-0000
by master@172.17.0.3:40388
I0204 06:08:40.938746 30194 master.cpp:8242] Updating the state of task 1 of framework 4480f52f-65fb-4185-9913-3d088ecb1a2e-0000
(latest state: TASK_KILLED, status update state: TASK_KILLED)
I0204 06:08:40.938777 30204 slave.cpp:2638] Shutting down framework 4480f52f-65fb-4185-9913-3d088ecb1a2e-0000
I0204 06:08:40.938840 30204 slave.cpp:5020] Shutting down executor 'default' of framework
4480f52f-65fb-4185-9913-3d088ecb1a2e-0000 at executor(74)@172.17.0.3:40388
I0204 06:08:40.939049 30195 exec.cpp:410] Executor asked to shutdown
I0204 06:08:40.939106 30195 exec.cpp:425] Executor::shutdown took 28172ns
I0204 06:08:40.939280 30204 slave.cpp:4343] Got exited event for executor(74)@172.17.0.3:40388
I0204 06:08:40.940196 30201 slave.cpp:4706] Executor 'default' of framework 4480f52f-65fb-4185-9913-3d088ecb1a2e-0000
exited with status 0
I0204 06:08:40.940301 30201 slave.cpp:4806] Cleaning up executor 'default' of framework 4480f52f-65fb-4185-9913-3d088ecb1a2e-0000
at executor(74)@172.17.0.3:40388
I0204 06:08:40.940274 30194 master.cpp:8336] Removing task 1 with resources cpus(*)(allocated:
*):2; mem(*)(allocated: *):1024; disk(*)(allocated: *):1024; ports(*)(allocated: *):[31000-32000]
of framework 4480f52f-65fb-4185-9913-3d088ecb1a2e-0000 on agent 4480f52f-65fb-4185-9913-3d088ecb1a2e-S0
at slave(179)@172.17.0.3:40388 (8785245fd885)
I0204 06:08:40.940522 30190 hierarchical.cpp:1082] Recovered cpus(*)(allocated: *):2; mem(*)(allocated:
*):1024; disk(*)(allocated: *):1024; ports(*)(allocated: *):[31000-32000] (total: cpus(*):2;
mem(*):1024; disk(*):1024; ports(*):[31000-32000], allocated: {}) on agent 4480f52f-65fb-4185-9913-3d088ecb1a2e-S0
from framework 4480f52f-65fb-4185-9913-3d088ecb1a2e-0000
I0204 06:08:40.940819 30194 master.cpp:8365] Removing executor 'default' with resources {}
of framework 4480f52f-65fb-4185-9913-3d088ecb1a2e-0000 on agent 4480f52f-65fb-4185-9913-3d088ecb1a2e-S0
at slave(179)@172.17.0.3:40388 (8785245fd885)
I0204 06:08:40.940889 30201 slave.cpp:4894] Cleaning up framework 4480f52f-65fb-4185-9913-3d088ecb1a2e-0000
I0204 06:08:40.940912 30191 gc.cpp:55] Scheduling '/tmp/MasterTest_FrameworkMessage_LsTQnz/slaves/4480f52f-65fb-4185-9913-3d088ecb1a2e-S0/frameworks/4480f52f-65fb-4185-9913-3d088ecb1a2e-0000/executors/default/runs/1c17553b-6e1c-4207-8ea6-a8421f893638'
for gc 6.99998911410963days in the future
I0204 06:08:40.941100 30193 status_update_manager.cpp:285] Closing status update streams for
framework 4480f52f-65fb-4185-9913-3d088ecb1a2e-0000
I0204 06:08:40.941157 30193 status_update_manager.cpp:531] Cleaning up status update stream
for task 1 of framework 4480f52f-65fb-4185-9913-3d088ecb1a2e-0000
I0204 06:08:40.941386 30191 gc.cpp:55] Scheduling '/tmp/MasterTest_FrameworkMessage_LsTQnz/slaves/4480f52f-65fb-4185-9913-3d088ecb1a2e-S0/frameworks/4480f52f-65fb-4185-9913-3d088ecb1a2e-0000/executors/default'
for gc 6.99998911088days in the future
I0204 06:08:40.941563 30191 gc.cpp:55] Scheduling '/tmp/MasterTest_FrameworkMessage_LsTQnz/slaves/4480f52f-65fb-4185-9913-3d088ecb1a2e-S0/frameworks/4480f52f-65fb-4185-9913-3d088ecb1a2e-0000'
for gc 6.99998910816days in the future
I0204 06:08:40.941599 30192 hierarchical.cpp:362] Removed framework 4480f52f-65fb-4185-9913-3d088ecb1a2e-0000
W0204 06:08:40.941640 30194 master.cpp:6218] Ignoring unknown exited executor 'default' of
framework 4480f52f-65fb-4185-9913-3d088ecb1a2e-0000 on agent 4480f52f-65fb-4185-9913-3d088ecb1a2e-S0
at slave(179)@172.17.0.3:40388 (8785245fd885)
I0204 06:08:40.941715 30198 slave.cpp:803] Agent terminating
I0204 06:08:40.941964 30197 master.cpp:1263] Agent 4480f52f-65fb-4185-9913-3d088ecb1a2e-S0
at slave(179)@172.17.0.3:40388 (8785245fd885) disconnected
I0204 06:08:40.942000 30197 master.cpp:3117] Disconnecting agent 4480f52f-65fb-4185-9913-3d088ecb1a2e-S0
at slave(179)@172.17.0.3:40388 (8785245fd885)
I0204 06:08:40.942090 30197 master.cpp:3136] Deactivating agent 4480f52f-65fb-4185-9913-3d088ecb1a2e-S0
at slave(179)@172.17.0.3:40388 (8785245fd885)
I0204 06:08:40.942219 30190 hierarchical.cpp:617] Agent 4480f52f-65fb-4185-9913-3d088ecb1a2e-S0
deactivated
I0204 06:08:40.945338 30189 master.cpp:1102] Master terminating
I0204 06:08:40.946101 30198 hierarchical.cpp:548] Removed agent 4480f52f-65fb-4185-9913-3d088ecb1a2e-S0
[       OK ] MasterTest.FrameworkMessage (77 ms)
[ RUN      ] MasterTest.MultipleExecutors
I0204 06:08:40.954330 30170 cluster.cpp:160] Creating default 'local' authorizer
I0204 06:08:40.957130 30201 master.cpp:383] Master ea2e9268-fc32-4d89-ad22-f7c0e07d8c40 (8785245fd885)
started on 172.17.0.3:40388
I0204 06:08:40.957155 30201 master.cpp:385] Flags at startup: --acls="" --agent_ping_timeout="15secs"
--agent_reregister_timeout="10mins" --allocation_interval="1secs" --allocator="HierarchicalDRF"
--authenticate_agents="true" --authenticate_frameworks="true" --authenticate_http_frameworks="true"
--authenticate_http_readonly="true" --authenticate_http_readwrite="true" --authenticators="crammd5"
--authorizers="local" --credentials="/tmp/8iSKi2/credentials" --framework_sorter="drf" --help="false"
--hostname_lookup="true" --http_authenticators="basic" --http_framework_authenticators="basic"
--initialize_driver_logging="true" --log_auto_initialize="true" --logbufsecs="0" --logging_level="INFO"
--max_agent_ping_timeouts="5" --max_completed_frameworks="50" --max_completed_tasks_per_framework="1000"
--max_unreachable_tasks_per_framework="1000" --quiet="false" --recovery_agent_removal_limit="100%"
--registry="in_memory" --registry_fetch_timeout="1mins" --registry_gc_interval="15mins" --registry_max_agent_age="2weeks"
--registry_max_agent_count="102400" --registry_store_timeout="100secs" --registry_strict="false"
--root_submissions="true" --user_sorter="drf" --version="false" --webui_dir="/mesos/mesos-1.2.0/_inst/share/mesos/webui"
--work_dir="/tmp/8iSKi2/master" --zk_session_timeout="10secs"
I0204 06:08:40.957468 30201 master.cpp:435] Master only allowing authenticated frameworks
to register
I0204 06:08:40.957478 30201 master.cpp:449] Master only allowing authenticated agents to register
I0204 06:08:40.957482 30201 master.cpp:462] Master only allowing authenticated HTTP frameworks
to register
I0204 06:08:40.957489 30201 credentials.hpp:37] Loading credentials for authentication from
'/tmp/8iSKi2/credentials'
I0204 06:08:40.957731 30201 master.cpp:507] Using default 'crammd5' authenticator
I0204 06:08:40.957859 30201 http.cpp:919] Using default 'basic' HTTP authenticator for realm
'mesos-master-readonly'
I0204 06:08:40.957975 30201 http.cpp:919] Using default 'basic' HTTP authenticator for realm
'mesos-master-readwrite'
I0204 06:08:40.958179 30201 http.cpp:919] Using default 'basic' HTTP authenticator for realm
'mesos-master-scheduler'
I0204 06:08:40.958365 30201 master.cpp:587] Authorization enabled
I0204 06:08:40.960661 30199 whitelist_watcher.cpp:77] No whitelist given
I0204 06:08:40.960700 30189 hierarchical.cpp:161] Initialized hierarchical allocator process
I0204 06:08:40.961736 30202 master.cpp:2123] Elected as the leading master!
I0204 06:08:40.961771 30202 master.cpp:1645] Recovering from registrar
I0204 06:08:40.961899 30199 registrar.cpp:329] Recovering registrar
I0204 06:08:40.962560 30199 registrar.cpp:362] Successfully fetched the registry (0B) in 605952ns
I0204 06:08:40.962687 30199 registrar.cpp:461] Applied 1 operations in 25530ns; attempting
to update the registry
I0204 06:08:40.963541 30189 registrar.cpp:506] Successfully updated the registry in 793088ns
I0204 06:08:40.963654 30189 registrar.cpp:392] Successfully recovered registrar
I0204 06:08:40.964143 30203 master.cpp:1761] Recovered 0 agents from the registry (129B);
allowing 10mins for agents to re-register
I0204 06:08:40.964170 30193 hierarchical.cpp:188] Skipping recovery of hierarchical allocator:
nothing to recover
I0204 06:08:40.968689 30170 cluster.cpp:446] Creating default 'local' authorizer
I0204 06:08:40.970260 30194 slave.cpp:211] Mesos agent started on (180)@172.17.0.3:40388
I0204 06:08:40.970286 30194 slave.cpp:212] Flags at startup: --acls="" --appc_simple_discovery_uri_prefix="http://"
--appc_store_dir="/tmp/mesos/store/appc" --authenticate_http_readonly="true" --authenticate_http_readwrite="true"
--authenticatee="crammd5" --authentication_backoff_factor="1secs" --authorizer="local" --cgroups_cpu_enable_pids_and_tids_count="false"
--cgroups_enable_cfs="false" --cgroups_hierarchy="/sys/fs/cgroup" --cgroups_limit_swap="false"
--cgroups_root="mesos" --container_disk_watch_interval="15secs" --containerizers="mesos" --credential="/tmp/MasterTest_MultipleExecutors_gPU31L/credential"
--default_role="*" --disk_watch_interval="1mins" --docker="docker" --docker_kill_orphans="true"
--docker_registry="https://registry-1.docker.io" --docker_remove_delay="6hrs" --docker_socket="/var/run/docker.sock"
--docker_stop_timeout="0ns" --docker_store_dir="/tmp/mesos/store/docker" --docker_volume_checkpoint_dir="/var/run/mesos/isolators/docker/volume"
--enforce_container_disk_quota="false" --executor_registration_timeout="1mins" --executor_shutdown_grace_period="5secs"
--fetcher_cache_dir="/tmp/MasterTest_MultipleExecutors_gPU31L/fetch" --fetcher_cache_size="2GB"
--frameworks_home="" --gc_delay="1weeks" --gc_disk_headroom="0.1" --hadoop_home="" --help="false"
--hostname_lookup="true" --http_authenticators="basic" --http_command_executor="false" --http_credentials="/tmp/MasterTest_MultipleExecutors_gPU31L/http_credentials"
--http_heartbeat_interval="30secs" --initialize_driver_logging="true" --isolation="posix/cpu,posix/mem"
--launcher="posix" --launcher_dir="/mesos/mesos-1.2.0/_build/src" --logbufsecs="0" --logging_level="INFO"
--max_completed_executors_per_framework="150" --oversubscribed_resources_interval="15secs"
--perf_duration="10secs" --perf_interval="1mins" --qos_correction_interval_min="0ns" --quiet="false"
--recover="reconnect" --recovery_timeout="15mins" --registration_backoff_factor="10ms" --resources="cpus:2;gpus:0;mem:1024;disk:1024;ports:[31000-32000]"
--revocable_cpu_low_priority="true" --runtime_dir="/tmp/MasterTest_MultipleExecutors_gPU31L"
--sandbox_directory="/mnt/mesos/sandbox" --strict="true" --switch_user="true" --systemd_enable_support="true"
--systemd_runtime_directory="/run/systemd/system" --version="false" --work_dir="/tmp/MasterTest_MultipleExecutors_wpNoap"
I0204 06:08:40.971026 30194 credentials.hpp:86] Loading credential for authentication from
'/tmp/MasterTest_MultipleExecutors_gPU31L/credential'
I0204 06:08:40.971274 30194 slave.cpp:354] Agent using credential for: test-principal
I0204 06:08:40.971302 30194 credentials.hpp:37] Loading credentials for authentication from
'/tmp/MasterTest_MultipleExecutors_gPU31L/http_credentials'
I0204 06:08:40.971527 30194 http.cpp:919] Using default 'basic' HTTP authenticator for realm
'mesos-agent-readonly'
I0204 06:08:40.971663 30194 http.cpp:919] Using default 'basic' HTTP authenticator for realm
'mesos-agent-readwrite'
I0204 06:08:40.972157 30170 sched.cpp:232] Version: 1.2.0
I0204 06:08:40.972929 30193 sched.cpp:336] New master detected at master@172.17.0.3:40388
I0204 06:08:40.973021 30193 sched.cpp:407] Authenticating with master master@172.17.0.3:40388
I0204 06:08:40.973037 30193 sched.cpp:414] Using default CRAM-MD5 authenticatee
I0204 06:08:40.972983 30194 slave.cpp:541] Agent resources: cpus(*):2; mem(*):1024; disk(*):1024;
ports(*):[31000-32000]
I0204 06:08:40.973109 30194 slave.cpp:549] Agent attributes: [  ]
I0204 06:08:40.973132 30194 slave.cpp:554] Agent hostname: 8785245fd885
I0204 06:08:40.973299 30197 status_update_manager.cpp:177] Pausing sending status updates
I0204 06:08:40.973352 30195 authenticatee.cpp:121] Creating new client SASL connection
I0204 06:08:40.973668 30196 master.cpp:7103] Authenticating scheduler-b3d2b0a5-3306-4ca2-86e8-10b3257d986b@172.17.0.3:40388
I0204 06:08:40.973799 30192 authenticator.cpp:414] Starting authentication session for crammd5-authenticatee(412)@172.17.0.3:40388
I0204 06:08:40.974019 30195 authenticator.cpp:98] Creating new server SASL connection
I0204 06:08:40.974205 30189 authenticatee.cpp:213] Received SASL authentication mechanisms:
CRAM-MD5
I0204 06:08:40.974239 30189 authenticatee.cpp:239] Attempting to authenticate with mechanism
'CRAM-MD5'
I0204 06:08:40.974370 30190 authenticator.cpp:204] Received SASL authentication start
I0204 06:08:40.974426 30190 authenticator.cpp:326] Authentication requires more steps
I0204 06:08:40.974535 30189 authenticatee.cpp:259] Received SASL authentication step
I0204 06:08:40.974638 30190 authenticator.cpp:232] Received SASL authentication step
I0204 06:08:40.974675 30190 auxprop.cpp:109] Request to lookup properties for user: 'test-principal'
realm: '8785245fd885' server FQDN: '8785245fd885' SASL_AUXPROP_VERIFY_AGAINST_HASH: false
SASL_AUXPROP_OVERRIDE: false SASL_AUXPROP_AUTHZID: false 
I0204 06:08:40.974699 30190 auxprop.cpp:181] Looking up auxiliary property '*userPassword'
I0204 06:08:40.974745 30190 auxprop.cpp:181] Looking up auxiliary property '*cmusaslsecretCRAM-MD5'
I0204 06:08:40.974783 30190 auxprop.cpp:109] Request to lookup properties for user: 'test-principal'
realm: '8785245fd885' server FQDN: '8785245fd885' SASL_AUXPROP_VERIFY_AGAINST_HASH: false
SASL_AUXPROP_OVERRIDE: false SASL_AUXPROP_AUTHZID: true 
I0204 06:08:40.974783 30203 state.cpp:60] Recovering state from '/tmp/MasterTest_MultipleExecutors_wpNoap/meta'
I0204 06:08:40.974807 30190 auxprop.cpp:131] Skipping auxiliary property '*userPassword' since
SASL_AUXPROP_AUTHZID == true
I0204 06:08:40.974820 30190 auxprop.cpp:131] Skipping auxiliary property '*cmusaslsecretCRAM-MD5'
since SASL_AUXPROP_AUTHZID == true
I0204 06:08:40.974843 30190 authenticator.cpp:318] Authentication success
I0204 06:08:40.974917 30196 authenticatee.cpp:299] Authentication success
I0204 06:08:40.974983 30197 master.cpp:7133] Successfully authenticated principal 'test-principal'
at scheduler-b3d2b0a5-3306-4ca2-86e8-10b3257d986b@172.17.0.3:40388
I0204 06:08:40.975049 30196 authenticator.cpp:432] Authentication session cleanup for crammd5-authenticatee(412)@172.17.0.3:40388
I0204 06:08:40.975085 30194 status_update_manager.cpp:203] Recovering status update manager
I0204 06:08:40.975288 30199 sched.cpp:513] Successfully authenticated with master master@172.17.0.3:40388
I0204 06:08:40.975313 30199 sched.cpp:836] Sending SUBSCRIBE call to master@172.17.0.3:40388
I0204 06:08:40.975417 30199 sched.cpp:869] Will retry registration in 1.246457807secs if necessary
I0204 06:08:40.975590 30201 master.cpp:2736] Received SUBSCRIBE call for framework 'default'
at scheduler-b3d2b0a5-3306-4ca2-86e8-10b3257d986b@172.17.0.3:40388
I0204 06:08:40.975600 30202 slave.cpp:5499] Finished recovery
I0204 06:08:40.975646 30201 master.cpp:2159] Authorizing framework principal 'test-principal'
to receive offers for role '*'
I0204 06:08:40.976142 30199 master.cpp:2812] Subscribing framework default with checkpointing
disabled and capabilities [  ]
I0204 06:08:40.976151 30202 slave.cpp:5673] Querying resource estimator for oversubscribable
resources
I0204 06:08:40.976423 30202 slave.cpp:931] New master detected at master@172.17.0.3:40388
I0204 06:08:40.976495 30204 status_update_manager.cpp:177] Pausing sending status updates
I0204 06:08:40.976550 30202 slave.cpp:966] Detecting new master
I0204 06:08:40.976822 30194 hierarchical.cpp:286] Added framework ea2e9268-fc32-4d89-ad22-f7c0e07d8c40-0000
I0204 06:08:40.976845 30202 slave.cpp:5687] Received oversubscribable resources {} from the
resource estimator
I0204 06:08:40.976949 30201 sched.cpp:759] Framework registered with ea2e9268-fc32-4d89-ad22-f7c0e07d8c40-0000
I0204 06:08:40.977010 30201 sched.cpp:773] Scheduler::registered took 28067ns
I0204 06:08:40.977015 30194 hierarchical.cpp:1802] No allocations performed
I0204 06:08:40.977075 30194 hierarchical.cpp:1892] No inverse offers to send out!
I0204 06:08:40.977155 30194 hierarchical.cpp:1404] Performed allocation for 0 agents in 228937ns
I0204 06:08:40.982908 30193 slave.cpp:993] Authenticating with master master@172.17.0.3:40388
I0204 06:08:40.983000 30193 slave.cpp:1004] Using default CRAM-MD5 authenticatee
I0204 06:08:40.983247 30203 authenticatee.cpp:121] Creating new client SASL connection
I0204 06:08:40.983521 30195 master.cpp:7103] Authenticating slave(180)@172.17.0.3:40388
I0204 06:08:40.983641 30193 authenticator.cpp:414] Starting authentication session for crammd5-authenticatee(413)@172.17.0.3:40388
I0204 06:08:40.983875 30194 authenticator.cpp:98] Creating new server SASL connection
I0204 06:08:40.984133 30200 authenticatee.cpp:213] Received SASL authentication mechanisms:
CRAM-MD5
I0204 06:08:40.984179 30200 authenticatee.cpp:239] Attempting to authenticate with mechanism
'CRAM-MD5'
I0204 06:08:40.984302 30192 authenticator.cpp:204] Received SASL authentication start
I0204 06:08:40.984369 30192 authenticator.cpp:326] Authentication requires more steps
I0204 06:08:40.984482 30200 authenticatee.cpp:259] Received SASL authentication step
I0204 06:08:40.984653 30189 authenticator.cpp:232] Received SASL authentication step
I0204 06:08:40.984702 30189 auxprop.cpp:109] Request to lookup properties for user: 'test-principal'
realm: '8785245fd885' server FQDN: '8785245fd885' SASL_AUXPROP_VERIFY_AGAINST_HASH: false
SASL_AUXPROP_OVERRIDE: false SASL_AUXPROP_AUTHZID: false 
I0204 06:08:40.984733 30189 auxprop.cpp:181] Looking up auxiliary property '*userPassword'
I0204 06:08:40.984789 30189 auxprop.cpp:181] Looking up auxiliary property '*cmusaslsecretCRAM-MD5'
I0204 06:08:40.984841 30189 auxprop.cpp:109] Request to lookup properties for user: 'test-principal'
realm: '8785245fd885' server FQDN: '8785245fd885' SASL_AUXPROP_VERIFY_AGAINST_HASH: false
SASL_AUXPROP_OVERRIDE: false SASL_AUXPROP_AUTHZID: true 
I0204 06:08:40.984871 30189 auxprop.cpp:131] Skipping auxiliary property '*userPassword' since
SASL_AUXPROP_AUTHZID == true
I0204 06:08:40.984894 30189 auxprop.cpp:131] Skipping auxiliary property '*cmusaslsecretCRAM-MD5'
since SASL_AUXPROP_AUTHZID == true
I0204 06:08:40.984927 30189 authenticator.cpp:318] Authentication success
I0204 06:08:40.985055 30198 authenticatee.cpp:299] Authentication success
I0204 06:08:40.985083 30195 master.cpp:7133] Successfully authenticated principal 'test-principal'
at slave(180)@172.17.0.3:40388
I0204 06:08:40.985146 30197 authenticator.cpp:432] Authentication session cleanup for crammd5-authenticatee(413)@172.17.0.3:40388
I0204 06:08:40.985512 30201 slave.cpp:1088] Successfully authenticated with master master@172.17.0.3:40388
I0204 06:08:40.985723 30201 slave.cpp:1515] Will retry registration in 17.948669ms if necessary
I0204 06:08:40.985975 30191 master.cpp:5318] Registering agent at slave(180)@172.17.0.3:40388
(8785245fd885) with id ea2e9268-fc32-4d89-ad22-f7c0e07d8c40-S0
I0204 06:08:40.986536 30198 registrar.cpp:461] Applied 1 operations in 70322ns; attempting
to update the registry
I0204 06:08:40.988688 30198 registrar.cpp:506] Successfully updated the registry in 2.06592ms
I0204 06:08:40.989590 30198 slave.cpp:4301] Received ping from slave-observer(177)@172.17.0.3:40388
I0204 06:08:40.989850 30189 slave.cpp:1134] Registered with master master@172.17.0.3:40388;
given agent ID ea2e9268-fc32-4d89-ad22-f7c0e07d8c40-S0
I0204 06:08:40.989914 30189 fetcher.cpp:90] Clearing fetcher cache
I0204 06:08:40.989780 30194 master.cpp:5392] Registered agent ea2e9268-fc32-4d89-ad22-f7c0e07d8c40-S0
at slave(180)@172.17.0.3:40388 (8785245fd885) with cpus(*):2; mem(*):1024; disk(*):1024; ports(*):[31000-32000]
I0204 06:08:40.990080 30195 status_update_manager.cpp:184] Resuming sending status updates
I0204 06:08:40.990103 30190 hierarchical.cpp:515] Added agent ea2e9268-fc32-4d89-ad22-f7c0e07d8c40-S0
(8785245fd885) with cpus(*):2; mem(*):1024; disk(*):1024; ports(*):[31000-32000] (allocated:
{})
I0204 06:08:40.990341 30189 slave.cpp:1162] Checkpointing SlaveInfo to '/tmp/MasterTest_MultipleExecutors_wpNoap/meta/slaves/ea2e9268-fc32-4d89-ad22-f7c0e07d8c40-S0/slave.info'
I0204 06:08:40.990752 30189 slave.cpp:1200] Forwarding total oversubscribed resources {}
I0204 06:08:40.990936 30189 master.cpp:5949] Received update of agent ea2e9268-fc32-4d89-ad22-f7c0e07d8c40-S0
at slave(180)@172.17.0.3:40388 (8785245fd885) with total oversubscribed resources {}
I0204 06:08:40.991531 30190 hierarchical.cpp:1892] No inverse offers to send out!
I0204 06:08:40.991600 30190 hierarchical.cpp:1404] Performed allocation for 1 agents in 1.359261ms
I0204 06:08:40.991744 30190 hierarchical.cpp:588] Agent ea2e9268-fc32-4d89-ad22-f7c0e07d8c40-S0
(8785245fd885) updated with oversubscribed resources {} (total: cpus(*):2; mem(*):1024; disk(*):1024;
ports(*):[31000-32000], allocated: cpus(*)(allocated: *):2; mem(*)(allocated: *):1024; disk(*)(allocated:
*):1024; ports(*)(allocated: *):[31000-32000])
I0204 06:08:40.991955 30190 hierarchical.cpp:1802] No allocations performed
I0204 06:08:40.992002 30190 hierarchical.cpp:1892] No inverse offers to send out!
I0204 06:08:40.992048 30190 hierarchical.cpp:1404] Performed allocation for 1 agents in 180390ns
I0204 06:08:40.992066 30203 master.cpp:6932] Sending 1 offers to framework ea2e9268-fc32-4d89-ad22-f7c0e07d8c40-0000
(default) at scheduler-b3d2b0a5-3306-4ca2-86e8-10b3257d986b@172.17.0.3:40388
I0204 06:08:40.992671 30203 sched.cpp:933] Scheduler::resourceOffers took 172170ns
I0204 06:08:40.995134 30202 master.cpp:3745] Processing ACCEPT call for offers: [ ea2e9268-fc32-4d89-ad22-f7c0e07d8c40-O0
] on agent ea2e9268-fc32-4d89-ad22-f7c0e07d8c40-S0 at slave(180)@172.17.0.3:40388 (8785245fd885)
for framework ea2e9268-fc32-4d89-ad22-f7c0e07d8c40-0000 (default) at scheduler-b3d2b0a5-3306-4ca2-86e8-10b3257d986b@172.17.0.3:40388
I0204 06:08:40.995249 30202 master.cpp:3318] Authorizing framework principal 'test-principal'
to launch task 1
I0204 06:08:40.995544 30202 master.cpp:3318] Authorizing framework principal 'test-principal'
to launch task 2
W0204 06:08:40.997453 30189 validation.cpp:1048] Executor 'executor-1' for task '1' uses less
CPUs (None) than the minimum required (0.01). Please update your executor, as this will be
mandatory in future releases.
W0204 06:08:40.997488 30189 validation.cpp:1060] Executor 'executor-1' for task '1' uses less
memory (None) than the minimum required (32MB). Please update your executor, as this will
be mandatory in future releases.
I0204 06:08:40.997834 30189 master.cpp:8993] Adding task 1 with resources cpus(*)(allocated:
*):1; mem(*)(allocated: *):512 on agent ea2e9268-fc32-4d89-ad22-f7c0e07d8c40-S0 at slave(180)@172.17.0.3:40388
(8785245fd885)
I0204 06:08:40.997994 30189 master.cpp:4395] Launching task 1 of framework ea2e9268-fc32-4d89-ad22-f7c0e07d8c40-0000
(default) at scheduler-b3d2b0a5-3306-4ca2-86e8-10b3257d986b@172.17.0.3:40388 with resources
cpus(*)(allocated: *):1; mem(*)(allocated: *):512 on agent ea2e9268-fc32-4d89-ad22-f7c0e07d8c40-S0
at slave(180)@172.17.0.3:40388 (8785245fd885)
I0204 06:08:40.998427 30203 slave.cpp:1583] Got assigned task '1' for framework ea2e9268-fc32-4d89-ad22-f7c0e07d8c40-0000
W0204 06:08:40.998996 30189 validation.cpp:1048] Executor 'executor-2' for task '2' uses less
CPUs (None) than the minimum required (0.01). Please update your executor, as this will be
mandatory in future releases.
W0204 06:08:40.999024 30189 validation.cpp:1060] Executor 'executor-2' for task '2' uses less
memory (None) than the minimum required (32MB). Please update your executor, as this will
be mandatory in future releases.
I0204 06:08:40.999143 30203 slave.cpp:1743] Launching task '1' for framework ea2e9268-fc32-4d89-ad22-f7c0e07d8c40-0000
I0204 06:08:40.999372 30189 master.cpp:8993] Adding task 2 with resources cpus(*)(allocated:
*):1; mem(*)(allocated: *):512 on agent ea2e9268-fc32-4d89-ad22-f7c0e07d8c40-S0 at slave(180)@172.17.0.3:40388
(8785245fd885)
I0204 06:08:40.999562 30189 master.cpp:4395] Launching task 2 of framework ea2e9268-fc32-4d89-ad22-f7c0e07d8c40-0000
(default) at scheduler-b3d2b0a5-3306-4ca2-86e8-10b3257d986b@172.17.0.3:40388 with resources
cpus(*)(allocated: *):1; mem(*)(allocated: *):512 on agent ea2e9268-fc32-4d89-ad22-f7c0e07d8c40-S0
at slave(180)@172.17.0.3:40388 (8785245fd885)
I0204 06:08:40.999889 30203 paths.cpp:547] Trying to chown '/tmp/MasterTest_MultipleExecutors_wpNoap/slaves/ea2e9268-fc32-4d89-ad22-f7c0e07d8c40-S0/frameworks/ea2e9268-fc32-4d89-ad22-f7c0e07d8c40-0000/executors/executor-1/runs/babdd5a1-1cd8-4c45-833f-382fd455230d'
to user 'mesos'
I0204 06:08:41.000188 30203 slave.cpp:6414] Launching executor 'executor-1' of framework ea2e9268-fc32-4d89-ad22-f7c0e07d8c40-0000
with resources {} in work directory '/tmp/MasterTest_MultipleExecutors_wpNoap/slaves/ea2e9268-fc32-4d89-ad22-f7c0e07d8c40-S0/frameworks/ea2e9268-fc32-4d89-ad22-f7c0e07d8c40-0000/executors/executor-1/runs/babdd5a1-1cd8-4c45-833f-382fd455230d'
I0204 06:08:41.000871 30203 slave.cpp:2073] Queued task '1' for executor 'executor-1' of framework
ea2e9268-fc32-4d89-ad22-f7c0e07d8c40-0000
I0204 06:08:41.001096 30203 slave.cpp:1583] Got assigned task '2' for framework ea2e9268-fc32-4d89-ad22-f7c0e07d8c40-0000
I0204 06:08:41.001129 30200 hierarchical.cpp:1082] Recovered ports(*)(allocated: *):[31000-32000];
disk(*)(allocated: *):1024 (total: cpus(*):2; mem(*):1024; disk(*):1024; ports(*):[31000-32000],
allocated: cpus(*)(allocated: *):2; mem(*)(allocated: *):1024) on agent ea2e9268-fc32-4d89-ad22-f7c0e07d8c40-S0
from framework ea2e9268-fc32-4d89-ad22-f7c0e07d8c40-0000
I0204 06:08:41.001209 30200 hierarchical.cpp:1119] Framework ea2e9268-fc32-4d89-ad22-f7c0e07d8c40-0000
filtered agent ea2e9268-fc32-4d89-ad22-f7c0e07d8c40-S0 for 5secs
I0204 06:08:41.001616 30203 slave.cpp:884] Successfully attached file '/tmp/MasterTest_MultipleExecutors_wpNoap/slaves/ea2e9268-fc32-4d89-ad22-f7c0e07d8c40-S0/frameworks/ea2e9268-fc32-4d89-ad22-f7c0e07d8c40-0000/executors/executor-1/runs/babdd5a1-1cd8-4c45-833f-382fd455230d'
I0204 06:08:41.001701 30203 slave.cpp:1743] Launching task '2' for framework ea2e9268-fc32-4d89-ad22-f7c0e07d8c40-0000
I0204 06:08:41.002221 30203 paths.cpp:547] Trying to chown '/tmp/MasterTest_MultipleExecutors_wpNoap/slaves/ea2e9268-fc32-4d89-ad22-f7c0e07d8c40-S0/frameworks/ea2e9268-fc32-4d89-ad22-f7c0e07d8c40-0000/executors/executor-2/runs/4b376af6-99b5-47c9-bd63-dce30fb92099'
to user 'mesos'
I0204 06:08:41.002456 30203 slave.cpp:6414] Launching executor 'executor-2' of framework ea2e9268-fc32-4d89-ad22-f7c0e07d8c40-0000
with resources {} in work directory '/tmp/MasterTest_MultipleExecutors_wpNoap/slaves/ea2e9268-fc32-4d89-ad22-f7c0e07d8c40-S0/frameworks/ea2e9268-fc32-4d89-ad22-f7c0e07d8c40-0000/executors/executor-2/runs/4b376af6-99b5-47c9-bd63-dce30fb92099'
*** Aborted at 1486188521 (unix time) try "date -d @1486188521" if you are using GNU date
***
PC: @     0x2b167e4c182d (unknown)
I0204 06:08:41.003104 30195 exec.cpp:162] Version: 1.2.0
*** SIGSEGV (@0x31) received by PID 30170 (TID 0x2b16882fe700) from PID 49; stack trace: ***
I0204 06:08:41.003402 30196 exec.cpp:212] Executor started at: executor(75)@172.17.0.3:40388
with pid 30170
    @     0x2b16d47d9197 (unknown)
    @     0x2b16d47dd479 (unknown)
    @     0x2b167e278330 (unknown)
    @     0x2b167e4c182d (unknown)
    @     0x2b16742cc7f6 os::getenv()
    @     0x2b167b266c55 mesos::internal::slave::executorEnvironment()
    @     0x2b167b261856 mesos::internal::slave::Framework::launchExecutor()
    @     0x2b167b23bc2a mesos::internal::slave::Slave::_run()
    @     0x2b167b2950d3 _ZZN7process8dispatchIN5mesos8internal5slave5SlaveERKNS_6FutureIbEERKNS1_13FrameworkInfoERKNS1_12ExecutorInfoERK6OptionINS1_8TaskInfoEERKSF_INS1_13TaskGroupInfoEES6_S9_SC_SH_SL_EEvRKNS_3PIDIT_EEMSP_FvT0_T1_T2_T3_T4_ET5_T6_T7_T8_T9_ENKUlPNS_11ProcessBaseEE_clES16_
    @     0x2b167b2c9db1 _ZNSt17_Function_handlerIFvPN7process11ProcessBaseEEZNS0_8dispatchIN5mesos8internal5slave5SlaveERKNS0_6FutureIbEERKNS5_13FrameworkInfoERKNS5_12ExecutorInfoERK6OptionINS5_8TaskInfoEERKSJ_INS5_13TaskGroupInfoEESA_SD_SG_SL_SP_EEvRKNS0_3PIDIT_EEMST_FvT0_T1_T2_T3_T4_ET5_T6_T7_T8_T9_EUlS2_E_E9_M_invokeERKSt9_Any_dataS2_
    @     0x2b167bfde92f std::function<>::operator()()
    @     0x2b167bfc4731 process::ProcessBase::visit()
    @     0x2b167bfcefb0 process::DispatchEvent::visit()
    @     0x2b16742a0b3c process::ProcessBase::serve()
    @     0x2b167bfc0a1e process::ProcessManager::resume()
    @     0x2b167bfbd262 _ZZN7process14ProcessManager12init_threadsEvENKUt_clEv
    @     0x2b167bfce6ea _ZNSt12_Bind_simpleIFZN7process14ProcessManager12init_threadsEvEUt_vEE9_M_invokeIIEEEvSt12_Index_tupleIIXspT_EEE
    @     0x2b167bfce641 _ZNSt12_Bind_simpleIFZN7process14ProcessManager12init_threadsEvEUt_vEEclEv
    @     0x2b167bfce5da _ZNSt6thread5_ImplISt12_Bind_simpleIFZN7process14ProcessManager12init_threadsEvEUt_vEEE6_M_runEv
    @     0x2b167daf9a60 (unknown)
    @     0x2b167e270184 start_thread
    @     0x2b167e58037d (unknown)
make[4]: *** [check-local] Segmentation fault
make[4]: Leaving directory `/mesos/mesos-1.2.0/_build/src'
make[3]: *** [check-am] Error 2
make[3]: Leaving directory `/mesos/mesos-1.2.0/_build/src'
make[2]: *** [check] Error 2
make[2]: Leaving directory `/mesos/mesos-1.2.0/_build/src'
make[1]: *** [check-recursive] Error 1
make[1]: Leaving directory `/mesos/mesos-1.2.0/_build'
make: *** [distcheck] Error 1
+ docker rmi mesos-1486185811-7821
Untagged: mesos-1486185811-7821:latest
Deleted: sha256:5d55c3974ca061a76233969d8576a0d133a092e68f5a8143e607ec7d2b978307
Deleted: sha256:96e40c837f4760aaac3bd3393ffe49847ceebdba9cf765fdcd4225af4c2082b8
Deleted: sha256:0dc8f456ad5aeb72a72e07600d2e84e67483df0e802f80368dcbd60b56cc76d2
Deleted: sha256:8dc7a6264f0743a9e21c4955b5847374e9e64565a146f5a2308a4bd4c0ee2d77
Deleted: sha256:d37a6c75d9a75cb8571a298d452c1efcb9e8463e8d1c4eef51aa54b26d4bbc09
Deleted: sha256:1f70f9875499529bd5ea73263a8c2556ba3351ecd14afa09578e7ff8c2f1a4b3
Deleted: sha256:5e58d24f48bfbf902af86e2d20abc3e024d4a56a746db11d339326a22fbee34e
Deleted: sha256:9cc72f3d512f0a93ad3e2274aa3431e880430a22ed77fd0b2919f5963c99c828
Deleted: sha256:0f242d0bfad53abaf0381a17407774b81e4cb46c26d65cc91b419e3870ba568f
Deleted: sha256:1095cbdba79b8a98f316149b2077bb4e59fa6af062e7a6cba5c8a2be7757ca35
Deleted: sha256:abdcb23e211f71b2bdfdb6a050898cd447b7520cb600afc647ce2d205ce1b52a
Deleted: sha256:8cba112a347f74ce8471dda46143bc9617fb884ee8dba80324a681c406ec9bd9
Deleted: sha256:8e7eac52442ebc25faa11fed42a0e8506ee656d746724168c62d720df438e790
Deleted: sha256:99eb941f954dce990e91c3777c00f5afa0b2b74bf6a2a04be6b68b555743442f
Deleted: sha256:51dd6d46d44ae0cbb87c33b7698d01faad2d147f2d1ae4efd9a3b01642526ee2
Deleted: sha256:0e00ccff975f9966eb8303e141acdfb165ed7d743c7e4e0c7a4b3b80e2bc4eaa
Deleted: sha256:70bb98398c3fe41bce94e960b2819963c2d492c84bfc7857aefa62ecae7a1c45
Deleted: sha256:1be643d4fdd025921933894bfc1bb5230b3135256d20013e3acba9ccc6ebd32a
Deleted: sha256:a9d7188386c0e5afb3e19c9892cab02d112d4ad0ad2bf1e2e70acddd8399e0b5
Deleted: sha256:969d79eb7153c07003ca3df2ced3537fb0e914326577fd75130ef927888c164e
Deleted: sha256:e1e3562388d2714a04e980fdd2e554dce8e0a37d4da7b4e37801cd3d506ba2a2
Deleted: sha256:4cf43b87913b4f3f2ed0783739b20d2d2a7efc6143d8ce6b711d4997a9e9084b
Deleted: sha256:a9356e6465678f9719b0c811beffcb7b92619060048a7fbac3149f9695b835eb
Deleted: sha256:374552fb22187bda4b077ffb221ec55a2e7f8326ec09729ee2431d7fec395669
Build step 'Execute shell' marked build as failure

Mime
View raw message