mesos-builds mailing list archives

Site index · List index
Message view « Date » · « Thread »
Top « Date » · « Thread »
From Apache Jenkins Server <jenk...@builds.apache.org>
Subject Build failed in Jenkins: Mesos-Buildbot » cmake,clang,--verbose,GLOG_v=1 MESOS_VERBOSE=1,ubuntu:14.04,(docker||Hadoop)&&(!ubuntu-us1)&&(!ubuntu-eu2) #3289
Date Tue, 21 Feb 2017 05:04:43 GMT
See <https://builds.apache.org/job/Mesos-Buildbot/BUILDTOOL=cmake,COMPILER=clang,CONFIGURATION=--verbose,ENVIRONMENT=GLOG_v=1%20MESOS_VERBOSE=1,OS=ubuntu%3A14.04,label_exp=(docker%7C%7CHadoop)&&(!ubuntu-us1)&&(!ubuntu-eu2)/3289/display/redirect?page=changes>

Changes:

[anand] Modified the executor driver to always relink on agent failover.

------------------------------------------
[...truncated 23.69 MB...]
I0221 05:04:36.637679 24866 status_update_manager.cpp:177] Pausing sending status updates
I0221 05:04:36.638097 24862 state.cpp:62] Recovering state from '/tmp/Endpoint_SlaveEndpointTest_AuthorizedRequest_1_3W14VP/meta'
I0221 05:04:36.638279 24856 status_update_manager.cpp:203] Recovering status update manager
I0221 05:04:36.638391 24856 containerizer.cpp:599] Recovering containerizer
I0221 05:04:36.638973 24862 provisioner.cpp:410] Provisioner recovery complete
I0221 05:04:36.639226 24866 slave.cpp:5558] Finished recovery
I0221 05:04:36.639665 24866 slave.cpp:5732] Querying resource estimator for oversubscribable
resources
I0221 05:04:36.639868 24863 slave.cpp:5746] Received oversubscribable resources {} from the
resource estimator
I0221 05:04:36.640645 24863 process.cpp:3704] Handling HTTP event for process 'slave(693)'
with path: '/slave(693)/monitor/statistics.json'
I0221 05:04:36.641254 24866 http.cpp:871] Authorizing principal 'test-principal' to GET the
'/monitor/statistics.json' endpoint
I0221 05:04:36.643049 24858 slave.cpp:803] Agent terminating
[       OK ] Endpoint/SlaveEndpointTest.AuthorizedRequest/1 (15 ms)
[ RUN      ] Endpoint/SlaveEndpointTest.AuthorizedRequest/2
I0221 05:04:36.658138 24852 containerizer.cpp:220] Using isolation: posix/cpu,posix/mem,filesystem/posix,network/cni
W0221 05:04:36.658474 24852 backend.cpp:76] Failed to create 'aufs' backend: AufsBackend requires
root privileges
W0221 05:04:36.658519 24852 backend.cpp:76] Failed to create 'bind' backend: BindBackend requires
root privileges
I0221 05:04:36.658537 24852 provisioner.cpp:249] Using default backend 'copy'
I0221 05:04:36.660017 24863 slave.cpp:211] Mesos agent started on (694)@172.17.0.3:57291
I0221 05:04:36.660054 24863 slave.cpp:212] Flags at startup: --acls="" --appc_simple_discovery_uri_prefix="http://"
--appc_store_dir="/tmp/mesos/store/appc" --authenticate_http_readonly="true" --authenticate_http_readwrite="true"
--authenticatee="crammd5" --authentication_backoff_factor="1secs" --authorizer="local" --cgroups_cpu_enable_pids_and_tids_count="false"
--cgroups_enable_cfs="false" --cgroups_hierarchy="/sys/fs/cgroup" --cgroups_limit_swap="false"
--cgroups_root="mesos" --container_disk_watch_interval="15secs" --containerizers="mesos" --credential="/tmp/Endpoint_SlaveEndpointTest_AuthorizedRequest_2_bQbjs2/credential"
--default_role="*" --disk_watch_interval="1mins" --docker="docker" --docker_kill_orphans="true"
--docker_registry="https://registry-1.docker.io" --docker_remove_delay="6hrs" --docker_socket="/var/run/docker.sock"
--docker_stop_timeout="0ns" --docker_store_dir="/tmp/mesos/store/docker" --docker_volume_checkpoint_dir="/var/run/mesos/isolators/docker/volume"
--enforce_container_disk_quota="false" --executor_registration_timeout="1mins" --executor_shutdown_grace_period="5secs"
--fetcher_cache_dir="/tmp/Endpoint_SlaveEndpointTest_AuthorizedRequest_2_bQbjs2/fetch" --fetcher_cache_size="2GB"
--frameworks_home="" --gc_delay="1weeks" --gc_disk_headroom="0.1" --hadoop_home="" --help="false"
--hostname_lookup="true" --http_authenticators="basic" --http_command_executor="false" --http_credentials="/tmp/Endpoint_SlaveEndpointTest_AuthorizedRequest_2_bQbjs2/http_credentials"
--http_heartbeat_interval="30secs" --initialize_driver_logging="true" --isolation="posix/cpu,posix/mem"
--launcher="posix" --launcher_dir="/mesos/build/src" --logbufsecs="0" --logging_level="INFO"
--max_completed_executors_per_framework="150" --oversubscribed_resources_interval="15secs"
--perf_duration="10secs" --perf_interval="1mins" --qos_correction_interval_min="0ns" --quiet="false"
--recover="reconnect" --recovery_timeout="15mins" --registration_backoff_factor="10ms" --resources="cpus:2;gpus:0;mem:1024;disk:1024;ports:[31000-32000]"
--revocable_cpu_low_priority="true" --runtime_dir="/tmp/Endpoint_SlaveEndpointTest_AuthorizedRequest_2_bQbjs2"
--sandbox_directory="/mnt/mesos/sandbox" --strict="true" --switch_user="true" --systemd_enable_support="true"
--systemd_runtime_directory="/run/systemd/system" --version="false" --work_dir="/tmp/Endpoint_SlaveEndpointTest_AuthorizedRequest_2_FQzHVZ"
I0221 05:04:36.660490 24863 credentials.hpp:86] Loading credential for authentication from
'/tmp/Endpoint_SlaveEndpointTest_AuthorizedRequest_2_bQbjs2/credential'
I0221 05:04:36.660642 24863 slave.cpp:354] Agent using credential for: test-principal
I0221 05:04:36.660660 24863 credentials.hpp:37] Loading credentials for authentication from
'/tmp/Endpoint_SlaveEndpointTest_AuthorizedRequest_2_bQbjs2/http_credentials'
I0221 05:04:36.660785 24863 http.cpp:919] Using default 'basic' HTTP authenticator for realm
'mesos-agent-readonly'
I0221 05:04:36.660851 24863 http.cpp:919] Using default 'basic' HTTP authenticator for realm
'mesos-agent-readwrite'
I0221 05:04:36.661397 24863 slave.cpp:541] Agent resources: cpus(*):2; mem(*):1024; disk(*):1024;
ports(*):[31000-32000]
I0221 05:04:36.661437 24863 slave.cpp:549] Agent attributes: [  ]
I0221 05:04:36.661448 24863 slave.cpp:554] Agent hostname: 575f6d4d4e05
I0221 05:04:36.661525 24853 status_update_manager.cpp:177] Pausing sending status updates
I0221 05:04:36.661931 24857 state.cpp:62] Recovering state from '/tmp/Endpoint_SlaveEndpointTest_AuthorizedRequest_2_FQzHVZ/meta'
I0221 05:04:36.662123 24855 status_update_manager.cpp:203] Recovering status update manager
I0221 05:04:36.662284 24855 containerizer.cpp:599] Recovering containerizer
I0221 05:04:36.662984 24867 provisioner.cpp:410] Provisioner recovery complete
I0221 05:04:36.663281 24864 slave.cpp:5558] Finished recovery
I0221 05:04:36.663691 24864 slave.cpp:5732] Querying resource estimator for oversubscribable
resources
I0221 05:04:36.663848 24853 slave.cpp:5746] Received oversubscribable resources {} from the
resource estimator
I0221 05:04:36.664630 24855 process.cpp:3704] Handling HTTP event for process 'slave(694)'
with path: '/slave(694)/containers'
I0221 05:04:36.665168 24853 http.cpp:871] Authorizing principal 'test-principal' to GET the
'/containers' endpoint
I0221 05:04:36.667013 24857 slave.cpp:803] Agent terminating
[       OK ] Endpoint/SlaveEndpointTest.AuthorizedRequest/2 (15 ms)
[ RUN      ] Endpoint/SlaveEndpointTest.UnauthorizedRequest/0
I0221 05:04:36.704232 24852 containerizer.cpp:220] Using isolation: posix/cpu,posix/mem,filesystem/posix,network/cni
W0221 05:04:36.704464 24852 backend.cpp:76] Failed to create 'aufs' backend: AufsBackend requires
root privileges
W0221 05:04:36.704499 24852 backend.cpp:76] Failed to create 'bind' backend: BindBackend requires
root privileges
I0221 05:04:36.704510 24852 provisioner.cpp:249] Using default backend 'copy'
I0221 05:04:36.705931 24866 slave.cpp:211] Mesos agent started on (695)@172.17.0.3:57291
I0221 05:04:36.705961 24866 slave.cpp:212] Flags at startup: --acls="" --appc_simple_discovery_uri_prefix="http://"
--appc_store_dir="/tmp/mesos/store/appc" --authenticate_http_readonly="true" --authenticate_http_readwrite="true"
--authenticatee="crammd5" --authentication_backoff_factor="1secs" --authorizer="local" --cgroups_cpu_enable_pids_and_tids_count="false"
--cgroups_enable_cfs="false" --cgroups_hierarchy="/sys/fs/cgroup" --cgroups_limit_swap="false"
--cgroups_root="mesos" --container_disk_watch_interval="15secs" --containerizers="mesos" --credential="/tmp/Endpoint_SlaveEndpointTest_UnauthorizedRequest_0_o7p8Vc/credential"
--default_role="*" --disk_watch_interval="1mins" --docker="docker" --docker_kill_orphans="true"
--docker_registry="https://registry-1.docker.io" --docker_remove_delay="6hrs" --docker_socket="/var/run/docker.sock"
--docker_stop_timeout="0ns" --docker_store_dir="/tmp/mesos/store/docker" --docker_volume_checkpoint_dir="/var/run/mesos/isolators/docker/volume"
--enforce_container_disk_quota="false" --executor_registration_timeout="1mins" --executor_shutdown_grace_period="5secs"
--fetcher_cache_dir="/tmp/Endpoint_SlaveEndpointTest_UnauthorizedRequest_0_o7p8Vc/fetch" --fetcher_cache_size="2GB"
--frameworks_home="" --gc_delay="1weeks" --gc_disk_headroom="0.1" --hadoop_home="" --help="false"
--hostname_lookup="true" --http_authenticators="basic" --http_command_executor="false" --http_credentials="/tmp/Endpoint_SlaveEndpointTest_UnauthorizedRequest_0_o7p8Vc/http_credentials"
--http_heartbeat_interval="30secs" --initialize_driver_logging="true" --isolation="posix/cpu,posix/mem"
--launcher="posix" --launcher_dir="/mesos/build/src" --logbufsecs="0" --logging_level="INFO"
--max_completed_executors_per_framework="150" --oversubscribed_resources_interval="15secs"
--perf_duration="10secs" --perf_interval="1mins" --qos_correction_interval_min="0ns" --quiet="false"
--recover="reconnect" --recovery_timeout="15mins" --registration_backoff_factor="10ms" --resources="cpus:2;gpus:0;mem:1024;disk:1024;ports:[31000-32000]"
--revocable_cpu_low_priority="true" --runtime_dir="/tmp/Endpoint_SlaveEndpointTest_UnauthorizedRequest_0_o7p8Vc"
--sandbox_directory="/mnt/mesos/sandbox" --strict="true" --switch_user="true" --systemd_enable_support="true"
--systemd_runtime_directory="/run/systemd/system" --version="false" --work_dir="/tmp/Endpoint_SlaveEndpointTest_UnauthorizedRequest_0_sd01ha"
I0221 05:04:36.706468 24866 credentials.hpp:86] Loading credential for authentication from
'/tmp/Endpoint_SlaveEndpointTest_UnauthorizedRequest_0_o7p8Vc/credential'
I0221 05:04:36.706588 24866 slave.cpp:354] Agent using credential for: test-principal
I0221 05:04:36.706609 24866 credentials.hpp:37] Loading credentials for authentication from
'/tmp/Endpoint_SlaveEndpointTest_UnauthorizedRequest_0_o7p8Vc/http_credentials'
I0221 05:04:36.706764 24866 http.cpp:919] Using default 'basic' HTTP authenticator for realm
'mesos-agent-readonly'
I0221 05:04:36.706816 24866 http.cpp:919] Using default 'basic' HTTP authenticator for realm
'mesos-agent-readwrite'
I0221 05:04:36.707233 24866 slave.cpp:541] Agent resources: cpus(*):2; mem(*):1024; disk(*):1024;
ports(*):[31000-32000]
I0221 05:04:36.707274 24866 slave.cpp:549] Agent attributes: [  ]
I0221 05:04:36.707281 24866 slave.cpp:554] Agent hostname: 575f6d4d4e05
I0221 05:04:36.707355 24861 status_update_manager.cpp:177] Pausing sending status updates
I0221 05:04:36.707698 24859 state.cpp:62] Recovering state from '/tmp/Endpoint_SlaveEndpointTest_UnauthorizedRequest_0_sd01ha/meta'
I0221 05:04:36.707890 24861 status_update_manager.cpp:203] Recovering status update manager
I0221 05:04:36.708214 24862 containerizer.cpp:599] Recovering containerizer
I0221 05:04:36.708701 24859 provisioner.cpp:410] Provisioner recovery complete
I0221 05:04:36.708849 24867 slave.cpp:5558] Finished recovery
I0221 05:04:36.709154 24867 slave.cpp:5732] Querying resource estimator for oversubscribable
resources
I0221 05:04:36.709239 24867 slave.cpp:5746] Received oversubscribable resources {} from the
resource estimator
I0221 05:04:36.710170 24859 process.cpp:3704] Handling HTTP event for process 'slave(695)'
with path: '/slave(695)/monitor/statistics'
I0221 05:04:36.710717 24861 http.cpp:871] Authorizing principal 'test-principal' to GET the
'/monitor/statistics' endpoint
I0221 05:04:36.712301 24852 slave.cpp:803] Agent terminating
[       OK ] Endpoint/SlaveEndpointTest.UnauthorizedRequest/0 (14 ms)
[ RUN      ] Endpoint/SlaveEndpointTest.UnauthorizedRequest/1
I0221 05:04:36.722448 24852 containerizer.cpp:220] Using isolation: posix/cpu,posix/mem,filesystem/posix,network/cni
W0221 05:04:36.722771 24852 backend.cpp:76] Failed to create 'aufs' backend: AufsBackend requires
root privileges
W0221 05:04:36.722817 24852 backend.cpp:76] Failed to create 'bind' backend: BindBackend requires
root privileges
I0221 05:04:36.722833 24852 provisioner.cpp:249] Using default backend 'copy'
I0221 05:04:36.724328 24859 slave.cpp:211] Mesos agent started on (696)@172.17.0.3:57291
I0221 05:04:36.724354 24859 slave.cpp:212] Flags at startup: --acls="" --appc_simple_discovery_uri_prefix="http://"
--appc_store_dir="/tmp/mesos/store/appc" --authenticate_http_readonly="true" --authenticate_http_readwrite="true"
--authenticatee="crammd5" --authentication_backoff_factor="1secs" --authorizer="local" --cgroups_cpu_enable_pids_and_tids_count="false"
--cgroups_enable_cfs="false" --cgroups_hierarchy="/sys/fs/cgroup" --cgroups_limit_swap="false"
--cgroups_root="mesos" --container_disk_watch_interval="15secs" --containerizers="mesos" --credential="/tmp/Endpoint_SlaveEndpointTest_UnauthorizedRequest_1_NFfjGn/credential"
--default_role="*" --disk_watch_interval="1mins" --docker="docker" --docker_kill_orphans="true"
--docker_registry="https://registry-1.docker.io" --docker_remove_delay="6hrs" --docker_socket="/var/run/docker.sock"
--docker_stop_timeout="0ns" --docker_store_dir="/tmp/mesos/store/docker" --docker_volume_checkpoint_dir="/var/run/mesos/isolators/docker/volume"
--enforce_container_disk_quota="false" --executor_registration_timeout="1mins" --executor_shutdown_grace_period="5secs"
--fetcher_cache_dir="/tmp/Endpoint_SlaveEndpointTest_UnauthorizedRequest_1_NFfjGn/fetch" --fetcher_cache_size="2GB"
--frameworks_home="" --gc_delay="1weeks" --gc_disk_headroom="0.1" --hadoop_home="" --help="false"
--hostname_lookup="true" --http_authenticators="basic" --http_command_executor="false" --http_credentials="/tmp/Endpoint_SlaveEndpointTest_UnauthorizedRequest_1_NFfjGn/http_credentials"
--http_heartbeat_interval="30secs" --initialize_driver_logging="true" --isolation="posix/cpu,posix/mem"
--launcher="posix" --launcher_dir="/mesos/build/src" --logbufsecs="0" --logging_level="INFO"
--max_completed_executors_per_framework="150" --oversubscribed_resources_interval="15secs"
--perf_duration="10secs" --perf_interval="1mins" --qos_correction_interval_min="0ns" --quiet="false"
--recover="reconnect" --recovery_timeout="15mins" --registration_backoff_factor="10ms" --resources="cpus:2;gpus:0;mem:1024;disk:1024;ports:[31000-32000]"
--revocable_cpu_low_priority="true" --runtime_dir="/tmp/Endpoint_SlaveEndpointTest_UnauthorizedRequest_1_NFfjGn"
--sandbox_directory="/mnt/mesos/sandbox" --strict="true" --switch_user="true" --systemd_enable_support="true"
--systemd_runtime_directory="/run/systemd/system" --version="false" --work_dir="/tmp/Endpoint_SlaveEndpointTest_UnauthorizedRequest_1_nKneZk"
I0221 05:04:36.724740 24859 credentials.hpp:86] Loading credential for authentication from
'/tmp/Endpoint_SlaveEndpointTest_UnauthorizedRequest_1_NFfjGn/credential'
I0221 05:04:36.724828 24859 slave.cpp:354] Agent using credential for: test-principal
I0221 05:04:36.724841 24859 credentials.hpp:37] Loading credentials for authentication from
'/tmp/Endpoint_SlaveEndpointTest_UnauthorizedRequest_1_NFfjGn/http_credentials'
I0221 05:04:36.724944 24859 http.cpp:919] Using default 'basic' HTTP authenticator for realm
'mesos-agent-readonly'
I0221 05:04:36.725011 24859 http.cpp:919] Using default 'basic' HTTP authenticator for realm
'mesos-agent-readwrite'
I0221 05:04:36.725535 24859 slave.cpp:541] Agent resources: cpus(*):2; mem(*):1024; disk(*):1024;
ports(*):[31000-32000]
I0221 05:04:36.725576 24859 slave.cpp:549] Agent attributes: [  ]
I0221 05:04:36.725587 24859 slave.cpp:554] Agent hostname: 575f6d4d4e05
I0221 05:04:36.725649 24858 status_update_manager.cpp:177] Pausing sending status updates
I0221 05:04:36.726045 24856 state.cpp:62] Recovering state from '/tmp/Endpoint_SlaveEndpointTest_UnauthorizedRequest_1_nKneZk/meta'
I0221 05:04:36.726348 24862 status_update_manager.cpp:203] Recovering status update manager
I0221 05:04:36.726482 24855 containerizer.cpp:599] Recovering containerizer
I0221 05:04:36.727021 24858 provisioner.cpp:410] Provisioner recovery complete
I0221 05:04:36.727313 24867 slave.cpp:5558] Finished recovery
I0221 05:04:36.727686 24867 slave.cpp:5732] Querying resource estimator for oversubscribable
resources
I0221 05:04:36.727790 24857 slave.cpp:5746] Received oversubscribable resources {} from the
resource estimator
I0221 05:04:36.728719 24857 process.cpp:3704] Handling HTTP event for process 'slave(696)'
with path: '/slave(696)/monitor/statistics.json'
I0221 05:04:36.729248 24866 http.cpp:871] Authorizing principal 'test-principal' to GET the
'/monitor/statistics.json' endpoint
I0221 05:04:36.730185 24862 slave.cpp:803] Agent terminating
[       OK ] Endpoint/SlaveEndpointTest.UnauthorizedRequest/1 (34 ms)
[ RUN      ] Endpoint/SlaveEndpointTest.UnauthorizedRequest/2
I0221 05:04:36.758148 24852 containerizer.cpp:220] Using isolation: posix/cpu,posix/mem,filesystem/posix,network/cni
W0221 05:04:36.758481 24852 backend.cpp:76] Failed to create 'aufs' backend: AufsBackend requires
root privileges
W0221 05:04:36.758522 24852 backend.cpp:76] Failed to create 'bind' backend: BindBackend requires
root privileges
I0221 05:04:36.758534 24852 provisioner.cpp:249] Using default backend 'copy'
I0221 05:04:36.760121 24867 slave.cpp:211] Mesos agent started on (697)@172.17.0.3:57291
I0221 05:04:36.760150 24867 slave.cpp:212] Flags at startup: --acls="" --appc_simple_discovery_uri_prefix="http://"
--appc_store_dir="/tmp/mesos/store/appc" --authenticate_http_readonly="true" --authenticate_http_readwrite="true"
--authenticatee="crammd5" --authentication_backoff_factor="1secs" --authorizer="local" --cgroups_cpu_enable_pids_and_tids_count="false"
--cgroups_enable_cfs="false" --cgroups_hierarchy="/sys/fs/cgroup" --cgroups_limit_swap="false"
--cgroups_root="mesos" --container_disk_watch_interval="15secs" --containerizers="mesos" --credential="/tmp/Endpoint_SlaveEndpointTest_UnauthorizedRequest_2_KdzPKy/credential"
--default_role="*" --disk_watch_interval="1mins" --docker="docker" --docker_kill_orphans="true"
--docker_registry="https://registry-1.docker.io" --docker_remove_delay="6hrs" --docker_socket="/var/run/docker.sock"
--docker_stop_timeout="0ns" --docker_store_dir="/tmp/mesos/store/docker" --docker_volume_checkpoint_dir="/var/run/mesos/isolators/docker/volume"
--enforce_container_disk_quota="false" --executor_registration_timeout="1mins" --executor_shutdown_grace_period="5secs"
--fetcher_cache_dir="/tmp/Endpoint_SlaveEndpointTest_UnauthorizedRequest_2_KdzPKy/fetch" --fetcher_cache_size="2GB"
--frameworks_home="" --gc_delay="1weeks" --gc_disk_headroom="0.1" --hadoop_home="" --help="false"
--hostname_lookup="true" --http_authenticators="basic" --http_command_executor="false" --http_credentials="/tmp/Endpoint_SlaveEndpointTest_UnauthorizedRequest_2_KdzPKy/http_credentials"
--http_heartbeat_interval="30secs" --initialize_driver_logging="true" --isolation="posix/cpu,posix/mem"
--launcher="posix" --launcher_dir="/mesos/build/src" --logbufsecs="0" --logging_level="INFO"
--max_completed_executors_per_framework="150" --oversubscribed_resources_interval="15secs"
--perf_duration="10secs" --perf_interval="1mins" --qos_correction_interval_min="0ns" --quiet="false"
--recover="reconnect" --recovery_timeout="15mins" --registration_backoff_factor="10ms" --resources="cpus:2;gpus:0;mem:1024;disk:1024;ports:[31000-32000]"
--revocable_cpu_low_priority="true" --runtime_dir="/tmp/Endpoint_SlaveEndpointTest_UnauthorizedRequest_2_KdzPKy"
--sandbox_directory="/mnt/mesos/sandbox" --strict="true" --switch_user="true" --systemd_enable_support="true"
--systemd_runtime_directory="/run/systemd/system" --version="false" --work_dir="/tmp/Endpoint_SlaveEndpointTest_UnauthorizedRequest_2_YqYXXv"
I0221 05:04:36.760499 24867 credentials.hpp:86] Loading credential for authentication from
'/tmp/Endpoint_SlaveEndpointTest_UnauthorizedRequest_2_KdzPKy/credential'
I0221 05:04:36.760594 24867 slave.cpp:354] Agent using credential for: test-principal
I0221 05:04:36.760609 24867 credentials.hpp:37] Loading credentials for authentication from
'/tmp/Endpoint_SlaveEndpointTest_UnauthorizedRequest_2_KdzPKy/http_credentials'
I0221 05:04:36.760715 24867 http.cpp:919] Using default 'basic' HTTP authenticator for realm
'mesos-agent-readonly'
I0221 05:04:36.760761 24867 http.cpp:919] Using default 'basic' HTTP authenticator for realm
'mesos-agent-readwrite'
I0221 05:04:36.761250 24867 slave.cpp:541] Agent resources: cpus(*):2; mem(*):1024; disk(*):1024;
ports(*):[31000-32000]
I0221 05:04:36.761294 24867 slave.cpp:549] Agent attributes: [  ]
I0221 05:04:36.761302 24867 slave.cpp:554] Agent hostname: 575f6d4d4e05
I0221 05:04:36.761399 24860 status_update_manager.cpp:177] Pausing sending status updates
I0221 05:04:36.761905 24865 state.cpp:62] Recovering state from '/tmp/Endpoint_SlaveEndpointTest_UnauthorizedRequest_2_YqYXXv/meta'
I0221 05:04:36.762174 24856 status_update_manager.cpp:203] Recovering status update manager
I0221 05:04:36.762302 24859 containerizer.cpp:599] Recovering containerizer
I0221 05:04:36.762958 24862 provisioner.cpp:410] Provisioner recovery complete
I0221 05:04:36.763188 24862 slave.cpp:5558] Finished recovery
I0221 05:04:36.763592 24862 slave.cpp:5732] Querying resource estimator for oversubscribable
resources
I0221 05:04:36.763880 24868 slave.cpp:5746] Received oversubscribable resources {} from the
resource estimator
I0221 05:04:36.764637 24854 process.cpp:3704] Handling HTTP event for process 'slave(697)'
with path: '/slave(697)/containers'
I0221 05:04:36.765202 24857 http.cpp:871] Authorizing principal 'test-principal' to GET the
'/containers' endpoint
I0221 05:04:36.766248 24854 slave.cpp:803] Agent terminating
[       OK ] Endpoint/SlaveEndpointTest.UnauthorizedRequest/2 (13 ms)
[ RUN      ] Endpoint/SlaveEndpointTest.NoAuthorizer/0
I0221 05:04:36.775138 24852 containerizer.cpp:220] Using isolation: posix/cpu,posix/mem,filesystem/posix,network/cni
W0221 05:04:36.775493 24852 backend.cpp:76] Failed to create 'aufs' backend: AufsBackend requires
root privileges
W0221 05:04:36.775537 24852 backend.cpp:76] Failed to create 'bind' backend: BindBackend requires
root privileges
I0221 05:04:36.775550 24852 provisioner.cpp:249] Using default backend 'copy'
I0221 05:04:36.776305 24852 cluster.cpp:446] Creating default 'local' authorizer
I0221 05:04:36.777088 24854 slave.cpp:211] Mesos agent started on (698)@172.17.0.3:57291
I0221 05:04:36.777113 24854 slave.cpp:212] Flags at startup: --acls="" --appc_simple_discovery_uri_prefix="http://"
--appc_store_dir="/tmp/mesos/store/appc" --authenticate_http_readonly="true" --authenticate_http_readwrite="true"
--authenticatee="crammd5" --authentication_backoff_factor="1secs" --authorizer="local" --cgroups_cpu_enable_pids_and_tids_count="false"
--cgroups_enable_cfs="false" --cgroups_hierarchy="/sys/fs/cgroup" --cgroups_limit_swap="false"
--cgroups_root="mesos" --container_disk_watch_interval="15secs" --containerizers="mesos" --credential="/tmp/Endpoint_SlaveEndpointTest_NoAuthorizer_0_D0Rs3J/credential"
--default_role="*" --disk_watch_interval="1mins" --docker="docker" --docker_kill_orphans="true"
--docker_registry="https://registry-1.docker.io" --docker_remove_delay="6hrs" --docker_socket="/var/run/docker.sock"
--docker_stop_timeout="0ns" --docker_store_dir="/tmp/mesos/store/docker" --docker_volume_checkpoint_dir="/var/run/mesos/isolators/docker/volume"
--enforce_container_disk_quota="false" --executor_registration_timeout="1mins" --executor_shutdown_grace_period="5secs"
--fetcher_cache_dir="/tmp/Endpoint_SlaveEndpointTest_NoAuthorizer_0_D0Rs3J/fetch" --fetcher_cache_size="2GB"
--frameworks_home="" --gc_delay="1weeks" --gc_disk_headroom="0.1" --hadoop_home="" --help="false"
--hostname_lookup="true" --http_authenticators="basic" --http_command_executor="false" --http_credentials="/tmp/Endpoint_SlaveEndpointTest_NoAuthorizer_0_D0Rs3J/http_credentials"
--http_heartbeat_interval="30secs" --initialize_driver_logging="true" --isolation="posix/cpu,posix/mem"
--launcher="posix" --launcher_dir="/mesos/build/src" --logbufsecs="0" --logging_level="INFO"
--max_completed_executors_per_framework="150" --oversubscribed_resources_interval="15secs"
--perf_duration="10secs" --perf_interval="1mins" --qos_correction_interval_min="0ns" --quiet="false"
--recover="reconnect" --recovery_timeout="15mins" --registration_backoff_factor="10ms" --resources="cpus:2;gpus:0;mem:1024;disk:1024;ports:[31000-32000]"
--revocable_cpu_low_priority="true" --runtime_dir="/tmp/Endpoint_SlaveEndpointTest_NoAuthorizer_0_D0Rs3J"
--sandbox_directory="/mnt/mesos/sandbox" --strict="true" --switch_user="true" --systemd_enable_support="true"
--systemd_runtime_directory="/run/systemd/system" --version="false" --work_dir="/tmp/Endpoint_SlaveEndpointTest_NoAuthorizer_0_OiJQdH"
I0221 05:04:36.777478 24854 credentials.hpp:86] Loading credential for authentication from
'/tmp/Endpoint_SlaveEndpointTest_NoAuthorizer_0_D0Rs3J/credential'
I0221 05:04:36.777603 24854 slave.cpp:354] Agent using credential for: test-principal
I0221 05:04:36.777621 24854 credentials.hpp:37] Loading credentials for authentication from
'/tmp/Endpoint_SlaveEndpointTest_NoAuthorizer_0_D0Rs3J/http_credentials'
I0221 05:04:36.777750 24854 http.cpp:919] Using default 'basic' HTTP authenticator for realm
'mesos-agent-readonly'
I0221 05:04:36.777808 24854 http.cpp:919] Using default 'basic' HTTP authenticator for realm
'mesos-agent-readwrite'
I0221 05:04:36.778276 24854 slave.cpp:541] Agent resources: cpus(*):2; mem(*):1024; disk(*):1024;
ports(*):[31000-32000]
I0221 05:04:36.778321 24854 slave.cpp:549] Agent attributes: [  ]
I0221 05:04:36.778332 24854 slave.cpp:554] Agent hostname: 575f6d4d4e05
I0221 05:04:36.778492 24853 status_update_manager.cpp:177] Pausing sending status updates
I0221 05:04:36.778801 24865 state.cpp:62] Recovering state from '/tmp/Endpoint_SlaveEndpointTest_NoAuthorizer_0_OiJQdH/meta'
I0221 05:04:36.779047 24855 status_update_manager.cpp:203] Recovering status update manager
I0221 05:04:36.779160 24853 containerizer.cpp:599] Recovering containerizer
I0221 05:04:36.779770 24857 provisioner.cpp:410] Provisioner recovery complete
I0221 05:04:36.780000 24867 slave.cpp:5558] Finished recovery
I0221 05:04:36.780439 24867 slave.cpp:5732] Querying resource estimator for oversubscribable
resources
I0221 05:04:36.780571 24864 slave.cpp:5746] Received oversubscribable resources {} from the
resource estimator
I0221 05:04:36.781353 24854 process.cpp:3704] Handling HTTP event for process 'slave(698)'
with path: '/slave(698)/monitor/statistics'
I0221 05:04:36.781833 24864 http.cpp:871] Authorizing principal 'test-principal' to GET the
'/monitor/statistics' endpoint
I0221 05:04:36.783161 24865 slave.cpp:803] Agent terminating
[       OK ] Endpoint/SlaveEndpointTest.NoAuthorizer/0 (13 ms)
[ RUN      ] Endpoint/SlaveEndpointTest.NoAuthorizer/1
I0221 05:04:36.818169 24852 containerizer.cpp:220] Using isolation: posix/cpu,posix/mem,filesystem/posix,network/cni
W0221 05:04:36.818477 24852 backend.cpp:76] Failed to create 'aufs' backend: AufsBackend requires
root privileges
W0221 05:04:36.818516 24852 backend.cpp:76] Failed to create 'bind' backend: BindBackend requires
root privileges
I0221 05:04:36.818534 24852 provisioner.cpp:249] Using default backend 'copy'
I0221 05:04:36.819166 24852 cluster.cpp:446] Creating default 'local' authorizer
I0221 05:04:36.819814 24857 slave.cpp:211] Mesos agent started on (699)@172.17.0.3:57291
I0221 05:04:36.819849 24857 slave.cpp:212] Flags at startup: --acls="" --appc_simple_discovery_uri_prefix="http://"
--appc_store_dir="/tmp/mesos/store/appc" --authenticate_http_readonly="true" --authenticate_http_readwrite="true"
--authenticatee="crammd5" --authentication_backoff_factor="1secs" --authorizer="local" --cgroups_cpu_enable_pids_and_tids_count="false"
--cgroups_enable_cfs="false" --cgroups_hierarchy="/sys/fs/cgroup" --cgroups_limit_swap="false"
--cgroups_root="mesos" --container_disk_watch_interval="15secs" --containerizers="mesos" --credential="/tmp/Endpoint_SlaveEndpointTest_NoAuthorizer_1_vTuOJV/credential"
--default_role="*" --disk_watch_interval="1mins" --docker="docker" --docker_kill_orphans="true"
--docker_registry="https://registry-1.docker.io" --docker_remove_delay="6hrs" --docker_socket="/var/run/docker.sock"
--docker_stop_timeout="0ns" --docker_store_dir="/tmp/mesos/store/docker" --docker_volume_checkpoint_dir="/var/run/mesos/isolators/docker/volume"
--enforce_container_disk_quota="false" --executor_registration_timeout="1mins" --executor_shutdown_grace_period="5secs"
--fetcher_cache_dir="/tmp/Endpoint_SlaveEndpointTest_NoAuthorizer_1_vTuOJV/fetch" --fetcher_cache_size="2GB"
--frameworks_home="" --gc_delay="1weeks" --gc_disk_headroom="0.1" --hadoop_home="" --help="false"
--hostname_lookup="true" --http_authenticators="basic" --http_command_executor="false" --http_credentials="/tmp/Endpoint_SlaveEndpointTest_NoAuthorizer_1_vTuOJV/http_credentials"
--http_heartbeat_interval="30secs" --initialize_driver_logging="true" --isolation="posix/cpu,posix/mem"
--launcher="posix" --launcher_dir="/mesos/build/src" --logbufsecs="0" --logging_level="INFO"
--max_completed_executors_per_framework="150" --oversubscribed_resources_interval="15secs"
--perf_duration="10secs" --perf_interval="1mins" --qos_correction_interval_min="0ns" --quiet="false"
--recover="reconnect" --recovery_timeout="15mins" --registration_backoff_factor="10ms" --resources="cpus:2;gpus:0;mem:1024;disk:1024;ports:[31000-32000]"
--revocable_cpu_low_priority="true" --runtime_dir="/tmp/Endpoint_SlaveEndpointTest_NoAuthorizer_1_vTuOJV"
--sandbox_directory="/mnt/mesos/sandbox" --strict="true" --switch_user="true" --systemd_enable_support="true"
--systemd_runtime_directory="/run/systemd/system" --version="false" --work_dir="/tmp/Endpoint_SlaveEndpointTest_NoAuthorizer_1_brGcNS"
I0221 05:04:36.820332 24857 credentials.hpp:86] Loading credential for authentication from
'/tmp/Endpoint_SlaveEndpointTest_NoAuthorizer_1_vTuOJV/credential'
I0221 05:04:36.820425 24857 slave.cpp:354] Agent using credential for: test-principal
I0221 05:04:36.820439 24857 credentials.hpp:37] Loading credentials for authentication from
'/tmp/Endpoint_SlaveEndpointTest_NoAuthorizer_1_vTuOJV/http_credentials'
I0221 05:04:36.820544 24857 http.cpp:919] Using default 'basic' HTTP authenticator for realm
'mesos-agent-readonly'
I0221 05:04:36.820600 24857 http.cpp:919] Using default 'basic' HTTP authenticator for realm
'mesos-agent-readwrite'
I0221 05:04:36.821106 24857 slave.cpp:541] Agent resources: cpus(*):2; mem(*):1024; disk(*):1024;
ports(*):[31000-32000]
I0221 05:04:36.821151 24857 slave.cpp:549] Agent attributes: [  ]
I0221 05:04:36.821161 24857 slave.cpp:554] Agent hostname: 575f6d4d4e05
I0221 05:04:36.821244 24865 status_update_manager.cpp:177] Pausing sending status updates
I0221 05:04:36.821562 24862 state.cpp:62] Recovering state from '/tmp/Endpoint_SlaveEndpointTest_NoAuthorizer_1_brGcNS/meta'
I0221 05:04:36.821841 24865 status_update_manager.cpp:203] Recovering status update manager
I0221 05:04:36.821976 24857 containerizer.cpp:599] Recovering containerizer
I0221 05:04:36.822600 24865 provisioner.cpp:410] Provisioner recovery complete
I0221 05:04:36.822803 24855 slave.cpp:5558] Finished recovery
I0221 05:04:36.823287 24855 slave.cpp:5732] Querying resource estimator for oversubscribable
resources
I0221 05:04:36.823410 24857 slave.cpp:5746] Received oversubscribable resources {} from the
resource estimator
I0221 05:04:36.824157 24856 process.cpp:3704] Handling HTTP event for process 'slave(699)'
with path: '/slave(699)/monitor/statistics.json'
I0221 05:04:36.824681 24863 http.cpp:871] Authorizing principal 'test-principal' to GET the
'/monitor/statistics.json' endpoint
I0221 05:04:36.826170 24868 slave.cpp:803] Agent terminating
[       OK ] Endpoint/SlaveEndpointTest.NoAuthorizer/1 (14 ms)
[ RUN      ] Endpoint/SlaveEndpointTest.NoAuthorizer/2
I0221 05:04:36.841467 24852 containerizer.cpp:220] Using isolation: posix/cpu,posix/mem,filesystem/posix,network/cni
W0221 05:04:36.841795 24852 backend.cpp:76] Failed to create 'aufs' backend: AufsBackend requires
root privileges
W0221 05:04:36.841843 24852 backend.cpp:76] Failed to create 'bind' backend: BindBackend requires
root privileges
I0221 05:04:36.841856 24852 provisioner.cpp:249] Using default backend 'copy'
I0221 05:04:36.842607 24852 cluster.cpp:446] Creating default 'local' authorizer
I0221 05:04:36.843431 24862 slave.cpp:211] Mesos agent started on (700)@172.17.0.3:57291
I0221 05:04:36.843461 24862 slave.cpp:212] Flags at startup: --acls="" --appc_simple_discovery_uri_prefix="http://"
--appc_store_dir="/tmp/mesos/store/appc" --authenticate_http_readonly="true" --authenticate_http_readwrite="true"
--authenticatee="crammd5" --authentication_backoff_factor="1secs" --authorizer="local" --cgroups_cpu_enable_pids_and_tids_count="false"
--cgroups_enable_cfs="false" --cgroups_hierarchy="/sys/fs/cgroup" --cgroups_limit_swap="false"
--cgroups_root="mesos" --container_disk_watch_interval="15secs" --containerizers="mesos" --credential="/tmp/Endpoint_SlaveEndpointTest_NoAuthorizer_2_jgXpI7/credential"
--default_role="*" --disk_watch_interval="1mins" --docker="docker" --docker_kill_orphans="true"
--docker_registry="https://registry-1.docker.io" --docker_remove_delay="6hrs" --docker_socket="/var/run/docker.sock"
--docker_stop_timeout="0ns" --docker_store_dir="/tmp/mesos/store/docker" --docker_volume_checkpoint_dir="/var/run/mesos/isolators/docker/volume"
--enforce_container_disk_quota="false" --executor_registration_timeout="1mins" --executor_shutdown_grace_period="5secs"
--fetcher_cache_dir="/tmp/Endpoint_SlaveEndpointTest_NoAuthorizer_2_jgXpI7/fetch" --fetcher_cache_size="2GB"
--frameworks_home="" --gc_delay="1weeks" --gc_disk_headroom="0.1" --hadoop_home="" --help="false"
--hostname_lookup="true" --http_authenticators="basic" --http_command_executor="false" --http_credentials="/tmp/Endpoint_SlaveEndpointTest_NoAuthorizer_2_jgXpI7/http_credentials"
--http_heartbeat_interval="30secs" --initialize_driver_logging="true" --isolation="posix/cpu,posix/mem"
--launcher="posix" --launcher_dir="/mesos/build/src" --logbufsecs="0" --logging_level="INFO"
--max_completed_executors_per_framework="150" --oversubscribed_resources_interval="15secs"
--perf_duration="10secs" --perf_interval="1mins" --qos_correction_interval_min="0ns" --quiet="false"
--recover="reconnect" --recovery_timeout="15mins" --registration_backoff_factor="10ms" --resources="cpus:2;gpus:0;mem:1024;disk:1024;ports:[31000-32000]"
--revocable_cpu_low_priority="true" --runtime_dir="/tmp/Endpoint_SlaveEndpointTest_NoAuthorizer_2_jgXpI7"
--sandbox_directory="/mnt/mesos/sandbox" --strict="true" --switch_user="true" --systemd_enable_support="true"
--systemd_runtime_directory="/run/systemd/system" --version="false" --work_dir="/tmp/Endpoint_SlaveEndpointTest_NoAuthorizer_2_N4n2H4"
I0221 05:04:36.843852 24862 credentials.hpp:86] Loading credential for authentication from
'/tmp/Endpoint_SlaveEndpointTest_NoAuthorizer_2_jgXpI7/credential'
I0221 05:04:36.843946 24862 slave.cpp:354] Agent using credential for: test-principal
I0221 05:04:36.843961 24862 credentials.hpp:37] Loading credentials for authentication from
'/tmp/Endpoint_SlaveEndpointTest_NoAuthorizer_2_jgXpI7/http_credentials'
I0221 05:04:36.844069 24862 http.cpp:919] Using default 'basic' HTTP authenticator for realm
'mesos-agent-readonly'
I0221 05:04:36.844117 24862 http.cpp:919] Using default 'basic' HTTP authenticator for realm
'mesos-agent-readwrite'
I0221 05:04:36.844555 24862 slave.cpp:541] Agent resources: cpus(*):2; mem(*):1024; disk(*):1024;
ports(*):[31000-32000]
I0221 05:04:36.844599 24862 slave.cpp:549] Agent attributes: [  ]
I0221 05:04:36.844609 24862 slave.cpp:554] Agent hostname: 575f6d4d4e05
I0221 05:04:36.844697 24857 status_update_manager.cpp:177] Pausing sending status updates
I0221 05:04:36.845054 24864 state.cpp:62] Recovering state from '/tmp/Endpoint_SlaveEndpointTest_NoAuthorizer_2_N4n2H4/meta'
I0221 05:04:36.845366 24862 status_update_manager.cpp:203] Recovering status update manager
I0221 05:04:36.845500 24857 containerizer.cpp:599] Recovering containerizer
I0221 05:04:36.846127 24863 provisioner.cpp:410] Provisioner recovery complete
I0221 05:04:36.846427 24865 slave.cpp:5558] Finished recovery
I0221 05:04:36.846817 24865 slave.cpp:5732] Querying resource estimator for oversubscribable
resources
I0221 05:04:36.846931 24864 slave.cpp:5746] Received oversubscribable resources {} from the
resource estimator
I0221 05:04:36.847726 24855 process.cpp:3704] Handling HTTP event for process 'slave(700)'
with path: '/slave(700)/containers'
I0221 05:04:36.848232 24864 http.cpp:871] Authorizing principal 'test-principal' to GET the
'/containers' endpoint
I0221 05:04:36.849761 24863 slave.cpp:803] Agent terminating
[       OK ] Endpoint/SlaveEndpointTest.NoAuthorizer/2 (19 ms)
[----------] 9 tests from Endpoint/SlaveEndpointTest (261 ms total)

[----------] Global test environment tear-down
[==========] 1443 tests from 160 test cases ran. (321021 ms total)
[  PASSED  ] 1442 tests.
[  FAILED  ] 1 test, listed below:
[  FAILED  ] IOSwitchboardTest.RecoverThenKillSwitchboardContainerDestroyed

 1 FAILED TEST
  YOU HAVE 11 DISABLED TESTS

make[3]: *** [CMakeFiles/check] Error 1
make[3]: Leaving directory `/mesos/build'
make[2]: Leaving directory `/mesos/build'
make[2]: *** [CMakeFiles/check.dir/all] Error 2
make[1]: *** [CMakeFiles/check.dir/rule] Error 2
make[1]: Leaving directory `/mesos/build'
make: *** [check] Error 2
+ docker rmi mesos-1487650641-24479
Untagged: mesos-1487650641-24479:latest
Deleted: sha256:1aa24415763d2c9797be421bc70a31c377e103d169c124aff178194271f3f893
Deleted: sha256:a6371522ff250205311f6921f10538e26bdaaa942918d912e610c6ad8a138cb9
Deleted: sha256:76214d1690fbb2d153b2ca9908eee123edc857b431649c7e515ed4881ef060dd
Deleted: sha256:3f7db9c4f883b3275ffeb2d7c3faa063b81d99c1c7951b728dda35e719c4c8b5
Deleted: sha256:dc0e8ffb0b0a8e9ff5da9c70acb61c539ad85682c8aec23e57478ee4c1e365ec
Deleted: sha256:bdbc8b6f54d7ce1389d05495e1b97e6eaf06c04a47c9cc055dfc19f8362a14a6
Deleted: sha256:5e31088b1f7843ae339881a28a255b2749dd4abe1e791bc50ec1ea1bd716d049
Deleted: sha256:2067087314c43799ba364e915150030d15bb1ec1af8cd59bfbbde96fd5dd4987
Deleted: sha256:ccfb0d61b1d846d18584adfdf91745477e8998b092a41d44b0354e932ffc2149
Deleted: sha256:754191a11b9236c1bf10c642d31ba1ed7aa96c482aa7bde72c4b6ed6223e70e3
Deleted: sha256:7f330e82cf446d2043d7044dc1165c52f6d3d7ae68a3a9cff370ed7c0c0f291c
Deleted: sha256:b865dbaa26f1c508def33c468a5dafdf07de7d7c405d7c2a7ac15f24f1fb33b8
Deleted: sha256:11e42d3236c23a1cda3c415c00d0e87d50c202847e440e07e8089d2ff0671c38
Deleted: sha256:8a880a9d7785d4f6c7476d52014b384fcae2f038049b3410d0684fafcc508e74
Deleted: sha256:d6a16553dc5ce0560c68f94a768273383285e457049ebadf3b3d02057b9c8c29
Deleted: sha256:caee9598ee40edc1fcf46b5e9fd9cac5afaee21f9c12ce27869f5973ab5f1640
Deleted: sha256:808c4f7182497e11fb9c858f9631bc296028a85a32e1bd779ecdd6144d26fab5
Deleted: sha256:fc8f8036aa589ec46d9fa16a6f629caf1ac59b008533f8838772e88b358d1b8c
Deleted: sha256:79809d473d7c45cae0fa5271ef45fe3fe7ec40c20ff4cffb58b30316606453a6
Deleted: sha256:ad167f3d239d6188c68197f138d9e9540e0a7a02a6c9e8567f62fdded92e27b3
Deleted: sha256:59f3dd9f3e4c0d7723faca870948367085f61cbc3d14f096c3cdd16d451980d9
Deleted: sha256:df77658cdea431ad8b37684736083aa2e38ac9c1125082905ea7a9605e80aea0
Deleted: sha256:02ea0ce096f55b4299d6bcf46fd2511ca58270d517b521280b71391d118e59ce
Deleted: sha256:97347353fb94c679dd27e0c66a4c8ebf94a73ae5d9ff060966c7b6838eb2d7e4
Build step 'Execute shell' marked build as failure

Mime
View raw message