mesos-builds mailing list archives

Site index · List index
Message view « Date » · « Thread »
Top « Date » · « Thread »
From Apache Jenkins Server <jenk...@builds.apache.org>
Subject Build failed in Jenkins: Mesos-Buildbot » autotools,clang,--verbose,GLOG_v=1 MESOS_VERBOSE=1,ubuntu:14.04,(docker||Hadoop)&&(!ubuntu-us1)&&(!ubuntu-eu2) #3217
Date Fri, 03 Feb 2017 21:52:10 GMT
See <https://builds.apache.org/job/Mesos-Buildbot/BUILDTOOL=autotools,COMPILER=clang,CONFIGURATION=--verbose,ENVIRONMENT=GLOG_v=1%20MESOS_VERBOSE=1,OS=ubuntu%3A14.04,label_exp=(docker%7C%7CHadoop)&&(!ubuntu-us1)&&(!ubuntu-eu2)/3217/changes>

Changes:

[mpark] Added `--3way` option to `support/apply-reviews.py`.

------------------------------------------
[...truncated 175464 lines...]
I0203 21:51:13.990290 28632 status_update_manager.cpp:203] Recovering status update manager
I0203 21:51:13.990519 28636 containerizer.cpp:599] Recovering containerizer
I0203 21:51:13.992000 28633 provisioner.cpp:410] Provisioner recovery complete
I0203 21:51:13.992491 28630 slave.cpp:5422] Finished recovery
I0203 21:51:13.993037 28630 slave.cpp:5596] Querying resource estimator for oversubscribable
resources
I0203 21:51:13.993314 28624 slave.cpp:5610] Received oversubscribable resources {} from the
resource estimator
I0203 21:51:13.995740 28630 process.cpp:3697] Handling HTTP event for process 'slave(688)'
with path: '/slave(688)/monitor/statistics.json'
I0203 21:51:13.997030 28625 http.cpp:871] Authorizing principal 'test-principal' to GET the
'/monitor/statistics.json' endpoint
I0203 21:51:14.000603 28624 slave.cpp:801] Agent terminating
[       OK ] Endpoint/SlaveEndpointTest.AuthorizedRequest/1 (31 ms)
[ RUN      ] Endpoint/SlaveEndpointTest.AuthorizedRequest/2
I0203 21:51:14.011466 28603 containerizer.cpp:220] Using isolation: posix/cpu,posix/mem,filesystem/posix,network/cni
W0203 21:51:14.012178 28603 backend.cpp:76] Failed to create 'aufs' backend: AufsBackend requires
root privileges
W0203 21:51:14.012307 28603 backend.cpp:76] Failed to create 'bind' backend: BindBackend requires
root privileges
I0203 21:51:14.012364 28603 provisioner.cpp:249] Using default backend 'copy'
I0203 21:51:14.015805 28630 slave.cpp:209] Mesos agent started on (689)@172.17.0.3:50736
I0203 21:51:14.015853 28630 slave.cpp:210] Flags at startup: --acls="" --appc_simple_discovery_uri_prefix="http://"
--appc_store_dir="/tmp/mesos/store/appc" --authenticate_http_readonly="true" --authenticate_http_readwrite="true"
--authenticatee="crammd5" --authentication_backoff_factor="1secs" --authorizer="local" --cgroups_cpu_enable_pids_and_tids_count="false"
--cgroups_enable_cfs="false" --cgroups_hierarchy="/sys/fs/cgroup" --cgroups_limit_swap="false"
--cgroups_root="mesos" --container_disk_watch_interval="15secs" --containerizers="mesos" --credential="/tmp/Endpoint_SlaveEndpointTest_AuthorizedRequest_2_vHO5rR/credential"
--default_role="*" --disk_watch_interval="1mins" --docker="docker" --docker_kill_orphans="true"
--docker_registry="https://registry-1.docker.io" --docker_remove_delay="6hrs" --docker_socket="/var/run/docker.sock"
--docker_stop_timeout="0ns" --docker_store_dir="/tmp/mesos/store/docker" --docker_volume_checkpoint_dir="/var/run/mesos/isolators/docker/volume"
--enforce_container_disk_quota="false" --executor_registration_timeout="1mins" --executor_shutdown_grace_period="5secs"
--fetcher_cache_dir="/tmp/Endpoint_SlaveEndpointTest_AuthorizedRequest_2_vHO5rR/fetch" --fetcher_cache_size="2GB"
--frameworks_home="" --gc_delay="1weeks" --gc_disk_headroom="0.1" --hadoop_home="" --help="false"
--hostname_lookup="true" --http_authenticators="basic" --http_command_executor="false" --http_credentials="/tmp/Endpoint_SlaveEndpointTest_AuthorizedRequest_2_vHO5rR/http_credentials"
--http_heartbeat_interval="30secs" --initialize_driver_logging="true" --isolation="posix/cpu,posix/mem"
--launcher="posix" --launcher_dir="/mesos/mesos-1.2.0/_build/src" --logbufsecs="0" --logging_level="INFO"
--max_completed_executors_per_framework="150" --oversubscribed_resources_interval="15secs"
--perf_duration="10secs" --perf_interval="1mins" --qos_correction_interval_min="0ns" --quiet="false"
--recover="reconnect" --recovery_timeout="15mins" --registration_backoff_factor="10ms" --resources="cpus:2;gpus:0;mem:1024;disk:1024;ports:[31000-32000]"
--revocable_cpu_low_priority="true" --runtime_dir="/tmp/Endpoint_SlaveEndpointTest_AuthorizedRequest_2_vHO5rR"
--sandbox_directory="/mnt/mesos/sandbox" --strict="true" --switch_user="true" --systemd_enable_support="true"
--systemd_runtime_directory="/run/systemd/system" --version="false" --work_dir="/tmp/Endpoint_SlaveEndpointTest_AuthorizedRequest_2_MLddRB"
I0203 21:51:14.016549 28630 credentials.hpp:86] Loading credential for authentication from
'/tmp/Endpoint_SlaveEndpointTest_AuthorizedRequest_2_vHO5rR/credential'
I0203 21:51:14.016719 28630 slave.cpp:352] Agent using credential for: test-principal
I0203 21:51:14.016746 28630 credentials.hpp:37] Loading credentials for authentication from
'/tmp/Endpoint_SlaveEndpointTest_AuthorizedRequest_2_vHO5rR/http_credentials'
I0203 21:51:14.017005 28630 http.cpp:919] Using default 'basic' HTTP authenticator for realm
'mesos-agent-readonly'
I0203 21:51:14.017173 28630 http.cpp:919] Using default 'basic' HTTP authenticator for realm
'mesos-agent-readwrite'
I0203 21:51:14.018779 28630 slave.cpp:539] Agent resources: cpus(*):2; mem(*):1024; disk(*):1024;
ports(*):[31000-32000]
I0203 21:51:14.018877 28630 slave.cpp:547] Agent attributes: [  ]
I0203 21:51:14.018893 28630 slave.cpp:552] Agent hostname: e88d0f1e4cb5
I0203 21:51:14.019049 28634 status_update_manager.cpp:177] Pausing sending status updates
I0203 21:51:14.020769 28621 state.cpp:60] Recovering state from '/tmp/Endpoint_SlaveEndpointTest_AuthorizedRequest_2_MLddRB/meta'
I0203 21:51:14.021046 28627 status_update_manager.cpp:203] Recovering status update manager
I0203 21:51:14.021324 28621 containerizer.cpp:599] Recovering containerizer
I0203 21:51:14.022786 28625 provisioner.cpp:410] Provisioner recovery complete
I0203 21:51:14.023195 28630 slave.cpp:5422] Finished recovery
I0203 21:51:14.023640 28630 slave.cpp:5596] Querying resource estimator for oversubscribable
resources
I0203 21:51:14.023893 28630 slave.cpp:5610] Received oversubscribable resources {} from the
resource estimator
I0203 21:51:14.026499 28626 process.cpp:3697] Handling HTTP event for process 'slave(689)'
with path: '/slave(689)/containers'
I0203 21:51:14.027482 28631 http.cpp:871] Authorizing principal 'test-principal' to GET the
'/containers' endpoint
I0203 21:51:14.030841 28625 slave.cpp:801] Agent terminating
[       OK ] Endpoint/SlaveEndpointTest.AuthorizedRequest/2 (27 ms)
[ RUN      ] Endpoint/SlaveEndpointTest.UnauthorizedRequest/0
I0203 21:51:14.039407 28603 containerizer.cpp:220] Using isolation: posix/cpu,posix/mem,filesystem/posix,network/cni
W0203 21:51:14.039870 28603 backend.cpp:76] Failed to create 'aufs' backend: AufsBackend requires
root privileges
W0203 21:51:14.039990 28603 backend.cpp:76] Failed to create 'bind' backend: BindBackend requires
root privileges
I0203 21:51:14.040112 28603 provisioner.cpp:249] Using default backend 'copy'
I0203 21:51:14.044255 28631 slave.cpp:209] Mesos agent started on (690)@172.17.0.3:50736
I0203 21:51:14.044286 28631 slave.cpp:210] Flags at startup: --acls="" --appc_simple_discovery_uri_prefix="http://"
--appc_store_dir="/tmp/mesos/store/appc" --authenticate_http_readonly="true" --authenticate_http_readwrite="true"
--authenticatee="crammd5" --authentication_backoff_factor="1secs" --authorizer="local" --cgroups_cpu_enable_pids_and_tids_count="false"
--cgroups_enable_cfs="false" --cgroups_hierarchy="/sys/fs/cgroup" --cgroups_limit_swap="false"
--cgroups_root="mesos" --container_disk_watch_interval="15secs" --containerizers="mesos" --credential="/tmp/Endpoint_SlaveEndpointTest_UnauthorizedRequest_0_Hexs5R/credential"
--default_role="*" --disk_watch_interval="1mins" --docker="docker" --docker_kill_orphans="true"
--docker_registry="https://registry-1.docker.io" --docker_remove_delay="6hrs" --docker_socket="/var/run/docker.sock"
--docker_stop_timeout="0ns" --docker_store_dir="/tmp/mesos/store/docker" --docker_volume_checkpoint_dir="/var/run/mesos/isolators/docker/volume"
--enforce_container_disk_quota="false" --executor_registration_timeout="1mins" --executor_shutdown_grace_period="5secs"
--fetcher_cache_dir="/tmp/Endpoint_SlaveEndpointTest_UnauthorizedRequest_0_Hexs5R/fetch" --fetcher_cache_size="2GB"
--frameworks_home="" --gc_delay="1weeks" --gc_disk_headroom="0.1" --hadoop_home="" --help="false"
--hostname_lookup="true" --http_authenticators="basic" --http_command_executor="false" --http_credentials="/tmp/Endpoint_SlaveEndpointTest_UnauthorizedRequest_0_Hexs5R/http_credentials"
--http_heartbeat_interval="30secs" --initialize_driver_logging="true" --isolation="posix/cpu,posix/mem"
--launcher="posix" --launcher_dir="/mesos/mesos-1.2.0/_build/src" --logbufsecs="0" --logging_level="INFO"
--max_completed_executors_per_framework="150" --oversubscribed_resources_interval="15secs"
--perf_duration="10secs" --perf_interval="1mins" --qos_correction_interval_min="0ns" --quiet="false"
--recover="reconnect" --recovery_timeout="15mins" --registration_backoff_factor="10ms" --resources="cpus:2;gpus:0;mem:1024;disk:1024;ports:[31000-32000]"
--revocable_cpu_low_priority="true" --runtime_dir="/tmp/Endpoint_SlaveEndpointTest_UnauthorizedRequest_0_Hexs5R"
--sandbox_directory="/mnt/mesos/sandbox" --strict="true" --switch_user="true" --systemd_enable_support="true"
--systemd_runtime_directory="/run/systemd/system" --version="false" --work_dir="/tmp/Endpoint_SlaveEndpointTest_UnauthorizedRequest_0_aivYpC"
I0203 21:51:14.044802 28631 credentials.hpp:86] Loading credential for authentication from
'/tmp/Endpoint_SlaveEndpointTest_UnauthorizedRequest_0_Hexs5R/credential'
I0203 21:51:14.044926 28631 slave.cpp:352] Agent using credential for: test-principal
I0203 21:51:14.044951 28631 credentials.hpp:37] Loading credentials for authentication from
'/tmp/Endpoint_SlaveEndpointTest_UnauthorizedRequest_0_Hexs5R/http_credentials'
I0203 21:51:14.045142 28631 http.cpp:919] Using default 'basic' HTTP authenticator for realm
'mesos-agent-readonly'
I0203 21:51:14.045255 28631 http.cpp:919] Using default 'basic' HTTP authenticator for realm
'mesos-agent-readwrite'
I0203 21:51:14.046315 28631 slave.cpp:539] Agent resources: cpus(*):2; mem(*):1024; disk(*):1024;
ports(*):[31000-32000]
I0203 21:51:14.046386 28631 slave.cpp:547] Agent attributes: [  ]
I0203 21:51:14.046398 28631 slave.cpp:552] Agent hostname: e88d0f1e4cb5
I0203 21:51:14.046521 28632 status_update_manager.cpp:177] Pausing sending status updates
I0203 21:51:14.047538 28629 state.cpp:60] Recovering state from '/tmp/Endpoint_SlaveEndpointTest_UnauthorizedRequest_0_aivYpC/meta'
I0203 21:51:14.047821 28625 status_update_manager.cpp:203] Recovering status update manager
I0203 21:51:14.048029 28635 containerizer.cpp:599] Recovering containerizer
I0203 21:51:14.049091 28621 provisioner.cpp:410] Provisioner recovery complete
I0203 21:51:14.049504 28632 slave.cpp:5422] Finished recovery
I0203 21:51:14.050061 28632 slave.cpp:5596] Querying resource estimator for oversubscribable
resources
I0203 21:51:14.050333 28636 slave.cpp:5610] Received oversubscribable resources {} from the
resource estimator
I0203 21:51:14.052697 28624 process.cpp:3697] Handling HTTP event for process 'slave(690)'
with path: '/slave(690)/monitor/statistics'
I0203 21:51:14.053810 28626 http.cpp:871] Authorizing principal 'test-principal' to GET the
'/monitor/statistics' endpoint
I0203 21:51:14.056234 28626 slave.cpp:801] Agent terminating
[       OK ] Endpoint/SlaveEndpointTest.UnauthorizedRequest/0 (25 ms)
[ RUN      ] Endpoint/SlaveEndpointTest.UnauthorizedRequest/1
I0203 21:51:14.066118 28603 containerizer.cpp:220] Using isolation: posix/cpu,posix/mem,filesystem/posix,network/cni
W0203 21:51:14.066696 28603 backend.cpp:76] Failed to create 'aufs' backend: AufsBackend requires
root privileges
W0203 21:51:14.066821 28603 backend.cpp:76] Failed to create 'bind' backend: BindBackend requires
root privileges
I0203 21:51:14.066874 28603 provisioner.cpp:249] Using default backend 'copy'
I0203 21:51:14.070397 28623 slave.cpp:209] Mesos agent started on (691)@172.17.0.3:50736
I0203 21:51:14.070452 28623 slave.cpp:210] Flags at startup: --acls="" --appc_simple_discovery_uri_prefix="http://"
--appc_store_dir="/tmp/mesos/store/appc" --authenticate_http_readonly="true" --authenticate_http_readwrite="true"
--authenticatee="crammd5" --authentication_backoff_factor="1secs" --authorizer="local" --cgroups_cpu_enable_pids_and_tids_count="false"
--cgroups_enable_cfs="false" --cgroups_hierarchy="/sys/fs/cgroup" --cgroups_limit_swap="false"
--cgroups_root="mesos" --container_disk_watch_interval="15secs" --containerizers="mesos" --credential="/tmp/Endpoint_SlaveEndpointTest_UnauthorizedRequest_1_9idJZS/credential"
--default_role="*" --disk_watch_interval="1mins" --docker="docker" --docker_kill_orphans="true"
--docker_registry="https://registry-1.docker.io" --docker_remove_delay="6hrs" --docker_socket="/var/run/docker.sock"
--docker_stop_timeout="0ns" --docker_store_dir="/tmp/mesos/store/docker" --docker_volume_checkpoint_dir="/var/run/mesos/isolators/docker/volume"
--enforce_container_disk_quota="false" --executor_registration_timeout="1mins" --executor_shutdown_grace_period="5secs"
--fetcher_cache_dir="/tmp/Endpoint_SlaveEndpointTest_UnauthorizedRequest_1_9idJZS/fetch" --fetcher_cache_size="2GB"
--frameworks_home="" --gc_delay="1weeks" --gc_disk_headroom="0.1" --hadoop_home="" --help="false"
--hostname_lookup="true" --http_authenticators="basic" --http_command_executor="false" --http_credentials="/tmp/Endpoint_SlaveEndpointTest_UnauthorizedRequest_1_9idJZS/http_credentials"
--http_heartbeat_interval="30secs" --initialize_driver_logging="true" --isolation="posix/cpu,posix/mem"
--launcher="posix" --launcher_dir="/mesos/mesos-1.2.0/_build/src" --logbufsecs="0" --logging_level="INFO"
--max_completed_executors_per_framework="150" --oversubscribed_resources_interval="15secs"
--perf_duration="10secs" --perf_interval="1mins" --qos_correction_interval_min="0ns" --quiet="false"
--recover="reconnect" --recovery_timeout="15mins" --registration_backoff_factor="10ms" --resources="cpus:2;gpus:0;mem:1024;disk:1024;ports:[31000-32000]"
--revocable_cpu_low_priority="true" --runtime_dir="/tmp/Endpoint_SlaveEndpointTest_UnauthorizedRequest_1_9idJZS"
--sandbox_directory="/mnt/mesos/sandbox" --strict="true" --switch_user="true" --systemd_enable_support="true"
--systemd_runtime_directory="/run/systemd/system" --version="false" --work_dir="/tmp/Endpoint_SlaveEndpointTest_UnauthorizedRequest_1_Wop1fD"
I0203 21:51:14.071213 28623 credentials.hpp:86] Loading credential for authentication from
'/tmp/Endpoint_SlaveEndpointTest_UnauthorizedRequest_1_9idJZS/credential'
I0203 21:51:14.071379 28623 slave.cpp:352] Agent using credential for: test-principal
I0203 21:51:14.071408 28623 credentials.hpp:37] Loading credentials for authentication from
'/tmp/Endpoint_SlaveEndpointTest_UnauthorizedRequest_1_9idJZS/http_credentials'
I0203 21:51:14.071663 28623 http.cpp:919] Using default 'basic' HTTP authenticator for realm
'mesos-agent-readonly'
I0203 21:51:14.071833 28623 http.cpp:919] Using default 'basic' HTTP authenticator for realm
'mesos-agent-readwrite'
I0203 21:51:14.073412 28623 slave.cpp:539] Agent resources: cpus(*):2; mem(*):1024; disk(*):1024;
ports(*):[31000-32000]
I0203 21:51:14.073513 28623 slave.cpp:547] Agent attributes: [  ]
I0203 21:51:14.073529 28623 slave.cpp:552] Agent hostname: e88d0f1e4cb5
I0203 21:51:14.073673 28636 status_update_manager.cpp:177] Pausing sending status updates
I0203 21:51:14.075207 28629 state.cpp:60] Recovering state from '/tmp/Endpoint_SlaveEndpointTest_UnauthorizedRequest_1_Wop1fD/meta'
I0203 21:51:14.075484 28628 status_update_manager.cpp:203] Recovering status update manager
I0203 21:51:14.075851 28633 containerizer.cpp:599] Recovering containerizer
I0203 21:51:14.077497 28636 provisioner.cpp:410] Provisioner recovery complete
I0203 21:51:14.077989 28631 slave.cpp:5422] Finished recovery
I0203 21:51:14.078606 28631 slave.cpp:5596] Querying resource estimator for oversubscribable
resources
I0203 21:51:14.078979 28635 slave.cpp:5610] Received oversubscribable resources {} from the
resource estimator
I0203 21:51:14.081394 28623 process.cpp:3697] Handling HTTP event for process 'slave(691)'
with path: '/slave(691)/monitor/statistics.json'
I0203 21:51:14.082718 28627 http.cpp:871] Authorizing principal 'test-principal' to GET the
'/monitor/statistics.json' endpoint
I0203 21:51:14.084750 28624 slave.cpp:801] Agent terminating
[       OK ] Endpoint/SlaveEndpointTest.UnauthorizedRequest/1 (28 ms)
[ RUN      ] Endpoint/SlaveEndpointTest.UnauthorizedRequest/2
I0203 21:51:14.094398 28603 containerizer.cpp:220] Using isolation: posix/cpu,posix/mem,filesystem/posix,network/cni
W0203 21:51:14.094882 28603 backend.cpp:76] Failed to create 'aufs' backend: AufsBackend requires
root privileges
W0203 21:51:14.095046 28603 backend.cpp:76] Failed to create 'bind' backend: BindBackend requires
root privileges
I0203 21:51:14.095135 28603 provisioner.cpp:249] Using default backend 'copy'
I0203 21:51:14.098592 28631 slave.cpp:209] Mesos agent started on (692)@172.17.0.3:50736
I0203 21:51:14.098888 28631 slave.cpp:210] Flags at startup: --acls="" --appc_simple_discovery_uri_prefix="http://"
--appc_store_dir="/tmp/mesos/store/appc" --authenticate_http_readonly="true" --authenticate_http_readwrite="true"
--authenticatee="crammd5" --authentication_backoff_factor="1secs" --authorizer="local" --cgroups_cpu_enable_pids_and_tids_count="false"
--cgroups_enable_cfs="false" --cgroups_hierarchy="/sys/fs/cgroup" --cgroups_limit_swap="false"
--cgroups_root="mesos" --container_disk_watch_interval="15secs" --containerizers="mesos" --credential="/tmp/Endpoint_SlaveEndpointTest_UnauthorizedRequest_2_XoxOcU/credential"
--default_role="*" --disk_watch_interval="1mins" --docker="docker" --docker_kill_orphans="true"
--docker_registry="https://registry-1.docker.io" --docker_remove_delay="6hrs" --docker_socket="/var/run/docker.sock"
--docker_stop_timeout="0ns" --docker_store_dir="/tmp/mesos/store/docker" --docker_volume_checkpoint_dir="/var/run/mesos/isolators/docker/volume"
--enforce_container_disk_quota="false" --executor_registration_timeout="1mins" --executor_shutdown_grace_period="5secs"
--fetcher_cache_dir="/tmp/Endpoint_SlaveEndpointTest_UnauthorizedRequest_2_XoxOcU/fetch" --fetcher_cache_size="2GB"
--frameworks_home="" --gc_delay="1weeks" --gc_disk_headroom="0.1" --hadoop_home="" --help="false"
--hostname_lookup="true" --http_authenticators="basic" --http_command_executor="false" --http_credentials="/tmp/Endpoint_SlaveEndpointTest_UnauthorizedRequest_2_XoxOcU/http_credentials"
--http_heartbeat_interval="30secs" --initialize_driver_logging="true" --isolation="posix/cpu,posix/mem"
--launcher="posix" --launcher_dir="/mesos/mesos-1.2.0/_build/src" --logbufsecs="0" --logging_level="INFO"
--max_completed_executors_per_framework="150" --oversubscribed_resources_interval="15secs"
--perf_duration="10secs" --perf_interval="1mins" --qos_correction_interval_min="0ns" --quiet="false"
--recover="reconnect" --recovery_timeout="15mins" --registration_backoff_factor="10ms" --resources="cpus:2;gpus:0;mem:1024;disk:1024;ports:[31000-32000]"
--revocable_cpu_low_priority="true" --runtime_dir="/tmp/Endpoint_SlaveEndpointTest_UnauthorizedRequest_2_XoxOcU"
--sandbox_directory="/mnt/mesos/sandbox" --strict="true" --switch_user="true" --systemd_enable_support="true"
--systemd_runtime_directory="/run/systemd/system" --version="false" --work_dir="/tmp/Endpoint_SlaveEndpointTest_UnauthorizedRequest_2_qmQooE"
I0203 21:51:14.099390 28631 credentials.hpp:86] Loading credential for authentication from
'/tmp/Endpoint_SlaveEndpointTest_UnauthorizedRequest_2_XoxOcU/credential'
I0203 21:51:14.099635 28631 slave.cpp:352] Agent using credential for: test-principal
I0203 21:51:14.099659 28631 credentials.hpp:37] Loading credentials for authentication from
'/tmp/Endpoint_SlaveEndpointTest_UnauthorizedRequest_2_XoxOcU/http_credentials'
I0203 21:51:14.099982 28631 http.cpp:919] Using default 'basic' HTTP authenticator for realm
'mesos-agent-readonly'
I0203 21:51:14.100191 28631 http.cpp:919] Using default 'basic' HTTP authenticator for realm
'mesos-agent-readwrite'
I0203 21:51:14.101359 28631 slave.cpp:539] Agent resources: cpus(*):2; mem(*):1024; disk(*):1024;
ports(*):[31000-32000]
I0203 21:51:14.101438 28631 slave.cpp:547] Agent attributes: [  ]
I0203 21:51:14.101478 28631 slave.cpp:552] Agent hostname: e88d0f1e4cb5
I0203 21:51:14.101708 28633 status_update_manager.cpp:177] Pausing sending status updates
I0203 21:51:14.102946 28621 state.cpp:60] Recovering state from '/tmp/Endpoint_SlaveEndpointTest_UnauthorizedRequest_2_qmQooE/meta'
I0203 21:51:14.103231 28635 status_update_manager.cpp:203] Recovering status update manager
I0203 21:51:14.103539 28630 containerizer.cpp:599] Recovering containerizer
I0203 21:51:14.104898 28625 provisioner.cpp:410] Provisioner recovery complete
I0203 21:51:14.105278 28621 slave.cpp:5422] Finished recovery
I0203 21:51:14.105798 28621 slave.cpp:5596] Querying resource estimator for oversubscribable
resources
I0203 21:51:14.106181 28623 slave.cpp:5610] Received oversubscribable resources {} from the
resource estimator
I0203 21:51:14.108876 28627 process.cpp:3697] Handling HTTP event for process 'slave(692)'
with path: '/slave(692)/containers'
I0203 21:51:14.110124 28633 http.cpp:871] Authorizing principal 'test-principal' to GET the
'/containers' endpoint
I0203 21:51:14.113065 28635 slave.cpp:801] Agent terminating
[       OK ] Endpoint/SlaveEndpointTest.UnauthorizedRequest/2 (27 ms)
[ RUN      ] Endpoint/SlaveEndpointTest.NoAuthorizer/0
I0203 21:51:14.123648 28603 containerizer.cpp:220] Using isolation: posix/cpu,posix/mem,filesystem/posix,network/cni
W0203 21:51:14.124320 28603 backend.cpp:76] Failed to create 'aufs' backend: AufsBackend requires
root privileges
W0203 21:51:14.124440 28603 backend.cpp:76] Failed to create 'bind' backend: BindBackend requires
root privileges
I0203 21:51:14.124483 28603 provisioner.cpp:249] Using default backend 'copy'
I0203 21:51:14.126332 28603 cluster.cpp:446] Creating default 'local' authorizer
I0203 21:51:14.128348 28636 slave.cpp:209] Mesos agent started on (693)@172.17.0.3:50736
I0203 21:51:14.128387 28636 slave.cpp:210] Flags at startup: --acls="" --appc_simple_discovery_uri_prefix="http://"
--appc_store_dir="/tmp/mesos/store/appc" --authenticate_http_readonly="true" --authenticate_http_readwrite="true"
--authenticatee="crammd5" --authentication_backoff_factor="1secs" --authorizer="local" --cgroups_cpu_enable_pids_and_tids_count="false"
--cgroups_enable_cfs="false" --cgroups_hierarchy="/sys/fs/cgroup" --cgroups_limit_swap="false"
--cgroups_root="mesos" --container_disk_watch_interval="15secs" --containerizers="mesos" --credential="/tmp/Endpoint_SlaveEndpointTest_NoAuthorizer_0_PrANHV/credential"
--default_role="*" --disk_watch_interval="1mins" --docker="docker" --docker_kill_orphans="true"
--docker_registry="https://registry-1.docker.io" --docker_remove_delay="6hrs" --docker_socket="/var/run/docker.sock"
--docker_stop_timeout="0ns" --docker_store_dir="/tmp/mesos/store/docker" --docker_volume_checkpoint_dir="/var/run/mesos/isolators/docker/volume"
--enforce_container_disk_quota="false" --executor_registration_timeout="1mins" --executor_shutdown_grace_period="5secs"
--fetcher_cache_dir="/tmp/Endpoint_SlaveEndpointTest_NoAuthorizer_0_PrANHV/fetch" --fetcher_cache_size="2GB"
--frameworks_home="" --gc_delay="1weeks" --gc_disk_headroom="0.1" --hadoop_home="" --help="false"
--hostname_lookup="true" --http_authenticators="basic" --http_command_executor="false" --http_credentials="/tmp/Endpoint_SlaveEndpointTest_NoAuthorizer_0_PrANHV/http_credentials"
--http_heartbeat_interval="30secs" --initialize_driver_logging="true" --isolation="posix/cpu,posix/mem"
--launcher="posix" --launcher_dir="/mesos/mesos-1.2.0/_build/src" --logbufsecs="0" --logging_level="INFO"
--max_completed_executors_per_framework="150" --oversubscribed_resources_interval="15secs"
--perf_duration="10secs" --perf_interval="1mins" --qos_correction_interval_min="0ns" --quiet="false"
--recover="reconnect" --recovery_timeout="15mins" --registration_backoff_factor="10ms" --resources="cpus:2;gpus:0;mem:1024;disk:1024;ports:[31000-32000]"
--revocable_cpu_low_priority="true" --runtime_dir="/tmp/Endpoint_SlaveEndpointTest_NoAuthorizer_0_PrANHV"
--sandbox_directory="/mnt/mesos/sandbox" --strict="true" --switch_user="true" --systemd_enable_support="true"
--systemd_runtime_directory="/run/systemd/system" --version="false" --work_dir="/tmp/Endpoint_SlaveEndpointTest_NoAuthorizer_0_Oq1QOF"
I0203 21:51:14.128904 28636 credentials.hpp:86] Loading credential for authentication from
'/tmp/Endpoint_SlaveEndpointTest_NoAuthorizer_0_PrANHV/credential'
I0203 21:51:14.129096 28636 slave.cpp:352] Agent using credential for: test-principal
I0203 21:51:14.129119 28636 credentials.hpp:37] Loading credentials for authentication from
'/tmp/Endpoint_SlaveEndpointTest_NoAuthorizer_0_PrANHV/http_credentials'
I0203 21:51:14.129348 28636 http.cpp:919] Using default 'basic' HTTP authenticator for realm
'mesos-agent-readonly'
I0203 21:51:14.129508 28636 http.cpp:919] Using default 'basic' HTTP authenticator for realm
'mesos-agent-readwrite'
I0203 21:51:14.130692 28636 slave.cpp:539] Agent resources: cpus(*):2; mem(*):1024; disk(*):1024;
ports(*):[31000-32000]
I0203 21:51:14.130769 28636 slave.cpp:547] Agent attributes: [  ]
I0203 21:51:14.130784 28636 slave.cpp:552] Agent hostname: e88d0f1e4cb5
I0203 21:51:14.130923 28629 status_update_manager.cpp:177] Pausing sending status updates
I0203 21:51:14.132127 28630 state.cpp:60] Recovering state from '/tmp/Endpoint_SlaveEndpointTest_NoAuthorizer_0_Oq1QOF/meta'
I0203 21:51:14.132380 28623 status_update_manager.cpp:203] Recovering status update manager
I0203 21:51:14.132580 28632 containerizer.cpp:599] Recovering containerizer
I0203 21:51:14.133841 28633 provisioner.cpp:410] Provisioner recovery complete
I0203 21:51:14.134174 28634 slave.cpp:5422] Finished recovery
I0203 21:51:14.134680 28634 slave.cpp:5596] Querying resource estimator for oversubscribable
resources
I0203 21:51:14.135004 28622 slave.cpp:5610] Received oversubscribable resources {} from the
resource estimator
I0203 21:51:14.137222 28624 process.cpp:3697] Handling HTTP event for process 'slave(693)'
with path: '/slave(693)/monitor/statistics'
I0203 21:51:14.138403 28634 http.cpp:871] Authorizing principal 'test-principal' to GET the
'/monitor/statistics' endpoint
I0203 21:51:14.141204 28623 slave.cpp:801] Agent terminating
[       OK ] Endpoint/SlaveEndpointTest.NoAuthorizer/0 (29 ms)
[ RUN      ] Endpoint/SlaveEndpointTest.NoAuthorizer/1
I0203 21:51:14.152828 28603 containerizer.cpp:220] Using isolation: posix/cpu,posix/mem,filesystem/posix,network/cni
W0203 21:51:14.153483 28603 backend.cpp:76] Failed to create 'aufs' backend: AufsBackend requires
root privileges
W0203 21:51:14.153611 28603 backend.cpp:76] Failed to create 'bind' backend: BindBackend requires
root privileges
I0203 21:51:14.153657 28603 provisioner.cpp:249] Using default backend 'copy'
I0203 21:51:14.155468 28603 cluster.cpp:446] Creating default 'local' authorizer
I0203 21:51:14.157582 28621 slave.cpp:209] Mesos agent started on (694)@172.17.0.3:50736
I0203 21:51:14.157618 28621 slave.cpp:210] Flags at startup: --acls="" --appc_simple_discovery_uri_prefix="http://"
--appc_store_dir="/tmp/mesos/store/appc" --authenticate_http_readonly="true" --authenticate_http_readwrite="true"
--authenticatee="crammd5" --authentication_backoff_factor="1secs" --authorizer="local" --cgroups_cpu_enable_pids_and_tids_count="false"
--cgroups_enable_cfs="false" --cgroups_hierarchy="/sys/fs/cgroup" --cgroups_limit_swap="false"
--cgroups_root="mesos" --container_disk_watch_interval="15secs" --containerizers="mesos" --credential="/tmp/Endpoint_SlaveEndpointTest_NoAuthorizer_1_jB7FvX/credential"
--default_role="*" --disk_watch_interval="1mins" --docker="docker" --docker_kill_orphans="true"
--docker_registry="https://registry-1.docker.io" --docker_remove_delay="6hrs" --docker_socket="/var/run/docker.sock"
--docker_stop_timeout="0ns" --docker_store_dir="/tmp/mesos/store/docker" --docker_volume_checkpoint_dir="/var/run/mesos/isolators/docker/volume"
--enforce_container_disk_quota="false" --executor_registration_timeout="1mins" --executor_shutdown_grace_period="5secs"
--fetcher_cache_dir="/tmp/Endpoint_SlaveEndpointTest_NoAuthorizer_1_jB7FvX/fetch" --fetcher_cache_size="2GB"
--frameworks_home="" --gc_delay="1weeks" --gc_disk_headroom="0.1" --hadoop_home="" --help="false"
--hostname_lookup="true" --http_authenticators="basic" --http_command_executor="false" --http_credentials="/tmp/Endpoint_SlaveEndpointTest_NoAuthorizer_1_jB7FvX/http_credentials"
--http_heartbeat_interval="30secs" --initialize_driver_logging="true" --isolation="posix/cpu,posix/mem"
--launcher="posix" --launcher_dir="/mesos/mesos-1.2.0/_build/src" --logbufsecs="0" --logging_level="INFO"
--max_completed_executors_per_framework="150" --oversubscribed_resources_interval="15secs"
--perf_duration="10secs" --perf_interval="1mins" --qos_correction_interval_min="0ns" --quiet="false"
--recover="reconnect" --recovery_timeout="15mins" --registration_backoff_factor="10ms" --resources="cpus:2;gpus:0;mem:1024;disk:1024;ports:[31000-32000]"
--revocable_cpu_low_priority="true" --runtime_dir="/tmp/Endpoint_SlaveEndpointTest_NoAuthorizer_1_jB7FvX"
--sandbox_directory="/mnt/mesos/sandbox" --strict="true" --switch_user="true" --systemd_enable_support="true"
--systemd_runtime_directory="/run/systemd/system" --version="false" --work_dir="/tmp/Endpoint_SlaveEndpointTest_NoAuthorizer_1_0QtZxH"
I0203 21:51:14.158090 28621 credentials.hpp:86] Loading credential for authentication from
'/tmp/Endpoint_SlaveEndpointTest_NoAuthorizer_1_jB7FvX/credential'
I0203 21:51:14.158260 28621 slave.cpp:352] Agent using credential for: test-principal
I0203 21:51:14.158285 28621 credentials.hpp:37] Loading credentials for authentication from
'/tmp/Endpoint_SlaveEndpointTest_NoAuthorizer_1_jB7FvX/http_credentials'
I0203 21:51:14.158506 28621 http.cpp:919] Using default 'basic' HTTP authenticator for realm
'mesos-agent-readonly'
I0203 21:51:14.158653 28621 http.cpp:919] Using default 'basic' HTTP authenticator for realm
'mesos-agent-readwrite'
I0203 21:51:14.159762 28621 slave.cpp:539] Agent resources: cpus(*):2; mem(*):1024; disk(*):1024;
ports(*):[31000-32000]
I0203 21:51:14.159837 28621 slave.cpp:547] Agent attributes: [  ]
I0203 21:51:14.159850 28621 slave.cpp:552] Agent hostname: e88d0f1e4cb5
I0203 21:51:14.159982 28631 status_update_manager.cpp:177] Pausing sending status updates
I0203 21:51:14.161128 28631 state.cpp:60] Recovering state from '/tmp/Endpoint_SlaveEndpointTest_NoAuthorizer_1_0QtZxH/meta'
I0203 21:51:14.161371 28636 status_update_manager.cpp:203] Recovering status update manager
I0203 21:51:14.161588 28623 containerizer.cpp:599] Recovering containerizer
I0203 21:51:14.163010 28635 provisioner.cpp:410] Provisioner recovery complete
I0203 21:51:14.163300 28630 slave.cpp:5422] Finished recovery
I0203 21:51:14.163820 28630 slave.cpp:5596] Querying resource estimator for oversubscribable
resources
I0203 21:51:14.164057 28624 slave.cpp:5610] Received oversubscribable resources {} from the
resource estimator
I0203 21:51:14.166309 28625 process.cpp:3697] Handling HTTP event for process 'slave(694)'
with path: '/slave(694)/monitor/statistics.json'
I0203 21:51:14.167425 28625 http.cpp:871] Authorizing principal 'test-principal' to GET the
'/monitor/statistics.json' endpoint
I0203 21:51:14.170258 28628 slave.cpp:801] Agent terminating
[       OK ] Endpoint/SlaveEndpointTest.NoAuthorizer/1 (29 ms)
[ RUN      ] Endpoint/SlaveEndpointTest.NoAuthorizer/2
I0203 21:51:14.182271 28603 containerizer.cpp:220] Using isolation: posix/cpu,posix/mem,filesystem/posix,network/cni
W0203 21:51:14.182931 28603 backend.cpp:76] Failed to create 'aufs' backend: AufsBackend requires
root privileges
W0203 21:51:14.183058 28603 backend.cpp:76] Failed to create 'bind' backend: BindBackend requires
root privileges
I0203 21:51:14.183101 28603 provisioner.cpp:249] Using default backend 'copy'
I0203 21:51:14.184857 28603 cluster.cpp:446] Creating default 'local' authorizer
I0203 21:51:14.186408 28626 slave.cpp:209] Mesos agent started on (695)@172.17.0.3:50736
I0203 21:51:14.186447 28626 slave.cpp:210] Flags at startup: --acls="" --appc_simple_discovery_uri_prefix="http://"
--appc_store_dir="/tmp/mesos/store/appc" --authenticate_http_readonly="true" --authenticate_http_readwrite="true"
--authenticatee="crammd5" --authentication_backoff_factor="1secs" --authorizer="local" --cgroups_cpu_enable_pids_and_tids_count="false"
--cgroups_enable_cfs="false" --cgroups_hierarchy="/sys/fs/cgroup" --cgroups_limit_swap="false"
--cgroups_root="mesos" --container_disk_watch_interval="15secs" --containerizers="mesos" --credential="/tmp/Endpoint_SlaveEndpointTest_NoAuthorizer_2_7nEzCZ/credential"
--default_role="*" --disk_watch_interval="1mins" --docker="docker" --docker_kill_orphans="true"
--docker_registry="https://registry-1.docker.io" --docker_remove_delay="6hrs" --docker_socket="/var/run/docker.sock"
--docker_stop_timeout="0ns" --docker_store_dir="/tmp/mesos/store/docker" --docker_volume_checkpoint_dir="/var/run/mesos/isolators/docker/volume"
--enforce_container_disk_quota="false" --executor_registration_timeout="1mins" --executor_shutdown_grace_period="5secs"
--fetcher_cache_dir="/tmp/Endpoint_SlaveEndpointTest_NoAuthorizer_2_7nEzCZ/fetch" --fetcher_cache_size="2GB"
--frameworks_home="" --gc_delay="1weeks" --gc_disk_headroom="0.1" --hadoop_home="" --help="false"
--hostname_lookup="true" --http_authenticators="basic" --http_command_executor="false" --http_credentials="/tmp/Endpoint_SlaveEndpointTest_NoAuthorizer_2_7nEzCZ/http_credentials"
--http_heartbeat_interval="30secs" --initialize_driver_logging="true" --isolation="posix/cpu,posix/mem"
--launcher="posix" --launcher_dir="/mesos/mesos-1.2.0/_build/src" --logbufsecs="0" --logging_level="INFO"
--max_completed_executors_per_framework="150" --oversubscribed_resources_interval="15secs"
--perf_duration="10secs" --perf_interval="1mins" --qos_correction_interval_min="0ns" --quiet="false"
--recover="reconnect" --recovery_timeout="15mins" --registration_backoff_factor="10ms" --resources="cpus:2;gpus:0;mem:1024;disk:1024;ports:[31000-32000]"
--revocable_cpu_low_priority="true" --runtime_dir="/tmp/Endpoint_SlaveEndpointTest_NoAuthorizer_2_7nEzCZ"
--sandbox_directory="/mnt/mesos/sandbox" --strict="true" --switch_user="true" --systemd_enable_support="true"
--systemd_runtime_directory="/run/systemd/system" --version="false" --work_dir="/tmp/Endpoint_SlaveEndpointTest_NoAuthorizer_2_YJH7zJ"
I0203 21:51:14.186911 28626 credentials.hpp:86] Loading credential for authentication from
'/tmp/Endpoint_SlaveEndpointTest_NoAuthorizer_2_7nEzCZ/credential'
I0203 21:51:14.187064 28626 slave.cpp:352] Agent using credential for: test-principal
I0203 21:51:14.187091 28626 credentials.hpp:37] Loading credentials for authentication from
'/tmp/Endpoint_SlaveEndpointTest_NoAuthorizer_2_7nEzCZ/http_credentials'
I0203 21:51:14.187325 28626 http.cpp:919] Using default 'basic' HTTP authenticator for realm
'mesos-agent-readonly'
I0203 21:51:14.187508 28626 http.cpp:919] Using default 'basic' HTTP authenticator for realm
'mesos-agent-readwrite'
I0203 21:51:14.188742 28626 slave.cpp:539] Agent resources: cpus(*):2; mem(*):1024; disk(*):1024;
ports(*):[31000-32000]
I0203 21:51:14.188818 28626 slave.cpp:547] Agent attributes: [  ]
I0203 21:51:14.188832 28626 slave.cpp:552] Agent hostname: e88d0f1e4cb5
I0203 21:51:14.188968 28627 status_update_manager.cpp:177] Pausing sending status updates
I0203 21:51:14.190405 28622 state.cpp:60] Recovering state from '/tmp/Endpoint_SlaveEndpointTest_NoAuthorizer_2_YJH7zJ/meta'
I0203 21:51:14.190635 28633 status_update_manager.cpp:203] Recovering status update manager
I0203 21:51:14.190877 28624 containerizer.cpp:599] Recovering containerizer
I0203 21:51:14.192512 28635 provisioner.cpp:410] Provisioner recovery complete
I0203 21:51:14.192853 28622 slave.cpp:5422] Finished recovery
I0203 21:51:14.193336 28622 slave.cpp:5596] Querying resource estimator for oversubscribable
resources
I0203 21:51:14.193653 28625 slave.cpp:5610] Received oversubscribable resources {} from the
resource estimator
I0203 21:51:14.196471 28624 process.cpp:3697] Handling HTTP event for process 'slave(695)'
with path: '/slave(695)/containers'
I0203 21:51:14.197986 28624 http.cpp:871] Authorizing principal 'test-principal' to GET the
'/containers' endpoint
I0203 21:51:14.202059 28623 slave.cpp:801] Agent terminating
[       OK ] Endpoint/SlaveEndpointTest.NoAuthorizer/2 (31 ms)
[----------] 9 tests from Endpoint/SlaveEndpointTest (263 ms total)

[----------] Global test environment tear-down
[==========] 1474 tests from 166 test cases ran. (445528 ms total)
[  PASSED  ] 1473 tests.
[  FAILED  ] 1 test, listed below:
[  FAILED  ] DiskResource/PersistentVolumeTest.SharedPersistentVolumeMasterFailover/0, where
GetParam() = 0

 1 FAILED TEST
  YOU HAVE 14 DISABLED TESTS

make[4]: *** [check-local] Error 1
make[4]: Leaving directory `/mesos/mesos-1.2.0/_build/src'
make[3]: *** [check-am] Error 2
make[3]: Leaving directory `/mesos/mesos-1.2.0/_build/src'
make[2]: *** [check] Error 2
make[2]: Leaving directory `/mesos/mesos-1.2.0/_build/src'
make[1]: *** [check-recursive] Error 1
make[1]: Leaving directory `/mesos/mesos-1.2.0/_build'
make: *** [distcheck] Error 1
+ docker rmi mesos-1486156209-27386
Untagged: mesos-1486156209-27386:latest
Deleted: sha256:e6f5dcaac8542a43d84e21077877b90fa968a446ec90247f20cd1d5b35c8c689
Deleted: sha256:93abf9bcd3f523bc0518d270dfbd7137616a219dcd27cdd417706184a94f1b61
Deleted: sha256:5fee2c947d700d7e49b51e398a2e85fed7690fbeed73c6ac23ee3885a5b89fe9
Deleted: sha256:219b23f2cbc6bf97328a82678e4158a228cbcf1eb9b4443da21127b5bf6a208e
Deleted: sha256:c0444b2efdb53016ee57eb8ec0264f5960d05fbd1ec835c2b5fc98a86af46ed9
Deleted: sha256:b95cfbfc4dfe356c425e1a752cb4b2a741c868bd397bd7215b2fb114e9816931
Deleted: sha256:501e3fe4a491cbadef12082fb57cff7714664a07344c99a8d36b675cb5b60f97
Deleted: sha256:d966d017e3d116632114a1cc376b5f1cdcb80d97bea7ac846e787ac5defb3619
Deleted: sha256:bf99bb5465bdcc77ad35782e8f65db7b0b426ec78a843ebfede56940d66b5a03
Deleted: sha256:fe391dbf16c63c5c5a4d9a95816374ce314a88e56adbac20eaa99ac779c6f4b3
Deleted: sha256:c8ee37ab558ef241c3d680bb8b525d1a09dc71dd42764611cb1263851f6c36c7
Deleted: sha256:2d3f2169ac505f84477475792d1943b2f0b947ffccc8fa73d99ad4f00f5e4f55
Deleted: sha256:8efa379463016e2ae21b328504e97f47f29ba9653a2c44598800bad12f67f964
Deleted: sha256:5ee7ef6218c82425c84d635e4883f9f9549812a482779f8bad1315212cfa5139
Deleted: sha256:18e3735a9539987b49573fccf7be848e8f009901b1d33a53ab641706d17f426f
Deleted: sha256:96ae875218cc85f76df86e64ebb351a212a27576753ac26860565e16a34ff035
Deleted: sha256:0a091536b32419113e5c0d721047c9e840affc7f01d39189b67757623bfb8390
Deleted: sha256:499612707d95dae33245b90f2ce3c850f7d5f5334999a2274cc1ccd9410491f4
Deleted: sha256:2f7a844d4266bb4f1d3bf1f69b836ff369d62b1a0449938b446acff160d93266
Deleted: sha256:ed975ddf0cef9f37490ccec01c2a684f5de2df0a0dfdd4648101830d31177bae
Deleted: sha256:e18273460ed3568d0b0030122942c50183caad3131e17e7548244f045fca715a
Deleted: sha256:cdc1bbd852d1e0943dd84635eda322bdc9417347ad5561c46ee08cc6a0763b8c
Deleted: sha256:fdd160507f294c5be6d86c49785570394ca7926bb9a932ee72e8f8ad8791ddb3
Deleted: sha256:b10db4c65c97912e628bc4a26d105d291c15630ec0dc01d9a46cb5f32f585ee5
Build step 'Execute shell' marked build as failure

Mime
View raw message