mesos-builds mailing list archives

Site index · List index
Message view « Date » · « Thread »
Top « Date » · « Thread »
From Anand Mazumdar <an...@mesosphere.io>
Subject Re: Build failed in Jenkins: Mesos-Buildbot » cmake,gcc,--verbose,GLOG_v=1 MESOS_VERBOSE=1,ubuntu:14.04,(docker||Hadoop)&&(!ubuntu-us1)&&(!ubuntu-eu2) #3305
Date Fri, 24 Feb 2017 05:56:25 GMT
Jay, looks like you added this test recently. Can you help triage?

Also related, looks like MasterTest.MultiRoleSchedulerUpgrade failed during a separate run:
https://builds.apache.org/job/Mesos-Buildbot/BUILDTOOL=autotools,COMPILER=gcc,CONFIGURATION=--verbose%20--enable-libevent%20--enable-ssl,ENVIRONMENT=GLOG_v=1%20MESOS_VERBOSE=1,OS=centos:7,label_exp=(docker%7C%7CHadoop)&&(!ubuntu-us1)&&(!ubuntu-eu2)/3304/console
<https://builds.apache.org/job/Mesos-Buildbot/BUILDTOOL=autotools,COMPILER=gcc,CONFIGURATION=--verbose%20--enable-libevent%20--enable-ssl,ENVIRONMENT=GLOG_v=1%20MESOS_VERBOSE=1,OS=centos:7,label_exp=(docker||Hadoop)&&(!ubuntu-us1)&&(!ubuntu-eu2)/3304/console>

-anand

> On Feb 23, 2017, at 9:39 PM, Apache Jenkins Server <jenkins@builds.apache.org>
wrote:
> 
> See <https://builds.apache.org/job/Mesos-Buildbot/BUILDTOOL=cmake,COMPILER=gcc,CONFIGURATION=--verbose,ENVIRONMENT=GLOG_v=1%20MESOS_VERBOSE=1,OS=ubuntu%3A14.04,label_exp=(docker%7C%7CHadoop)&&(!ubuntu-us1)&&(!ubuntu-eu2)/3305/display/redirect?page=changes>
> 
> Changes:
> 
> [adam] Wrapped IOSwitchboard.connect() in a dispatch.
> 
> [adam] Update changelog for 1.2.0-rc2.
> 
> ------------------------------------------
> [...truncated 23.95 MB...]
> I0224 05:39:27.307695 26233 status_update_manager.cpp:177] Pausing sending status updates
> I0224 05:39:27.307955 26234 state.cpp:62] Recovering state from '/tmp/Endpoint_SlaveEndpointTest_AuthorizedRequest_1_1Bnaqk/meta'
> I0224 05:39:27.308092 26234 status_update_manager.cpp:203] Recovering status update manager
> I0224 05:39:27.308185 26240 containerizer.cpp:599] Recovering containerizer
> I0224 05:39:27.308746 26238 provisioner.cpp:410] Provisioner recovery complete
> I0224 05:39:27.308991 26239 slave.cpp:5559] Finished recovery
> I0224 05:39:27.309340 26239 slave.cpp:5733] Querying resource estimator for oversubscribable
resources
> I0224 05:39:27.309442 26230 slave.cpp:5747] Received oversubscribable resources {} from
the resource estimator
> I0224 05:39:27.310071 26229 process.cpp:3704] Handling HTTP event for process 'slave(701)'
with path: '/slave(701)/monitor/statistics.json'
> I0224 05:39:27.310438 26233 http.cpp:885] Authorizing principal 'test-principal' to GET
the '/monitor/statistics.json' endpoint
> I0224 05:39:27.311769 26232 slave.cpp:803] Agent terminating
> [       OK ] Endpoint/SlaveEndpointTest.AuthorizedRequest/1 (12 ms)
> [ RUN      ] Endpoint/SlaveEndpointTest.AuthorizedRequest/2
> I0224 05:39:27.317595 26224 containerizer.cpp:220] Using isolation: posix/cpu,posix/mem,filesystem/posix,network/cni
> W0224 05:39:27.317973 26224 backend.cpp:76] Failed to create 'aufs' backend: AufsBackend
requires root privileges
> W0224 05:39:27.318023 26224 backend.cpp:76] Failed to create 'bind' backend: BindBackend
requires root privileges
> I0224 05:39:27.318043 26224 provisioner.cpp:249] Using default backend 'copy'
> I0224 05:39:27.319247 26238 slave.cpp:211] Mesos agent started on (702)@172.17.0.2:58981
> I0224 05:39:27.319268 26238 slave.cpp:212] Flags at startup: --acls="" --appc_simple_discovery_uri_prefix="http://"
--appc_store_dir="/tmp/mesos/store/appc" --authenticate_http_readonly="true" --authenticate_http_readwrite="true"
--authenticatee="crammd5" --authentication_backoff_factor="1secs" --authorizer="local" --cgroups_cpu_enable_pids_and_tids_count="false"
--cgroups_enable_cfs="false" --cgroups_hierarchy="/sys/fs/cgroup" --cgroups_limit_swap="false"
--cgroups_root="mesos" --container_disk_watch_interval="15secs" --containerizers="mesos" --credential="/tmp/Endpoint_SlaveEndpointTest_AuthorizedRequest_2_AkL7lw/credential"
--default_role="*" --disk_watch_interval="1mins" --docker="docker" --docker_kill_orphans="true"
--docker_registry="https://registry-1.docker.io" --docker_remove_delay="6hrs" --docker_socket="/var/run/docker.sock"
--docker_stop_timeout="0ns" --docker_store_dir="/tmp/mesos/store/docker" --docker_volume_checkpoint_dir="/var/run/mesos/isolators/docker/volume"
--enforce_container_disk_quota="false" --executor_registration_timeout="1mins" --executor_shutdown_grace_period="5secs"
--fetcher_cache_dir="/tmp/Endpoint_SlaveEndpointTest_AuthorizedRequest_2_AkL7lw/fetch" --fetcher_cache_size="2GB"
--frameworks_home="" --gc_delay="1weeks" --gc_disk_headroom="0.1" --hadoop_home="" --help="false"
--hostname_lookup="true" --http_authenticators="basic" --http_command_executor="false" --http_credentials="/tmp/Endpoint_SlaveEndpointTest_AuthorizedRequest_2_AkL7lw/http_credentials"
--http_heartbeat_interval="30secs" --initialize_driver_logging="true" --isolation="posix/cpu,posix/mem"
--launcher="posix" --launcher_dir="/mesos/build/src" --logbufsecs="0" --logging_level="INFO"
--max_completed_executors_per_framework="150" --oversubscribed_resources_interval="15secs"
--perf_duration="10secs" --perf_interval="1mins" --qos_correction_interval_min="0ns" --quiet="false"
--recover="reconnect" --recovery_timeout="15mins" --registration_backoff_factor="10ms" --resources="cpus:2;gpus:0;mem:1024;disk:1024;ports:[31000-32000]"
--revocable_cpu_low_priority="true" --runtime_dir="/tmp/Endpoint_SlaveEndpointTest_AuthorizedRequest_2_AkL7lw"
--sandbox_directory="/mnt/mesos/sandbox" --strict="true" --switch_user="true" --systemd_enable_support="true"
--systemd_runtime_directory="/run/systemd/system" --version="false" --work_dir="/tmp/Endpoint_SlaveEndpointTest_AuthorizedRequest_2_XXx3KS"
> I0224 05:39:27.319706 26238 credentials.hpp:86] Loading credential for authentication
from '/tmp/Endpoint_SlaveEndpointTest_AuthorizedRequest_2_AkL7lw/credential'
> I0224 05:39:27.319833 26238 slave.cpp:354] Agent using credential for: test-principal
> I0224 05:39:27.319847 26238 credentials.hpp:37] Loading credentials for authentication
from '/tmp/Endpoint_SlaveEndpointTest_AuthorizedRequest_2_AkL7lw/http_credentials'
> I0224 05:39:27.319965 26238 http.cpp:933] Using default 'basic' HTTP authenticator for
realm 'mesos-agent-readonly'
> I0224 05:39:27.320013 26238 http.cpp:933] Using default 'basic' HTTP authenticator for
realm 'mesos-agent-readwrite'
> I0224 05:39:27.320489 26238 slave.cpp:541] Agent resources: cpus(*):2; mem(*):1024; disk(*):1024;
ports(*):[31000-32000]
> I0224 05:39:27.320533 26238 slave.cpp:549] Agent attributes: [  ]
> I0224 05:39:27.320540 26238 slave.cpp:554] Agent hostname: 211b663da740
> I0224 05:39:27.320610 26229 status_update_manager.cpp:177] Pausing sending status updates
> I0224 05:39:27.320925 26230 state.cpp:62] Recovering state from '/tmp/Endpoint_SlaveEndpointTest_AuthorizedRequest_2_XXx3KS/meta'
> I0224 05:39:27.321065 26230 status_update_manager.cpp:203] Recovering status update manager
> I0224 05:39:27.321166 26240 containerizer.cpp:599] Recovering containerizer
> I0224 05:39:27.321645 26230 provisioner.cpp:410] Provisioner recovery complete
> I0224 05:39:27.321833 26231 slave.cpp:5559] Finished recovery
> I0224 05:39:27.322321 26231 slave.cpp:5733] Querying resource estimator for oversubscribable
resources
> I0224 05:39:27.322458 26228 slave.cpp:5747] Received oversubscribable resources {} from
the resource estimator
> I0224 05:39:27.323226 26225 process.cpp:3704] Handling HTTP event for process 'slave(702)'
with path: '/slave(702)/containers'
> I0224 05:39:27.323674 26240 http.cpp:885] Authorizing principal 'test-principal' to GET
the '/containers' endpoint
> I0224 05:39:27.324848 26232 slave.cpp:803] Agent terminating
> [       OK ] Endpoint/SlaveEndpointTest.AuthorizedRequest/2 (13 ms)
> [ RUN      ] Endpoint/SlaveEndpointTest.UnauthorizedRequest/0
> I0224 05:39:27.329741 26224 containerizer.cpp:220] Using isolation: posix/cpu,posix/mem,filesystem/posix,network/cni
> W0224 05:39:27.330018 26224 backend.cpp:76] Failed to create 'aufs' backend: AufsBackend
requires root privileges
> W0224 05:39:27.330061 26224 backend.cpp:76] Failed to create 'bind' backend: BindBackend
requires root privileges
> I0224 05:39:27.330078 26224 provisioner.cpp:249] Using default backend 'copy'
> I0224 05:39:27.331135 26225 slave.cpp:211] Mesos agent started on (703)@172.17.0.2:58981
> I0224 05:39:27.331154 26225 slave.cpp:212] Flags at startup: --acls="" --appc_simple_discovery_uri_prefix="http://"
--appc_store_dir="/tmp/mesos/store/appc" --authenticate_http_readonly="true" --authenticate_http_readwrite="true"
--authenticatee="crammd5" --authentication_backoff_factor="1secs" --authorizer="local" --cgroups_cpu_enable_pids_and_tids_count="false"
--cgroups_enable_cfs="false" --cgroups_hierarchy="/sys/fs/cgroup" --cgroups_limit_swap="false"
--cgroups_root="mesos" --container_disk_watch_interval="15secs" --containerizers="mesos" --credential="/tmp/Endpoint_SlaveEndpointTest_UnauthorizedRequest_0_8zonR4/credential"
--default_role="*" --disk_watch_interval="1mins" --docker="docker" --docker_kill_orphans="true"
--docker_registry="https://registry-1.docker.io" --docker_remove_delay="6hrs" --docker_socket="/var/run/docker.sock"
--docker_stop_timeout="0ns" --docker_store_dir="/tmp/mesos/store/docker" --docker_volume_checkpoint_dir="/var/run/mesos/isolators/docker/volume"
--enforce_container_disk_quota="false" --executor_registration_timeout="1mins" --executor_shutdown_grace_period="5secs"
--fetcher_cache_dir="/tmp/Endpoint_SlaveEndpointTest_UnauthorizedRequest_0_8zonR4/fetch" --fetcher_cache_size="2GB"
--frameworks_home="" --gc_delay="1weeks" --gc_disk_headroom="0.1" --hadoop_home="" --help="false"
--hostname_lookup="true" --http_authenticators="basic" --http_command_executor="false" --http_credentials="/tmp/Endpoint_SlaveEndpointTest_UnauthorizedRequest_0_8zonR4/http_credentials"
--http_heartbeat_interval="30secs" --initialize_driver_logging="true" --isolation="posix/cpu,posix/mem"
--launcher="posix" --launcher_dir="/mesos/build/src" --logbufsecs="0" --logging_level="INFO"
--max_completed_executors_per_framework="150" --oversubscribed_resources_interval="15secs"
--perf_duration="10secs" --perf_interval="1mins" --qos_correction_interval_min="0ns" --quiet="false"
--recover="reconnect" --recovery_timeout="15mins" --registration_backoff_factor="10ms" --resources="cpus:2;gpus:0;mem:1024;disk:1024;ports:[31000-32000]"
--revocable_cpu_low_priority="true" --runtime_dir="/tmp/Endpoint_SlaveEndpointTest_UnauthorizedRequest_0_8zonR4"
--sandbox_directory="/mnt/mesos/sandbox" --strict="true" --switch_user="true" --systemd_enable_support="true"
--systemd_runtime_directory="/run/systemd/system" --version="false" --work_dir="/tmp/Endpoint_SlaveEndpointTest_UnauthorizedRequest_0_Mx2fer"
> I0224 05:39:27.331454 26225 credentials.hpp:86] Loading credential for authentication
from '/tmp/Endpoint_SlaveEndpointTest_UnauthorizedRequest_0_8zonR4/credential'
> I0224 05:39:27.331558 26225 slave.cpp:354] Agent using credential for: test-principal
> I0224 05:39:27.331570 26225 credentials.hpp:37] Loading credentials for authentication
from '/tmp/Endpoint_SlaveEndpointTest_UnauthorizedRequest_0_8zonR4/http_credentials'
> I0224 05:39:27.331672 26225 http.cpp:933] Using default 'basic' HTTP authenticator for
realm 'mesos-agent-readonly'
> I0224 05:39:27.331720 26225 http.cpp:933] Using default 'basic' HTTP authenticator for
realm 'mesos-agent-readwrite'
> I0224 05:39:27.332129 26225 slave.cpp:541] Agent resources: cpus(*):2; mem(*):1024; disk(*):1024;
ports(*):[31000-32000]
> I0224 05:39:27.332164 26225 slave.cpp:549] Agent attributes: [  ]
> I0224 05:39:27.332170 26225 slave.cpp:554] Agent hostname: 211b663da740
> I0224 05:39:27.332226 26231 status_update_manager.cpp:177] Pausing sending status updates
> I0224 05:39:27.332542 26232 state.cpp:62] Recovering state from '/tmp/Endpoint_SlaveEndpointTest_UnauthorizedRequest_0_Mx2fer/meta'
> I0224 05:39:27.332788 26237 status_update_manager.cpp:203] Recovering status update manager
> I0224 05:39:27.332880 26225 containerizer.cpp:599] Recovering containerizer
> I0224 05:39:27.333408 26228 provisioner.cpp:410] Provisioner recovery complete
> I0224 05:39:27.333586 26229 slave.cpp:5559] Finished recovery
> I0224 05:39:27.333987 26229 slave.cpp:5733] Querying resource estimator for oversubscribable
resources
> I0224 05:39:27.334121 26225 slave.cpp:5747] Received oversubscribable resources {} from
the resource estimator
> I0224 05:39:27.334923 26230 process.cpp:3704] Handling HTTP event for process 'slave(703)'
with path: '/slave(703)/monitor/statistics'
> I0224 05:39:27.335393 26236 http.cpp:885] Authorizing principal 'test-principal' to GET
the '/monitor/statistics' endpoint
> I0224 05:39:27.336585 26229 slave.cpp:803] Agent terminating
> [       OK ] Endpoint/SlaveEndpointTest.UnauthorizedRequest/0 (11 ms)
> [ RUN      ] Endpoint/SlaveEndpointTest.UnauthorizedRequest/1
> I0224 05:39:27.341213 26224 containerizer.cpp:220] Using isolation: posix/cpu,posix/mem,filesystem/posix,network/cni
> W0224 05:39:27.341460 26224 backend.cpp:76] Failed to create 'aufs' backend: AufsBackend
requires root privileges
> W0224 05:39:27.341497 26224 backend.cpp:76] Failed to create 'bind' backend: BindBackend
requires root privileges
> I0224 05:39:27.341523 26224 provisioner.cpp:249] Using default backend 'copy'
> I0224 05:39:27.342602 26227 slave.cpp:211] Mesos agent started on (704)@172.17.0.2:58981
> I0224 05:39:27.342620 26227 slave.cpp:212] Flags at startup: --acls="" --appc_simple_discovery_uri_prefix="http://"
--appc_store_dir="/tmp/mesos/store/appc" --authenticate_http_readonly="true" --authenticate_http_readwrite="true"
--authenticatee="crammd5" --authentication_backoff_factor="1secs" --authorizer="local" --cgroups_cpu_enable_pids_and_tids_count="false"
--cgroups_enable_cfs="false" --cgroups_hierarchy="/sys/fs/cgroup" --cgroups_limit_swap="false"
--cgroups_root="mesos" --container_disk_watch_interval="15secs" --containerizers="mesos" --credential="/tmp/Endpoint_SlaveEndpointTest_UnauthorizedRequest_1_caHbuD/credential"
--default_role="*" --disk_watch_interval="1mins" --docker="docker" --docker_kill_orphans="true"
--docker_registry="https://registry-1.docker.io" --docker_remove_delay="6hrs" --docker_socket="/var/run/docker.sock"
--docker_stop_timeout="0ns" --docker_store_dir="/tmp/mesos/store/docker" --docker_volume_checkpoint_dir="/var/run/mesos/isolators/docker/volume"
--enforce_container_disk_quota="false" --executor_registration_timeout="1mins" --executor_shutdown_grace_period="5secs"
--fetcher_cache_dir="/tmp/Endpoint_SlaveEndpointTest_UnauthorizedRequest_1_caHbuD/fetch" --fetcher_cache_size="2GB"
--frameworks_home="" --gc_delay="1weeks" --gc_disk_headroom="0.1" --hadoop_home="" --help="false"
--hostname_lookup="true" --http_authenticators="basic" --http_command_executor="false" --http_credentials="/tmp/Endpoint_SlaveEndpointTest_UnauthorizedRequest_1_caHbuD/http_credentials"
--http_heartbeat_interval="30secs" --initialize_driver_logging="true" --isolation="posix/cpu,posix/mem"
--launcher="posix" --launcher_dir="/mesos/build/src" --logbufsecs="0" --logging_level="INFO"
--max_completed_executors_per_framework="150" --oversubscribed_resources_interval="15secs"
--perf_duration="10secs" --perf_interval="1mins" --qos_correction_interval_min="0ns" --quiet="false"
--recover="reconnect" --recovery_timeout="15mins" --registration_backoff_factor="10ms" --resources="cpus:2;gpus:0;mem:1024;disk:1024;ports:[31000-32000]"
--revocable_cpu_low_priority="true" --runtime_dir="/tmp/Endpoint_SlaveEndpointTest_UnauthorizedRequest_1_caHbuD"
--sandbox_directory="/mnt/mesos/sandbox" --strict="true" --switch_user="true" --systemd_enable_support="true"
--systemd_runtime_directory="/run/systemd/system" --version="false" --work_dir="/tmp/Endpoint_SlaveEndpointTest_UnauthorizedRequest_1_o1VbPZ"
> I0224 05:39:27.343008 26227 credentials.hpp:86] Loading credential for authentication
from '/tmp/Endpoint_SlaveEndpointTest_UnauthorizedRequest_1_caHbuD/credential'
> I0224 05:39:27.343103 26227 slave.cpp:354] Agent using credential for: test-principal
> I0224 05:39:27.343140 26227 credentials.hpp:37] Loading credentials for authentication
from '/tmp/Endpoint_SlaveEndpointTest_UnauthorizedRequest_1_caHbuD/http_credentials'
> I0224 05:39:27.343267 26227 http.cpp:933] Using default 'basic' HTTP authenticator for
realm 'mesos-agent-readonly'
> I0224 05:39:27.343340 26227 http.cpp:933] Using default 'basic' HTTP authenticator for
realm 'mesos-agent-readwrite'
> I0224 05:39:27.343756 26227 slave.cpp:541] Agent resources: cpus(*):2; mem(*):1024; disk(*):1024;
ports(*):[31000-32000]
> I0224 05:39:27.343791 26227 slave.cpp:549] Agent attributes: [  ]
> I0224 05:39:27.343801 26227 slave.cpp:554] Agent hostname: 211b663da740
> I0224 05:39:27.343885 26228 status_update_manager.cpp:177] Pausing sending status updates
> I0224 05:39:27.344241 26225 state.cpp:62] Recovering state from '/tmp/Endpoint_SlaveEndpointTest_UnauthorizedRequest_1_o1VbPZ/meta'
> I0224 05:39:27.344383 26225 status_update_manager.cpp:203] Recovering status update manager
> I0224 05:39:27.344528 26233 containerizer.cpp:599] Recovering containerizer
> I0224 05:39:27.345075 26226 provisioner.cpp:410] Provisioner recovery complete
> I0224 05:39:27.345288 26235 slave.cpp:5559] Finished recovery
> I0224 05:39:27.345664 26235 slave.cpp:5733] Querying resource estimator for oversubscribable
resources
> I0224 05:39:27.345844 26231 slave.cpp:5747] Received oversubscribable resources {} from
the resource estimator
> I0224 05:39:27.347604 26240 process.cpp:3704] Handling HTTP event for process 'slave(704)'
with path: '/slave(704)/monitor/statistics.json'
> I0224 05:39:27.348037 26233 http.cpp:885] Authorizing principal 'test-principal' to GET
the '/monitor/statistics.json' endpoint
> I0224 05:39:27.349321 26225 slave.cpp:803] Agent terminating
> [       OK ] Endpoint/SlaveEndpointTest.UnauthorizedRequest/1 (14 ms)
> [ RUN      ] Endpoint/SlaveEndpointTest.UnauthorizedRequest/2
> I0224 05:39:27.356783 26224 containerizer.cpp:220] Using isolation: posix/cpu,posix/mem,filesystem/posix,network/cni
> W0224 05:39:27.357162 26224 backend.cpp:76] Failed to create 'aufs' backend: AufsBackend
requires root privileges
> W0224 05:39:27.357216 26224 backend.cpp:76] Failed to create 'bind' backend: BindBackend
requires root privileges
> I0224 05:39:27.357236 26224 provisioner.cpp:249] Using default backend 'copy'
> I0224 05:39:27.358592 26233 slave.cpp:211] Mesos agent started on (705)@172.17.0.2:58981
> I0224 05:39:27.358647 26233 slave.cpp:212] Flags at startup: --acls="" --appc_simple_discovery_uri_prefix="http://"
--appc_store_dir="/tmp/mesos/store/appc" --authenticate_http_readonly="true" --authenticate_http_readwrite="true"
--authenticatee="crammd5" --authentication_backoff_factor="1secs" --authorizer="local" --cgroups_cpu_enable_pids_and_tids_count="false"
--cgroups_enable_cfs="false" --cgroups_hierarchy="/sys/fs/cgroup" --cgroups_limit_swap="false"
--cgroups_root="mesos" --container_disk_watch_interval="15secs" --containerizers="mesos" --credential="/tmp/Endpoint_SlaveEndpointTest_UnauthorizedRequest_2_sn93fc/credential"
--default_role="*" --disk_watch_interval="1mins" --docker="docker" --docker_kill_orphans="true"
--docker_registry="https://registry-1.docker.io" --docker_remove_delay="6hrs" --docker_socket="/var/run/docker.sock"
--docker_stop_timeout="0ns" --docker_store_dir="/tmp/mesos/store/docker" --docker_volume_checkpoint_dir="/var/run/mesos/isolators/docker/volume"
--enforce_container_disk_quota="false" --executor_registration_timeout="1mins" --executor_shutdown_grace_period="5secs"
--fetcher_cache_dir="/tmp/Endpoint_SlaveEndpointTest_UnauthorizedRequest_2_sn93fc/fetch" --fetcher_cache_size="2GB"
--frameworks_home="" --gc_delay="1weeks" --gc_disk_headroom="0.1" --hadoop_home="" --help="false"
--hostname_lookup="true" --http_authenticators="basic" --http_command_executor="false" --http_credentials="/tmp/Endpoint_SlaveEndpointTest_UnauthorizedRequest_2_sn93fc/http_credentials"
--http_heartbeat_interval="30secs" --initialize_driver_logging="true" --isolation="posix/cpu,posix/mem"
--launcher="posix" --launcher_dir="/mesos/build/src" --logbufsecs="0" --logging_level="INFO"
--max_completed_executors_per_framework="150" --oversubscribed_resources_interval="15secs"
--perf_duration="10secs" --perf_interval="1mins" --qos_correction_interval_min="0ns" --quiet="false"
--recover="reconnect" --recovery_timeout="15mins" --registration_backoff_factor="10ms" --resources="cpus:2;gpus:0;mem:1024;disk:1024;ports:[31000-32000]"
--revocable_cpu_low_priority="true" --runtime_dir="/tmp/Endpoint_SlaveEndpointTest_UnauthorizedRequest_2_sn93fc"
--sandbox_directory="/mnt/mesos/sandbox" --strict="true" --switch_user="true" --systemd_enable_support="true"
--systemd_runtime_directory="/run/systemd/system" --version="false" --work_dir="/tmp/Endpoint_SlaveEndpointTest_UnauthorizedRequest_2_8YrEyy"
> I0224 05:39:27.359025 26233 credentials.hpp:86] Loading credential for authentication
from '/tmp/Endpoint_SlaveEndpointTest_UnauthorizedRequest_2_sn93fc/credential'
> I0224 05:39:27.359148 26233 slave.cpp:354] Agent using credential for: test-principal
> I0224 05:39:27.359166 26233 credentials.hpp:37] Loading credentials for authentication
from '/tmp/Endpoint_SlaveEndpointTest_UnauthorizedRequest_2_sn93fc/http_credentials'
> I0224 05:39:27.359282 26233 http.cpp:933] Using default 'basic' HTTP authenticator for
realm 'mesos-agent-readonly'
> I0224 05:39:27.359333 26233 http.cpp:933] Using default 'basic' HTTP authenticator for
realm 'mesos-agent-readwrite'
> I0224 05:39:27.359714 26233 slave.cpp:541] Agent resources: cpus(*):2; mem(*):1024; disk(*):1024;
ports(*):[31000-32000]
> I0224 05:39:27.359748 26233 slave.cpp:549] Agent attributes: [  ]
> I0224 05:39:27.359755 26233 slave.cpp:554] Agent hostname: 211b663da740
> I0224 05:39:27.359829 26230 status_update_manager.cpp:177] Pausing sending status updates
> I0224 05:39:27.360169 26237 state.cpp:62] Recovering state from '/tmp/Endpoint_SlaveEndpointTest_UnauthorizedRequest_2_8YrEyy/meta'
> I0224 05:39:27.360467 26235 status_update_manager.cpp:203] Recovering status update manager
> I0224 05:39:27.360576 26234 containerizer.cpp:599] Recovering containerizer
> I0224 05:39:27.361174 26233 provisioner.cpp:410] Provisioner recovery complete
> I0224 05:39:27.361524 26240 slave.cpp:5559] Finished recovery
> I0224 05:39:27.361963 26240 slave.cpp:5733] Querying resource estimator for oversubscribable
resources
> I0224 05:39:27.362054 26228 slave.cpp:5747] Received oversubscribable resources {} from
the resource estimator
> I0224 05:39:27.362936 26235 process.cpp:3704] Handling HTTP event for process 'slave(705)'
with path: '/slave(705)/containers'
> I0224 05:39:27.363432 26227 http.cpp:885] Authorizing principal 'test-principal' to GET
the '/containers' endpoint
> I0224 05:39:27.364408 26226 slave.cpp:803] Agent terminating
> [       OK ] Endpoint/SlaveEndpointTest.UnauthorizedRequest/2 (14 ms)
> [ RUN      ] Endpoint/SlaveEndpointTest.NoAuthorizer/0
> I0224 05:39:27.369871 26224 containerizer.cpp:220] Using isolation: posix/cpu,posix/mem,filesystem/posix,network/cni
> W0224 05:39:27.370159 26224 backend.cpp:76] Failed to create 'aufs' backend: AufsBackend
requires root privileges
> W0224 05:39:27.370203 26224 backend.cpp:76] Failed to create 'bind' backend: BindBackend
requires root privileges
> I0224 05:39:27.370223 26224 provisioner.cpp:249] Using default backend 'copy'
> I0224 05:39:27.370932 26224 cluster.cpp:446] Creating default 'local' authorizer
> I0224 05:39:27.371568 26231 slave.cpp:211] Mesos agent started on (706)@172.17.0.2:58981
> I0224 05:39:27.371582 26231 slave.cpp:212] Flags at startup: --acls="" --appc_simple_discovery_uri_prefix="http://"
--appc_store_dir="/tmp/mesos/store/appc" --authenticate_http_readonly="true" --authenticate_http_readwrite="true"
--authenticatee="crammd5" --authentication_backoff_factor="1secs" --authorizer="local" --cgroups_cpu_enable_pids_and_tids_count="false"
--cgroups_enable_cfs="false" --cgroups_hierarchy="/sys/fs/cgroup" --cgroups_limit_swap="false"
--cgroups_root="mesos" --container_disk_watch_interval="15secs" --containerizers="mesos" --credential="/tmp/Endpoint_SlaveEndpointTest_NoAuthorizer_0_8tTebL/credential"
--default_role="*" --disk_watch_interval="1mins" --docker="docker" --docker_kill_orphans="true"
--docker_registry="https://registry-1.docker.io" --docker_remove_delay="6hrs" --docker_socket="/var/run/docker.sock"
--docker_stop_timeout="0ns" --docker_store_dir="/tmp/mesos/store/docker" --docker_volume_checkpoint_dir="/var/run/mesos/isolators/docker/volume"
--enforce_container_disk_quota="false" --executor_registration_timeout="1mins" --executor_shutdown_grace_period="5secs"
--fetcher_cache_dir="/tmp/Endpoint_SlaveEndpointTest_NoAuthorizer_0_8tTebL/fetch" --fetcher_cache_size="2GB"
--frameworks_home="" --gc_delay="1weeks" --gc_disk_headroom="0.1" --hadoop_home="" --help="false"
--hostname_lookup="true" --http_authenticators="basic" --http_command_executor="false" --http_credentials="/tmp/Endpoint_SlaveEndpointTest_NoAuthorizer_0_8tTebL/http_credentials"
--http_heartbeat_interval="30secs" --initialize_driver_logging="true" --isolation="posix/cpu,posix/mem"
--launcher="posix" --launcher_dir="/mesos/build/src" --logbufsecs="0" --logging_level="INFO"
--max_completed_executors_per_framework="150" --oversubscribed_resources_interval="15secs"
--perf_duration="10secs" --perf_interval="1mins" --qos_correction_interval_min="0ns" --quiet="false"
--recover="reconnect" --recovery_timeout="15mins" --registration_backoff_factor="10ms" --resources="cpus:2;gpus:0;mem:1024;disk:1024;ports:[31000-32000]"
--revocable_cpu_low_priority="true" --runtime_dir="/tmp/Endpoint_SlaveEndpointTest_NoAuthorizer_0_8tTebL"
--sandbox_directory="/mnt/mesos/sandbox" --strict="true" --switch_user="true" --systemd_enable_support="true"
--systemd_runtime_directory="/run/systemd/system" --version="false" --work_dir="/tmp/Endpoint_SlaveEndpointTest_NoAuthorizer_0_H9zCr7"
> I0224 05:39:27.371867 26231 credentials.hpp:86] Loading credential for authentication
from '/tmp/Endpoint_SlaveEndpointTest_NoAuthorizer_0_8tTebL/credential'
> I0224 05:39:27.371958 26231 slave.cpp:354] Agent using credential for: test-principal
> I0224 05:39:27.371970 26231 credentials.hpp:37] Loading credentials for authentication
from '/tmp/Endpoint_SlaveEndpointTest_NoAuthorizer_0_8tTebL/http_credentials'
> I0224 05:39:27.372066 26231 http.cpp:933] Using default 'basic' HTTP authenticator for
realm 'mesos-agent-readonly'
> I0224 05:39:27.372145 26231 http.cpp:933] Using default 'basic' HTTP authenticator for
realm 'mesos-agent-readwrite'
> I0224 05:39:27.372602 26231 slave.cpp:541] Agent resources: cpus(*):2; mem(*):1024; disk(*):1024;
ports(*):[31000-32000]
> I0224 05:39:27.372635 26231 slave.cpp:549] Agent attributes: [  ]
> I0224 05:39:27.372640 26231 slave.cpp:554] Agent hostname: 211b663da740
> I0224 05:39:27.372746 26234 status_update_manager.cpp:177] Pausing sending status updates
> I0224 05:39:27.372956 26235 state.cpp:62] Recovering state from '/tmp/Endpoint_SlaveEndpointTest_NoAuthorizer_0_H9zCr7/meta'
> I0224 05:39:27.373175 26231 status_update_manager.cpp:203] Recovering status update manager
> I0224 05:39:27.373350 26230 containerizer.cpp:599] Recovering containerizer
> I0224 05:39:27.373965 26236 provisioner.cpp:410] Provisioner recovery complete
> I0224 05:39:27.374194 26239 slave.cpp:5559] Finished recovery
> I0224 05:39:27.374578 26239 slave.cpp:5733] Querying resource estimator for oversubscribable
resources
> I0224 05:39:27.374698 26232 slave.cpp:5747] Received oversubscribable resources {} from
the resource estimator
> I0224 05:39:27.375382 26231 process.cpp:3704] Handling HTTP event for process 'slave(706)'
with path: '/slave(706)/monitor/statistics'
> I0224 05:39:27.375766 26232 http.cpp:885] Authorizing principal 'test-principal' to GET
the '/monitor/statistics' endpoint
> I0224 05:39:27.377136 26224 slave.cpp:803] Agent terminating
> [       OK ] Endpoint/SlaveEndpointTest.NoAuthorizer/0 (11 ms)
> [ RUN      ] Endpoint/SlaveEndpointTest.NoAuthorizer/1
> I0224 05:39:27.381248 26224 containerizer.cpp:220] Using isolation: posix/cpu,posix/mem,filesystem/posix,network/cni
> W0224 05:39:27.381485 26224 backend.cpp:76] Failed to create 'aufs' backend: AufsBackend
requires root privileges
> W0224 05:39:27.381522 26224 backend.cpp:76] Failed to create 'bind' backend: BindBackend
requires root privileges
> I0224 05:39:27.381536 26224 provisioner.cpp:249] Using default backend 'copy'
> I0224 05:39:27.381955 26224 cluster.cpp:446] Creating default 'local' authorizer
> I0224 05:39:27.382515 26225 slave.cpp:211] Mesos agent started on (707)@172.17.0.2:58981
> I0224 05:39:27.382719 26225 slave.cpp:212] Flags at startup: --acls="" --appc_simple_discovery_uri_prefix="http://"
--appc_store_dir="/tmp/mesos/store/appc" --authenticate_http_readonly="true" --authenticate_http_readwrite="true"
--authenticatee="crammd5" --authentication_backoff_factor="1secs" --authorizer="local" --cgroups_cpu_enable_pids_and_tids_count="false"
--cgroups_enable_cfs="false" --cgroups_hierarchy="/sys/fs/cgroup" --cgroups_limit_swap="false"
--cgroups_root="mesos" --container_disk_watch_interval="15secs" --containerizers="mesos" --credential="/tmp/Endpoint_SlaveEndpointTest_NoAuthorizer_1_5zZ7dk/credential"
--default_role="*" --disk_watch_interval="1mins" --docker="docker" --docker_kill_orphans="true"
--docker_registry="https://registry-1.docker.io" --docker_remove_delay="6hrs" --docker_socket="/var/run/docker.sock"
--docker_stop_timeout="0ns" --docker_store_dir="/tmp/mesos/store/docker" --docker_volume_checkpoint_dir="/var/run/mesos/isolators/docker/volume"
--enforce_container_disk_quota="false" --executor_registration_timeout="1mins" --executor_shutdown_grace_period="5secs"
--fetcher_cache_dir="/tmp/Endpoint_SlaveEndpointTest_NoAuthorizer_1_5zZ7dk/fetch" --fetcher_cache_size="2GB"
--frameworks_home="" --gc_delay="1weeks" --gc_disk_headroom="0.1" --hadoop_home="" --help="false"
--hostname_lookup="true" --http_authenticators="basic" --http_command_executor="false" --http_credentials="/tmp/Endpoint_SlaveEndpointTest_NoAuthorizer_1_5zZ7dk/http_credentials"
--http_heartbeat_interval="30secs" --initialize_driver_logging="true" --isolation="posix/cpu,posix/mem"
--launcher="posix" --launcher_dir="/mesos/build/src" --logbufsecs="0" --logging_level="INFO"
--max_completed_executors_per_framework="150" --oversubscribed_resources_interval="15secs"
--perf_duration="10secs" --perf_interval="1mins" --qos_correction_interval_min="0ns" --quiet="false"
--recover="reconnect" --recovery_timeout="15mins" --registration_backoff_factor="10ms" --resources="cpus:2;gpus:0;mem:1024;disk:1024;ports:[31000-32000]"
--revocable_cpu_low_priority="true" --runtime_dir="/tmp/Endpoint_SlaveEndpointTest_NoAuthorizer_1_5zZ7dk"
--sandbox_directory="/mnt/mesos/sandbox" --strict="true" --switch_user="true" --systemd_enable_support="true"
--systemd_runtime_directory="/run/systemd/system" --version="false" --work_dir="/tmp/Endpoint_SlaveEndpointTest_NoAuthorizer_1_rQVDsG"
> I0224 05:39:27.383225 26225 credentials.hpp:86] Loading credential for authentication
from '/tmp/Endpoint_SlaveEndpointTest_NoAuthorizer_1_5zZ7dk/credential'
> I0224 05:39:27.383391 26225 slave.cpp:354] Agent using credential for: test-principal
> I0224 05:39:27.383415 26225 credentials.hpp:37] Loading credentials for authentication
from '/tmp/Endpoint_SlaveEndpointTest_NoAuthorizer_1_5zZ7dk/http_credentials'
> I0224 05:39:27.383570 26225 http.cpp:933] Using default 'basic' HTTP authenticator for
realm 'mesos-agent-readonly'
> I0224 05:39:27.383630 26225 http.cpp:933] Using default 'basic' HTTP authenticator for
realm 'mesos-agent-readwrite'
> I0224 05:39:27.384214 26225 slave.cpp:541] Agent resources: cpus(*):2; mem(*):1024; disk(*):1024;
ports(*):[31000-32000]
> I0224 05:39:27.384265 26225 slave.cpp:549] Agent attributes: [  ]
> I0224 05:39:27.384277 26225 slave.cpp:554] Agent hostname: 211b663da740
> I0224 05:39:27.384361 26235 status_update_manager.cpp:177] Pausing sending status updates
> I0224 05:39:27.384877 26236 state.cpp:62] Recovering state from '/tmp/Endpoint_SlaveEndpointTest_NoAuthorizer_1_rQVDsG/meta'
> I0224 05:39:27.385083 26225 status_update_manager.cpp:203] Recovering status update manager
> I0224 05:39:27.385395 26237 containerizer.cpp:599] Recovering containerizer
> I0224 05:39:27.385905 26230 provisioner.cpp:410] Provisioner recovery complete
> I0224 05:39:27.386099 26231 slave.cpp:5559] Finished recovery
> I0224 05:39:27.386435 26231 slave.cpp:5733] Querying resource estimator for oversubscribable
resources
> I0224 05:39:27.386607 26230 slave.cpp:5747] Received oversubscribable resources {} from
the resource estimator
> I0224 05:39:27.387325 26227 process.cpp:3704] Handling HTTP event for process 'slave(707)'
with path: '/slave(707)/monitor/statistics.json'
> I0224 05:39:27.387749 26228 http.cpp:885] Authorizing principal 'test-principal' to GET
the '/monitor/statistics.json' endpoint
> I0224 05:39:27.389065 26227 slave.cpp:803] Agent terminating
> [       OK ] Endpoint/SlaveEndpointTest.NoAuthorizer/1 (12 ms)
> [ RUN      ] Endpoint/SlaveEndpointTest.NoAuthorizer/2
> I0224 05:39:27.393745 26224 containerizer.cpp:220] Using isolation: posix/cpu,posix/mem,filesystem/posix,network/cni
> W0224 05:39:27.393992 26224 backend.cpp:76] Failed to create 'aufs' backend: AufsBackend
requires root privileges
> W0224 05:39:27.394035 26224 backend.cpp:76] Failed to create 'bind' backend: BindBackend
requires root privileges
> I0224 05:39:27.394052 26224 provisioner.cpp:249] Using default backend 'copy'
> I0224 05:39:27.394565 26224 cluster.cpp:446] Creating default 'local' authorizer
> I0224 05:39:27.395301 26226 slave.cpp:211] Mesos agent started on (708)@172.17.0.2:58981
> I0224 05:39:27.395328 26226 slave.cpp:212] Flags at startup: --acls="" --appc_simple_discovery_uri_prefix="http://"
--appc_store_dir="/tmp/mesos/store/appc" --authenticate_http_readonly="true" --authenticate_http_readwrite="true"
--authenticatee="crammd5" --authentication_backoff_factor="1secs" --authorizer="local" --cgroups_cpu_enable_pids_and_tids_count="false"
--cgroups_enable_cfs="false" --cgroups_hierarchy="/sys/fs/cgroup" --cgroups_limit_swap="false"
--cgroups_root="mesos" --container_disk_watch_interval="15secs" --containerizers="mesos" --credential="/tmp/Endpoint_SlaveEndpointTest_NoAuthorizer_2_zpn2oT/credential"
--default_role="*" --disk_watch_interval="1mins" --docker="docker" --docker_kill_orphans="true"
--docker_registry="https://registry-1.docker.io" --docker_remove_delay="6hrs" --docker_socket="/var/run/docker.sock"
--docker_stop_timeout="0ns" --docker_store_dir="/tmp/mesos/store/docker" --docker_volume_checkpoint_dir="/var/run/mesos/isolators/docker/volume"
--enforce_container_disk_quota="false" --executor_registration_timeout="1mins" --executor_shutdown_grace_period="5secs"
--fetcher_cache_dir="/tmp/Endpoint_SlaveEndpointTest_NoAuthorizer_2_zpn2oT/fetch" --fetcher_cache_size="2GB"
--frameworks_home="" --gc_delay="1weeks" --gc_disk_headroom="0.1" --hadoop_home="" --help="false"
--hostname_lookup="true" --http_authenticators="basic" --http_command_executor="false" --http_credentials="/tmp/Endpoint_SlaveEndpointTest_NoAuthorizer_2_zpn2oT/http_credentials"
--http_heartbeat_interval="30secs" --initialize_driver_logging="true" --isolation="posix/cpu,posix/mem"
--launcher="posix" --launcher_dir="/mesos/build/src" --logbufsecs="0" --logging_level="INFO"
--max_completed_executors_per_framework="150" --oversubscribed_resources_interval="15secs"
--perf_duration="10secs" --perf_interval="1mins" --qos_correction_interval_min="0ns" --quiet="false"
--recover="reconnect" --recovery_timeout="15mins" --registration_backoff_factor="10ms" --resources="cpus:2;gpus:0;mem:1024;disk:1024;ports:[31000-32000]"
--revocable_cpu_low_priority="true" --runtime_dir="/tmp/Endpoint_SlaveEndpointTest_NoAuthorizer_2_zpn2oT"
--sandbox_directory="/mnt/mesos/sandbox" --strict="true" --switch_user="true" --systemd_enable_support="true"
--systemd_runtime_directory="/run/systemd/system" --version="false" --work_dir="/tmp/Endpoint_SlaveEndpointTest_NoAuthorizer_2_u5awBf"
> I0224 05:39:27.395833 26226 credentials.hpp:86] Loading credential for authentication
from '/tmp/Endpoint_SlaveEndpointTest_NoAuthorizer_2_zpn2oT/credential'
> I0224 05:39:27.395973 26226 slave.cpp:354] Agent using credential for: test-principal
> I0224 05:39:27.395992 26226 credentials.hpp:37] Loading credentials for authentication
from '/tmp/Endpoint_SlaveEndpointTest_NoAuthorizer_2_zpn2oT/http_credentials'
> I0224 05:39:27.396126 26226 http.cpp:933] Using default 'basic' HTTP authenticator for
realm 'mesos-agent-readonly'
> I0224 05:39:27.396183 26226 http.cpp:933] Using default 'basic' HTTP authenticator for
realm 'mesos-agent-readwrite'
> I0224 05:39:27.396749 26226 slave.cpp:541] Agent resources: cpus(*):2; mem(*):1024; disk(*):1024;
ports(*):[31000-32000]
> I0224 05:39:27.396801 26226 slave.cpp:549] Agent attributes: [  ]
> I0224 05:39:27.396814 26226 slave.cpp:554] Agent hostname: 211b663da740
> I0224 05:39:27.396899 26230 status_update_manager.cpp:177] Pausing sending status updates
> I0224 05:39:27.397260 26235 state.cpp:62] Recovering state from '/tmp/Endpoint_SlaveEndpointTest_NoAuthorizer_2_u5awBf/meta'
> I0224 05:39:27.397486 26240 status_update_manager.cpp:203] Recovering status update manager
> I0224 05:39:27.397589 26237 containerizer.cpp:599] Recovering containerizer
> I0224 05:39:27.398074 26226 provisioner.cpp:410] Provisioner recovery complete
> I0224 05:39:27.398247 26238 slave.cpp:5559] Finished recovery
> I0224 05:39:27.398663 26238 slave.cpp:5733] Querying resource estimator for oversubscribable
resources
> I0224 05:39:27.398751 26229 slave.cpp:5747] Received oversubscribable resources {} from
the resource estimator
> I0224 05:39:27.399545 26240 process.cpp:3704] Handling HTTP event for process 'slave(708)'
with path: '/slave(708)/containers'
> I0224 05:39:27.400055 26240 http.cpp:885] Authorizing principal 'test-principal' to GET
the '/containers' endpoint
> I0224 05:39:27.403450 26232 slave.cpp:803] Agent terminating
> [       OK ] Endpoint/SlaveEndpointTest.NoAuthorizer/2 (14 ms)
> [----------] 9 tests from Endpoint/SlaveEndpointTest (117 ms total)
> 
> [----------] Global test environment tear-down
> [==========] 1457 tests from 161 test cases ran. (304992 ms total)
> [  PASSED  ] 1456 tests.
> [  FAILED  ] 1 test, listed below:
> [  FAILED  ] UpgradeTest.ReregisterOldAgentWithMultiRoleMaster
> 
> 1 FAILED TEST
>  YOU HAVE 12 DISABLED TESTS
> 
> make[3]: *** [CMakeFiles/check] Error 1
> make[3]: Leaving directory `/mesos/build'
> make[2]: *** [CMakeFiles/check.dir/all] Error 2
> make[2]: Leaving directory `/mesos/build'
> make[1]: *** [CMakeFiles/check.dir/rule] Error 2
> make[1]: Leaving directory `/mesos/build'
> make: *** [check] Error 2
> + docker rmi mesos-1487911383-2593
> Untagged: mesos-1487911383-2593:latest
> Deleted: sha256:4ab956219822a9f234fac69271b2f9d443829e3f51ff898d14eece9998cb25b0
> Deleted: sha256:55f203384a591414689c385e35dc5559ffbb3608641f3f097e2036f4713a001e
> Deleted: sha256:1e4f1b93bf2cdc1d70a0d67e5a87fe5bab8b7f7513914e5fa18103653b3dbb43
> Deleted: sha256:635dad0e47f6d9187d0521de936ecfdb8205da08dc897e4949e9d4939fb26ce4
> Deleted: sha256:075c628ba413ce6a35512848472d1e8d461f5f2f078d4b4ce0e553fd9e0ece23
> Deleted: sha256:fe7769afa59a786894e4b65d9a6cec240ccdebc0fa05a6e88e5d34723a7f8a68
> Deleted: sha256:4e3bd598aee3937711d4c5649b021b950b83d5c91afcea1b815b8d6d70918c19
> Deleted: sha256:71fb4bcdbb3c470aa9737e3484d8e93f3944fdd7a5e13219339ec69a36ea0e16
> Deleted: sha256:10b975c17bab60b9981c0658be898515b3ca19eaf432f78776ecf3ae61702464
> Deleted: sha256:76466fd84b416033a3532e8ba89c1fb389a96fbddb90c41b4cf9aa769f1a48c9
> Deleted: sha256:f9b019e6626c0c909403f2d83af2ecd25d7937943da4edeacda8a5a6e2dba3b9
> Deleted: sha256:18325093b8715a76e4925008429351d463f746da5aee4f75450abae734c9f8a4
> Deleted: sha256:a0655b0cbfdf1fc17a01c57eca47a43919b5726470165b0a47e7b614ad40167f
> Deleted: sha256:01ea2c16ab27a4c9c501048dc1e3e9ab01ecce8ec7063134d06d695c6f4332f9
> Deleted: sha256:66be09eeff3ec36886060a40b1d4f03867e450092bca2ddb5043f61c97cb8c0f
> Deleted: sha256:a4e5386e8ba360acb1143fcbdf04bc1b0a0de0c8a7ecc4b84e4d6331c94705a5
> Deleted: sha256:2e007fe4961fb2e5934aecf203e7eb7b7af2c81384c859a96c6b4c564fdac75f
> Deleted: sha256:3f632e0d2fa554939a7286854174e80188ee1b0ddc211b69fc6cdc9f1300b1d3
> Deleted: sha256:21f8d1297a0de21f13ef6c1a6ed665c54777d2cf3ebd226fa02fa3ccdd51fba8
> Deleted: sha256:6f746150924b5de038f5a4792ea44bd990db6f53b74ee0b9004ab04e0db66750
> Deleted: sha256:0bfb381fcfbf808e22162c4583b16b0ea7f0ab92eb8fa31066e00216e819a529
> Deleted: sha256:e74c3cd0ae051d0f9c20230ccc4d899f617f54da5c3d5df5e31b9180eb82b006
> Deleted: sha256:94cea98e172e194faf1179281824ca999f395ca200d9c2dd5b0ea3c057d22ae1
> Deleted: sha256:f02003b2e9205db07c4f090211e491b84cf7c3a822be804c30f0b6f959bb7b16
> Build step 'Execute shell' marked build as failure


Mime
  • Unnamed multipart/alternative (inline, None, 0 bytes)
View raw message