mesos-builds mailing list archives

Site index · List index
Message view « Date » · « Thread »
Top « Date » · « Thread »
From Vinod Kone <vinodk...@apache.org>
Subject Re: Build failed in Jenkins: Mesos-Buildbot » autotools,gcc,--verbose --enable-libevent --enable-ssl,GLOG_v=1 MESOS_VERBOSE=1,centos:7,(docker||Hadoop)&&(!ubuntu-us1)&&(!ubuntu-6)&&(!ubuntu-eu2) #3121
Date Tue, 17 Jan 2017 18:19:43 GMT
hmm. this looks new?

On Tue, Jan 17, 2017 at 4:19 PM, Apache Jenkins Server <
jenkins@builds.apache.org> wrote:

> See <https://builds.apache.org/job/Mesos-Buildbot/BUILDTOOL=
> autotools,COMPILER=gcc,CONFIGURATION=--verbose%20--
> enable-libevent%20--enable-ssl,ENVIRONMENT=GLOG_v=1%
> 20MESOS_VERBOSE=1,OS=centos%3A7,label_exp=(docker%7C%
> 7CHadoop)&&(!ubuntu-us1)&&(!ubuntu-6)&&(!ubuntu-eu2)/3121/changes>
>
> Changes:
>
> [vinodkone] Cleaned up SlaveRecoveryTest.RegisterDisconnectedSlave.
>
> [vinodkone] Fixed flakiness in SlaveRecoveryTest.
> RegisterDisconnectedSlave.
>
> [vinodkone] Fix segfault when the executor sets a UUID that is not a valid
> v4 UUID.
>
> [vinodkone] Added MESOS-6917 to CHANGELOG for 1.1.1.
>
> [yujie.jay] Added support for pulling Docker images by digest.
>
> ------------------------------------------
> [...truncated 12833 lines...]
> I0117 15:18:29.785387 27596 openssl.cpp:429] Will not verify peer
> certificate!
> NOTE: Set LIBPROCESS_SSL_VERIFY_CERT=1 to enable peer certificate
> verification
> I0117 15:18:29.785392 27596 openssl.cpp:435] Will only verify peer
> certificate if presented!
> NOTE: Set LIBPROCESS_SSL_REQUIRE_CERT=1 to require peer certificate
> verification
> I0117 15:18:29.790668 27596 process.cpp:1234] libprocess is initialized on
> 172.17.0.3:56250 with 16 worker threads
> I0117 15:18:29.796072 28620 process.cpp:3676] Handling HTTP event for
> process '(81)' with path: '/(81)/get'
> I0117 15:18:29.802327 28620 process.cpp:3676] Handling HTTP event for
> process '(81)' with path: '/(81)/get'
> [       OK ] Scheme/HTTPTest.Get/0 (242 ms)
> [ RUN      ] Scheme/HTTPTest.Get/1
> I0117 15:18:29.807024 27596 process.cpp:1234] libprocess is initialized on
> 172.17.0.3:49898 with 16 worker threads
> I0117 15:18:29.807999 28648 process.cpp:3676] Handling HTTP event for
> process '(82)' with path: '/(82)/get'
> I0117 15:18:29.810118 28645 process.cpp:3676] Handling HTTP event for
> process '(82)' with path: '/(82)/get'
> [       OK ] Scheme/HTTPTest.Get/1 (7 ms)
> [ RUN      ] Scheme/HTTPTest.NestedGet/0
> I0117 15:18:30.443060 27596 openssl.cpp:419] CA file path is unspecified!
> NOTE: Set CA file path with LIBPROCESS_SSL_CA_FILE=<filepath>
> I0117 15:18:30.443089 27596 openssl.cpp:424] CA directory path
> unspecified! NOTE: Set CA directory path with LIBPROCESS_SSL_CA_DIR=<
> dirpath>
> I0117 15:18:30.443096 27596 openssl.cpp:429] Will not verify peer
> certificate!
> NOTE: Set LIBPROCESS_SSL_VERIFY_CERT=1 to enable peer certificate
> verification
> I0117 15:18:30.443102 27596 openssl.cpp:435] Will only verify peer
> certificate if presented!
> NOTE: Set LIBPROCESS_SSL_REQUIRE_CERT=1 to require peer certificate
> verification
> I0117 15:18:30.451145 27596 process.cpp:1234] libprocess is initialized on
> 172.17.0.3:41562 with 16 worker threads
> I0117 15:18:30.456635 28661 process.cpp:3676] Handling HTTP event for
> process '(83)' with path: '/(83)//a/b/c'
> I0117 15:18:30.462333 28653 process.cpp:3676] Handling HTTP event for
> process '(83)' with path: '/(83)//a/b'
> [       OK ] Scheme/HTTPTest.NestedGet/0 (653 ms)
> [ RUN      ] Scheme/HTTPTest.NestedGet/1
> I0117 15:18:30.467041 27596 process.cpp:1234] libprocess is initialized on
> 172.17.0.3:44751 with 16 worker threads
> I0117 15:18:30.468296 28675 process.cpp:3676] Handling HTTP event for
> process '(84)' with path: '/(84)//a/b/c'
> I0117 15:18:30.470624 28681 process.cpp:3676] Handling HTTP event for
> process '(84)' with path: '/(84)//a/b'
> [       OK ] Scheme/HTTPTest.NestedGet/1 (7 ms)
> [ RUN      ] Scheme/HTTPTest.StreamingGetComplete/0
> I0117 15:18:30.822814 27596 openssl.cpp:419] CA file path is unspecified!
> NOTE: Set CA file path with LIBPROCESS_SSL_CA_FILE=<filepath>
> I0117 15:18:30.822849 27596 openssl.cpp:424] CA directory path
> unspecified! NOTE: Set CA directory path with LIBPROCESS_SSL_CA_DIR=<
> dirpath>
> I0117 15:18:30.822860 27596 openssl.cpp:429] Will not verify peer
> certificate!
> NOTE: Set LIBPROCESS_SSL_VERIFY_CERT=1 to enable peer certificate
> verification
> I0117 15:18:30.822870 27596 openssl.cpp:435] Will only verify peer
> certificate if presented!
> NOTE: Set LIBPROCESS_SSL_REQUIRE_CERT=1 to require peer certificate
> verification
> I0117 15:18:30.825973 27596 process.cpp:1234] libprocess is initialized on
> 172.17.0.3:35114 with 16 worker threads
> I0117 15:18:30.833875 28696 process.cpp:3676] Handling HTTP event for
> process '(85)' with path: '/(85)/pipe'
> [       OK ] Scheme/HTTPTest.StreamingGetComplete/0 (404 ms)
> [ RUN      ] Scheme/HTTPTest.StreamingGetComplete/1
> I0117 15:18:30.879258 27596 process.cpp:1234] libprocess is initialized on
> 172.17.0.3:41507 with 16 worker threads
> I0117 15:18:30.880762 28709 process.cpp:3676] Handling HTTP event for
> process '(86)' with path: '/(86)/pipe'
> [       OK ] Scheme/HTTPTest.StreamingGetComplete/1 (8 ms)
> [ RUN      ] Scheme/HTTPTest.StreamingGetFailure/0
> I0117 15:18:31.707183 27596 openssl.cpp:419] CA file path is unspecified!
> NOTE: Set CA file path with LIBPROCESS_SSL_CA_FILE=<filepath>
> I0117 15:18:31.707211 27596 openssl.cpp:424] CA directory path
> unspecified! NOTE: Set CA directory path with LIBPROCESS_SSL_CA_DIR=<
> dirpath>
> I0117 15:18:31.707216 27596 openssl.cpp:429] Will not verify peer
> certificate!
> NOTE: Set LIBPROCESS_SSL_VERIFY_CERT=1 to enable peer certificate
> verification
> I0117 15:18:31.707221 27596 openssl.cpp:435] Will only verify peer
> certificate if presented!
> NOTE: Set LIBPROCESS_SSL_REQUIRE_CERT=1 to require peer certificate
> verification
> I0117 15:18:31.711297 27596 process.cpp:1234] libprocess is initialized on
> 172.17.0.3:39056 with 16 worker threads
> I0117 15:18:31.717717 28733 process.cpp:3676] Handling HTTP event for
> process '(87)' with path: '/(87)/pipe'
> I0117 15:18:31.758134 28727 process.cpp:1576] Failed to read from stream:
> oops
> [       OK ] Scheme/HTTPTest.StreamingGetFailure/0 (875 ms)
> [ RUN      ] Scheme/HTTPTest.StreamingGetFailure/1
> I0117 15:18:31.769486 27596 process.cpp:1234] libprocess is initialized on
> 172.17.0.3:46027 with 16 worker threads
> I0117 15:18:31.770746 28746 process.cpp:3676] Handling HTTP event for
> process '(88)' with path: '/(88)/pipe'
> I0117 15:18:31.772732 28750 process.cpp:1576] Failed to read from stream:
> oops
> [       OK ] Scheme/HTTPTest.StreamingGetFailure/1 (17 ms)
> [ RUN      ] Scheme/HTTPTest.PipeEquality/0
> I0117 15:18:32.514407 27596 openssl.cpp:419] CA file path is unspecified!
> NOTE: Set CA file path with LIBPROCESS_SSL_CA_FILE=<filepath>
> I0117 15:18:32.514433 27596 openssl.cpp:424] CA directory path
> unspecified! NOTE: Set CA directory path with LIBPROCESS_SSL_CA_DIR=<
> dirpath>
> I0117 15:18:32.514438 27596 openssl.cpp:429] Will not verify peer
> certificate!
> NOTE: Set LIBPROCESS_SSL_VERIFY_CERT=1 to enable peer certificate
> verification
> I0117 15:18:32.514442 27596 openssl.cpp:435] Will only verify peer
> certificate if presented!
> NOTE: Set LIBPROCESS_SSL_REQUIRE_CERT=1 to require peer certificate
> verification
> I0117 15:18:32.521240 27596 process.cpp:1234] libprocess is initialized on
> 172.17.0.3:48024 with 16 worker threads
> [       OK ] Scheme/HTTPTest.PipeEquality/0 (746 ms)
> [ RUN      ] Scheme/HTTPTest.PipeEquality/1
> I0117 15:18:32.525372 27596 process.cpp:1234] libprocess is initialized on
> 172.17.0.3:56186 with 16 worker threads
> [       OK ] Scheme/HTTPTest.PipeEquality/1 (3 ms)
> [ RUN      ] Scheme/HTTPTest.Post/0
> I0117 15:18:32.997287 27596 openssl.cpp:419] CA file path is unspecified!
> NOTE: Set CA file path with LIBPROCESS_SSL_CA_FILE=<filepath>
> I0117 15:18:32.997309 27596 openssl.cpp:424] CA directory path
> unspecified! NOTE: Set CA directory path with LIBPROCESS_SSL_CA_DIR=<
> dirpath>
> I0117 15:18:32.997315 27596 openssl.cpp:429] Will not verify peer
> certificate!
> NOTE: Set LIBPROCESS_SSL_VERIFY_CERT=1 to enable peer certificate
> verification
> I0117 15:18:32.997319 27596 openssl.cpp:435] Will only verify peer
> certificate if presented!
> NOTE: Set LIBPROCESS_SSL_REQUIRE_CERT=1 to require peer certificate
> verification
> I0117 15:18:33.008196 27596 process.cpp:1234] libprocess is initialized on
> 172.17.0.3:49617 with 16 worker threads
> I0117 15:18:33.016777 28792 process.cpp:3676] Handling HTTP event for
> process '(89)' with path: '/(89)/post'
> I0117 15:18:33.059707 28797 process.cpp:3676] Handling HTTP event for
> process '(89)' with path: '/(89)/post'
> [       OK ] Scheme/HTTPTest.Post/0 (574 ms)
> [ RUN      ] Scheme/HTTPTest.Post/1
> I0117 15:18:33.102293 27596 process.cpp:1234] libprocess is initialized on
> 172.17.0.3:54312 with 16 worker threads
> I0117 15:18:33.104717 28806 process.cpp:3676] Handling HTTP event for
> process '(90)' with path: '/(90)/post'
> I0117 15:18:33.107525 28813 process.cpp:3676] Handling HTTP event for
> process '(90)' with path: '/(90)/post'
> [       OK ] Scheme/HTTPTest.Post/1 (11 ms)
> [ RUN      ] Scheme/HTTPTest.Delete/0
> I0117 15:18:33.484724 27596 openssl.cpp:419] CA file path is unspecified!
> NOTE: Set CA file path with LIBPROCESS_SSL_CA_FILE=<filepath>
> I0117 15:18:33.484752 27596 openssl.cpp:424] CA directory path
> unspecified! NOTE: Set CA directory path with LIBPROCESS_SSL_CA_DIR=<
> dirpath>
> I0117 15:18:33.484760 27596 openssl.cpp:429] Will not verify peer
> certificate!
> NOTE: Set LIBPROCESS_SSL_VERIFY_CERT=1 to enable peer certificate
> verification
> I0117 15:18:33.484766 27596 openssl.cpp:435] Will only verify peer
> certificate if presented!
> NOTE: Set LIBPROCESS_SSL_REQUIRE_CERT=1 to require peer certificate
> verification
> I0117 15:18:33.487651 27596 process.cpp:1234] libprocess is initialized on
> 172.17.0.3:53018 with 16 worker threads
> I0117 15:18:33.493491 28830 process.cpp:3676] Handling HTTP event for
> process '(91)' with path: '/(91)/delete'
> [       OK ] Scheme/HTTPTest.Delete/0 (385 ms)
> [ RUN      ] Scheme/HTTPTest.Delete/1
> I0117 15:18:33.507721 27596 process.cpp:1234] libprocess is initialized on
> 172.17.0.3:52783 with 16 worker threads
> I0117 15:18:33.509579 28848 process.cpp:3676] Handling HTTP event for
> process '(92)' with path: '/(92)/delete'
> [       OK ] Scheme/HTTPTest.Delete/1 (16 ms)
> [ RUN      ] Scheme/HTTPTest.Request/0
> I0117 15:18:33.834260 27596 openssl.cpp:419] CA file path is unspecified!
> NOTE: Set CA file path with LIBPROCESS_SSL_CA_FILE=<filepath>
> I0117 15:18:33.834286 27596 openssl.cpp:424] CA directory path
> unspecified! NOTE: Set CA directory path with LIBPROCESS_SSL_CA_DIR=<
> dirpath>
> I0117 15:18:33.834292 27596 openssl.cpp:429] Will not verify peer
> certificate!
> NOTE: Set LIBPROCESS_SSL_VERIFY_CERT=1 to enable peer certificate
> verification
> I0117 15:18:33.834296 27596 openssl.cpp:435] Will only verify peer
> certificate if presented!
> NOTE: Set LIBPROCESS_SSL_REQUIRE_CERT=1 to require peer certificate
> verification
> I0117 15:18:33.837662 27596 process.cpp:1234] libprocess is initialized on
> 172.17.0.3:38468 with 16 worker threads
> I0117 15:18:33.845895 28867 process.cpp:3676] Handling HTTP event for
> process '(93)' with path: '/(93)/request'
> [       OK ] Scheme/HTTPTest.Request/0 (337 ms)
> [ RUN      ] Scheme/HTTPTest.Request/1
> I0117 15:18:33.851514 27596 process.cpp:1234] libprocess is initialized on
> 172.17.0.3:57462 with 16 worker threads
> I0117 15:18:33.852690 28874 process.cpp:3676] Handling HTTP event for
> process '(94)' with path: '/(94)/request'
> [       OK ] Scheme/HTTPTest.Request/1 (6 ms)
> [ RUN      ] Scheme/HTTPTest.QueryEncodeDecode/0
> I0117 15:18:34.004035 27596 openssl.cpp:419] CA file path is unspecified!
> NOTE: Set CA file path with LIBPROCESS_SSL_CA_FILE=<filepath>
> I0117 15:18:34.004062 27596 openssl.cpp:424] CA directory path
> unspecified! NOTE: Set CA directory path with LIBPROCESS_SSL_CA_DIR=<
> dirpath>
> I0117 15:18:34.004070 27596 openssl.cpp:429] Will not verify peer
> certificate!
> NOTE: Set LIBPROCESS_SSL_VERIFY_CERT=1 to enable peer certificate
> verification
> I0117 15:18:34.004076 27596 openssl.cpp:435] Will only verify peer
> certificate if presented!
> NOTE: Set LIBPROCESS_SSL_REQUIRE_CERT=1 to require peer certificate
> verification
> I0117 15:18:34.011296 27596 process.cpp:1234] libprocess is initialized on
> 172.17.0.3:39886 with 16 worker threads
> [       OK ] Scheme/HTTPTest.QueryEncodeDecode/0 (157 ms)
> [ RUN      ] Scheme/HTTPTest.QueryEncodeDecode/1
> I0117 15:18:34.014309 27596 process.cpp:1234] libprocess is initialized on
> 172.17.0.3:37819 with 16 worker threads
> [       OK ] Scheme/HTTPTest.QueryEncodeDecode/1 (3 ms)
> [ RUN      ] Scheme/HTTPTest.CaseInsensitiveHeaders/0
> I0117 15:18:34.334663 27596 openssl.cpp:419] CA file path is unspecified!
> NOTE: Set CA file path with LIBPROCESS_SSL_CA_FILE=<filepath>
> I0117 15:18:34.334692 27596 openssl.cpp:424] CA directory path
> unspecified! NOTE: Set CA directory path with LIBPROCESS_SSL_CA_DIR=<
> dirpath>
> I0117 15:18:34.334697 27596 openssl.cpp:429] Will not verify peer
> certificate!
> NOTE: Set LIBPROCESS_SSL_VERIFY_CERT=1 to enable peer certificate
> verification
> I0117 15:18:34.334700 27596 openssl.cpp:435] Will only verify peer
> certificate if presented!
> NOTE: Set LIBPROCESS_SSL_REQUIRE_CERT=1 to require peer certificate
> verification
> I0117 15:18:34.343902 27596 process.cpp:1234] libprocess is initialized on
> 172.17.0.3:42477 with 16 worker threads
> [       OK ] Scheme/HTTPTest.CaseInsensitiveHeaders/0 (330 ms)
> [ RUN      ] Scheme/HTTPTest.CaseInsensitiveHeaders/1
> I0117 15:18:34.347375 27596 process.cpp:1234] libprocess is initialized on
> 172.17.0.3:47262 with 16 worker threads
> [       OK ] Scheme/HTTPTest.CaseInsensitiveHeaders/1 (3 ms)
> [ RUN      ] Scheme/HTTPTest.Accepts/0
> I0117 15:18:34.935087 27596 openssl.cpp:419] CA file path is unspecified!
> NOTE: Set CA file path with LIBPROCESS_SSL_CA_FILE=<filepath>
> I0117 15:18:34.935115 27596 openssl.cpp:424] CA directory path
> unspecified! NOTE: Set CA directory path with LIBPROCESS_SSL_CA_DIR=<
> dirpath>
> I0117 15:18:34.935119 27596 openssl.cpp:429] Will not verify peer
> certificate!
> NOTE: Set LIBPROCESS_SSL_VERIFY_CERT=1 to enable peer certificate
> verification
> I0117 15:18:34.935123 27596 openssl.cpp:435] Will only verify peer
> certificate if presented!
> NOTE: Set LIBPROCESS_SSL_REQUIRE_CERT=1 to require peer certificate
> verification
> I0117 15:18:34.950821 27596 process.cpp:1234] libprocess is initialized on
> 172.17.0.3:39143 with 16 worker threads
> [       OK ] Scheme/HTTPTest.Accepts/0 (604 ms)
> [ RUN      ] Scheme/HTTPTest.Accepts/1
> I0117 15:18:34.954344 27596 process.cpp:1234] libprocess is initialized on
> 172.17.0.3:52064 with 16 worker threads
> [       OK ] Scheme/HTTPTest.Accepts/1 (4 ms)
> I0117 15:18:34.963878 27596 process.cpp:1234] libprocess is initialized on
> 172.17.0.3:40881 with 16 worker threads
> [----------] 38 tests from Scheme/HTTPTest (7535 ms total)
>
> [----------] 4 tests from Encryption/NetSocketTest
> [ RUN      ] Encryption/NetSocketTest.EOFBeforeRecv/0
> I0117 15:18:35.320691 27596 openssl.cpp:419] CA file path is unspecified!
> NOTE: Set CA file path with LIBPROCESS_SSL_CA_FILE=<filepath>
> I0117 15:18:35.320714 27596 openssl.cpp:424] CA directory path
> unspecified! NOTE: Set CA directory path with LIBPROCESS_SSL_CA_DIR=<
> dirpath>
> I0117 15:18:35.320719 27596 openssl.cpp:429] Will not verify peer
> certificate!
> NOTE: Set LIBPROCESS_SSL_VERIFY_CERT=1 to enable peer certificate
> verification
> I0117 15:18:35.320726 27596 openssl.cpp:435] Will only verify peer
> certificate if presented!
> NOTE: Set LIBPROCESS_SSL_REQUIRE_CERT=1 to require peer certificate
> verification
> I0117 15:18:35.335141 27596 process.cpp:1234] libprocess is initialized on
> 172.17.0.3:46415 with 16 worker threads
> [       OK ] Encryption/NetSocketTest.EOFBeforeRecv/0 (422 ms)
> [ RUN      ] Encryption/NetSocketTest.EOFBeforeRecv/1
> I0117 15:18:35.390697 27596 process.cpp:1234] libprocess is initialized on
> 172.17.0.3:39822 with 16 worker threads
> [       OK ] Encryption/NetSocketTest.EOFBeforeRecv/1 (6 ms)
> [ RUN      ] Encryption/NetSocketTest.EOFAfterRecv/0
> I0117 15:18:35.998528 27596 openssl.cpp:419] CA file path is unspecified!
> NOTE: Set CA file path with LIBPROCESS_SSL_CA_FILE=<filepath>
> I0117 15:18:35.998559 27596 openssl.cpp:424] CA directory path
> unspecified! NOTE: Set CA directory path with LIBPROCESS_SSL_CA_DIR=<
> dirpath>
> I0117 15:18:35.998566 27596 openssl.cpp:429] Will not verify peer
> certificate!
> NOTE: Set LIBPROCESS_SSL_VERIFY_CERT=1 to enable peer certificate
> verification
> I0117 15:18:35.998572 27596 openssl.cpp:435] Will only verify peer
> certificate if presented!
> NOTE: Set LIBPROCESS_SSL_REQUIRE_CERT=1 to require peer certificate
> verification
> I0117 15:18:36.010643 27596 process.cpp:1234] libprocess is initialized on
> 172.17.0.3:47429 with 16 worker threads
> [       OK ] Encryption/NetSocketTest.EOFAfterRecv/0 (664 ms)
> [ RUN      ] Encryption/NetSocketTest.EOFAfterRecv/1
> I0117 15:18:36.079453 27596 process.cpp:1234] libprocess is initialized on
> 172.17.0.3:38149 with 16 worker threads
> [       OK ] Encryption/NetSocketTest.EOFAfterRecv/1 (19 ms)
> *** Aborted at 1484666316 (unix time) try "date -d @1484666316" if you are
> using GNU date ***
> PC: @     0x7f7643ad7c56 __memcpy_ssse3_back
> *** SIGSEGV (@0x57c10f8) received by PID 27596 (TID 0x7f76393c2700) from
> PID 92016888; stack trace: ***
>     @     0x7f7644ba0370 (unknown)
>     @     0x7f7643ad7c56 __memcpy_ssse3_back
>     @     0x7f76443248e0 (unknown)
>     @     0x7f7644324f8c (unknown)
>     @           0x422a4d process::UPID::UPID()
> I0117 15:18:36.090376 27596 process.cpp:1234] libprocess is initialized on
> 172.17.0.3:43835 with 16 worker threads
> [----------] 4 tests from Encryption/NetSocketTest (1116 ms total)
>
> [----------] 6 tests from SSLVerifyIPAdd/SSLTest
> [ RUN      ] SSLVerifyIPAdd/SSLTest.BasicSameProcess/0
>     @           0x8ae4a8 process::DispatchEvent::DispatchEvent()
>     @           0x8a6a5e process::internal::dispatch()
>     @           0x8c0b44 process::dispatch<>()
>     @           0x8a598a process::ProcessBase::route()
>     @           0x98be53 process::ProcessBase::route<>()
>     @           0x988096 process::Help::initialize()
>     @           0x89ef2a process::ProcessManager::resume()
>     @           0x89b976 _ZZN7process14ProcessManager12i
> nit_threadsEvENKUt_clEv
>     @           0x8adb3c _ZNSt12_Bind_simpleIFZN7process14ProcessMan
> ager12init_threadsEvEUt_vEE9_M_invokeIIEEEvSt12_Index_tupleIIXspT_EEE
>     @           0x8ada80 _ZNSt12_Bind_simpleIFZN7process14ProcessMan
> ager12init_threadsEvEUt_vEEclEv
>     @           0x8ada0a _ZNSt6thread5_ImplISt12_Bind_
> simpleIFZN7process14ProcessManager12init_threadsEvEUt_vEEE6_M_runEv
>     @     0x7f764431b230 (unknown)
>     @     0x7f7644b98dc5 start_thread
>     @     0x7f7643a8473d __clone
> make[7]: *** [check-local] Segmentation fault
> make[7]: Leaving directory `/mesos/mesos-1.2.0/_build/3rdparty/libprocess'
> make[6]: *** [check-am] Error 2
> make[6]: Leaving directory `/mesos/mesos-1.2.0/_build/3rdparty/libprocess'
> make[5]: *** [check-recursive] Error 1
> make[5]: Leaving directory `/mesos/mesos-1.2.0/_build/3rdparty/libprocess'
> make[4]: *** [check] Error 2
> make[4]: Leaving directory `/mesos/mesos-1.2.0/_build/3rdparty/libprocess'
> make[3]: *** [check-recursive] Error 1
> make[3]: Leaving directory `/mesos/mesos-1.2.0/_build/3rdparty'
> make[2]: *** [check] Error 2
> make[2]: Leaving directory `/mesos/mesos-1.2.0/_build/3rdparty'
> make[1]: *** [check-recursive] Error 1
> make[1]: Leaving directory `/mesos/mesos-1.2.0/_build'
> make: *** [distcheck] Error 1
> + docker rmi mesos-1484665081-20962
> Untagged: mesos-1484665081-20962:latest
> Deleted: sha256:bd239db08b1f530b324d60b5b24d81
> df852c2afec472af33305a0c76ac296b30
> Deleted: sha256:99fe25b44a7ada6f02610ba2da7bed
> 43c7b73462728f497c3a95f2d968603f61
> Deleted: sha256:b5bab3ff48fe680867c7cfdfa1f731
> 6d5b80c32b8067b2196afe8f76fce951a0
> Deleted: sha256:f1253f69dea2be8d6598f720763a2c
> 6305f61c0ae17c12bd1d582b51fc3d864f
> Deleted: sha256:fbc7a214523b9718c1f26650759e4c
> 5b946f2104d577c0731371cd1d74248ebe
> Deleted: sha256:549995ca3d3b3db0d41fb7489ddef7
> 038d4cb4b35fadc696da85a9e7848c4955
> Deleted: sha256:7120c099d61d37076ccca5c9addf2f
> 79d339f5f6d5ea12dae82efbf1e0cccf2d
> Deleted: sha256:47ab9508c0aa2a8567dbe11c02bb05
> a29c6001e46109fa9166fb4806cf6e6e6c
> Deleted: sha256:1387a029d8eb1f828a182dab32a2df
> bf6826f5a4102b01e553e357ee6501c957
> Deleted: sha256:b14ab82a7febba3b6490505195ee1f
> a7e931ceb234d34f29c067a038e76478e3
> Deleted: sha256:8dbb0cddb6618353eb6a2514e29748
> bee21238942adea7490d2182f9aa1a4739
> Deleted: sha256:fa25ea3864fc0a9f7eaad367d44182
> a8807a45e2eb962a78fdefb300ac163ddf
> Deleted: sha256:c6a19b8b91e368f7209ef5316b7c1f
> 7832c02b783a10711170869011a06e9a22
> Deleted: sha256:025dd899e6113814f837608a1cef89
> d76a95a331910af3a37d4d15020b6bfa8d
> Deleted: sha256:a204384bcb7b001e724e36443172ff
> 89b6c6d2443898a2496f441b724a280ca3
> Deleted: sha256:bc81ddd08005d939102f11597dbaa0
> 0b83797c1eaa766a1468ac79511b9c1c6c
> Deleted: sha256:be2a9c0bbd853f447db4eb7a336be4
> c52d1f799e5a4ee34b932da1325dde3e10
> Deleted: sha256:5d55a89ca2e9c17f696976aac67677
> a31d0ef45339e4d36ae04ad1c5c38ee2a2
> Deleted: sha256:2522f5bb315509de239eb2e8372ce5
> 6300766c0eef23ed1875d0e7f794700a45
> Deleted: sha256:8fd4de24af5e38531f07f2ae3cd4d4
> 94ada44cb8dd001a85693d1601c8be162b
> Deleted: sha256:5d7daa3a7ccc4c1be962f7bfe379b6
> 216a00b5463462337937296a705b1c7e48
> Deleted: sha256:69116860a9d803239e82bb10b4c607
> cde745d786404881f5e42cc7d9df8dc22a
> Deleted: sha256:5c40cc83ff196610ac5e280e8714e7
> f8fa30d3cd73c4b70106c4ae81c15f3888
> Deleted: sha256:9ec75c9f603ebd15041eb9beca0a41
> f16e746f20fe9185efe8690c04e8f35f66
> Deleted: sha256:ed8a2db995b90f73fe17b673d772a5
> c36f27b70c596b8438700fe250be9b47f7
> Build step 'Execute shell' marked build as failure
>

Mime
  • Unnamed multipart/alternative (inline, None, 0 bytes)
View raw message