mesos-builds mailing list archives

Site index · List index
Message view « Date » · « Thread »
Top « Date » · « Thread »
From Vinod Kone <vinodk...@apache.org>
Subject Re: Build failed in Jenkins: Mesos-Reviewbot #16737
Date Tue, 17 Jan 2017 08:38:06 GMT
@neil, can you look into this?

On Mon, Jan 16, 2017 at 10:52 AM, Apache Jenkins Server <
jenkins@builds.apache.org> wrote:

> See <https://builds.apache.org/job/Mesos-Reviewbot/16737/>
>
> ------------------------------------------
> [...truncated 171048 lines...]
> I0116 09:51:46.475677 29995 containerizer.cpp:220] Using isolation:
> posix/cpu,posix/mem,filesystem/posix,network/cni
> W0116 09:51:46.476682 29995 backend.cpp:76] Failed to create 'aufs'
> backend: AufsBackend requires root privileges, but is running as user mesos
> W0116 09:51:46.476922 29995 backend.cpp:76] Failed to create 'bind'
> backend: BindBackend requires root privileges
> I0116 09:51:46.481760 30016 slave.cpp:209] Mesos agent started on (678)@
> 172.17.0.2:35655
> I0116 09:51:46.481792 30016 slave.cpp:210] Flags at startup: --acls=""
> --appc_simple_discovery_uri_prefix="http://" --appc_store_dir="/tmp/mesos/store/appc"
> --authenticate_http_readonly="true" --authenticate_http_readwrite="true"
> --authenticatee="crammd5" --authentication_backoff_factor="1secs"
> --authorizer="local" --cgroups_cpu_enable_pids_and_tids_count="false"
> --cgroups_enable_cfs="false" --cgroups_hierarchy="/sys/fs/cgroup"
> --cgroups_limit_swap="false" --cgroups_root="mesos" --container_disk_watch_interval="15secs"
> --containerizers="mesos" --credential="/tmp/Endpoint_SlaveEndpointTest_
> AuthorizedRequest_1_AG7fH1/credential" --default_role="*"
> --disk_watch_interval="1mins" --docker="docker"
> --docker_kill_orphans="true" --docker_registry="https://
> registry-1.docker.io" --docker_remove_delay="6hrs"
> --docker_socket="/var/run/docker.sock" --docker_stop_timeout="0ns"
> --docker_store_dir="/tmp/mesos/store/docker" --docker_volume_checkpoint_
> dir="/var/run/mesos/isolators/docker/volume" --enforce_container_disk_quota="false"
> --executor_registration_timeout="1mins" --executor_shutdown_grace_period="5secs"
> --fetcher_cache_dir="/tmp/Endpoint_SlaveEndpointTest_
> AuthorizedRequest_1_AG7fH1/fetch" --fetcher_cache_size="2GB"
> --frameworks_home="" --gc_delay="1weeks" --gc_disk_headroom="0.1"
> --hadoop_home="" --help="false" --hostname_lookup="true"
> --http_authenticators="basic" --http_command_executor="false"
> --http_credentials="/tmp/Endpoint_SlaveEndpointTest_
> AuthorizedRequest_1_AG7fH1/http_credentials" --http_heartbeat_interval="30secs"
> --image_provisioner_backend="copy" --initialize_driver_logging="true"
> --isolation="posix/cpu,posix/mem" --launcher="posix"
> --launcher_dir="/mesos/mesos-1.2.0/_build/src" --logbufsecs="0"
> --logging_level="INFO" --max_completed_executors_per_framework="150"
> --oversubscribed_resources_interval="15secs" --perf_duration="10secs"
> --perf_interval="1mins" --qos_correction_interval_min="0ns"
> --quiet="false" --recover="reconnect" --recovery_timeout="15mins"
> --registration_backoff_factor="10ms" --resources="cpus:2;gpus:0;
> mem:1024;disk:1024;ports:[31000-32000]" --revocable_cpu_low_priority="true"
> --runtime_dir="/tmp/Endpoint_SlaveEndpointTest_AuthorizedRequest_1_AG7fH1"
> --sandbox_directory="/mnt/mesos/sandbox" --strict="true"
> --switch_user="true" --systemd_enable_support="true"
> --systemd_runtime_directory="/run/systemd/system" --version="false"
> --work_dir="/tmp/Endpoint_SlaveEndpointTest_AuthorizedRequest_1_HzmNzx"
> I0116 09:51:46.482417 30016 credentials.hpp:86] Loading credential for
> authentication from '/tmp/Endpoint_SlaveEndpointTest_
> AuthorizedRequest_1_AG7fH1/credential'
> I0116 09:51:46.482627 30016 slave.cpp:352] Agent using credential for:
> test-principal
> I0116 09:51:46.482647 30016 credentials.hpp:37] Loading credentials for
> authentication from '/tmp/Endpoint_SlaveEndpointTest_
> AuthorizedRequest_1_AG7fH1/http_credentials'
> I0116 09:51:46.482873 30016 http.cpp:922] Using default 'basic' HTTP
> authenticator for realm 'mesos-agent-readonly'
> I0116 09:51:46.483042 30016 http.cpp:922] Using default 'basic' HTTP
> authenticator for realm 'mesos-agent-readwrite'
> I0116 09:51:46.484311 30016 slave.cpp:539] Agent resources: cpus(*):2;
> mem(*):1024; disk(*):1024; ports(*):[31000-32000]
> I0116 09:51:46.484393 30016 slave.cpp:547] Agent attributes: [  ]
> I0116 09:51:46.484412 30016 slave.cpp:552] Agent hostname: e2ceffa41f81
> I0116 09:51:46.485888 30015 state.cpp:60] Recovering state from
> '/tmp/Endpoint_SlaveEndpointTest_AuthorizedRequest_1_HzmNzx/meta'
> I0116 09:51:46.486254 30024 status_update_manager.cpp:203] Recovering
> status update manager
> I0116 09:51:46.486477 30026 containerizer.cpp:599] Recovering containerizer
> I0116 09:51:46.487916 30027 provisioner.cpp:251] Provisioner recovery
> complete
> I0116 09:51:46.488291 30014 slave.cpp:5417] Finished recovery
> I0116 09:51:46.488873 30014 slave.cpp:5591] Querying resource estimator
> for oversubscribable resources
> I0116 09:51:46.489140 30027 slave.cpp:5605] Received oversubscribable
> resources {} from the resource estimator
> I0116 09:51:46.492074 30018 process.cpp:3676] Handling HTTP event for
> process 'slave(678)' with path: '/slave(678)/monitor/statistics.json'
> I0116 09:51:46.493597 30025 http.cpp:874] Authorizing principal
> 'test-principal' to GET the '/monitor/statistics.json' endpoint
> I0116 09:51:46.497017 30028 slave.cpp:796] Agent terminating
> [       OK ] Endpoint/SlaveEndpointTest.AuthorizedRequest/1 (34 ms)
> [ RUN      ] Endpoint/SlaveEndpointTest.AuthorizedRequest/2
> I0116 09:51:46.508632 29995 containerizer.cpp:220] Using isolation:
> posix/cpu,posix/mem,filesystem/posix,network/cni
> W0116 09:51:46.509348 29995 backend.cpp:76] Failed to create 'aufs'
> backend: AufsBackend requires root privileges, but is running as user mesos
> W0116 09:51:46.509543 29995 backend.cpp:76] Failed to create 'bind'
> backend: BindBackend requires root privileges
> I0116 09:51:46.513051 30025 slave.cpp:209] Mesos agent started on (679)@
> 172.17.0.2:35655
> I0116 09:51:46.513083 30025 slave.cpp:210] Flags at startup: --acls=""
> --appc_simple_discovery_uri_prefix="http://" --appc_store_dir="/tmp/mesos/store/appc"
> --authenticate_http_readonly="true" --authenticate_http_readwrite="true"
> --authenticatee="crammd5" --authentication_backoff_factor="1secs"
> --authorizer="local" --cgroups_cpu_enable_pids_and_tids_count="false"
> --cgroups_enable_cfs="false" --cgroups_hierarchy="/sys/fs/cgroup"
> --cgroups_limit_swap="false" --cgroups_root="mesos" --container_disk_watch_interval="15secs"
> --containerizers="mesos" --credential="/tmp/Endpoint_SlaveEndpointTest_
> AuthorizedRequest_2_2VPZtY/credential" --default_role="*"
> --disk_watch_interval="1mins" --docker="docker"
> --docker_kill_orphans="true" --docker_registry="https://
> registry-1.docker.io" --docker_remove_delay="6hrs"
> --docker_socket="/var/run/docker.sock" --docker_stop_timeout="0ns"
> --docker_store_dir="/tmp/mesos/store/docker" --docker_volume_checkpoint_
> dir="/var/run/mesos/isolators/docker/volume" --enforce_container_disk_quota="false"
> --executor_registration_timeout="1mins" --executor_shutdown_grace_period="5secs"
> --fetcher_cache_dir="/tmp/Endpoint_SlaveEndpointTest_
> AuthorizedRequest_2_2VPZtY/fetch" --fetcher_cache_size="2GB"
> --frameworks_home="" --gc_delay="1weeks" --gc_disk_headroom="0.1"
> --hadoop_home="" --help="false" --hostname_lookup="true"
> --http_authenticators="basic" --http_command_executor="false"
> --http_credentials="/tmp/Endpoint_SlaveEndpointTest_
> AuthorizedRequest_2_2VPZtY/http_credentials" --http_heartbeat_interval="30secs"
> --image_provisioner_backend="copy" --initialize_driver_logging="true"
> --isolation="posix/cpu,posix/mem" --launcher="posix"
> --launcher_dir="/mesos/mesos-1.2.0/_build/src" --logbufsecs="0"
> --logging_level="INFO" --max_completed_executors_per_framework="150"
> --oversubscribed_resources_interval="15secs" --perf_duration="10secs"
> --perf_interval="1mins" --qos_correction_interval_min="0ns"
> --quiet="false" --recover="reconnect" --recovery_timeout="15mins"
> --registration_backoff_factor="10ms" --resources="cpus:2;gpus:0;
> mem:1024;disk:1024;ports:[31000-32000]" --revocable_cpu_low_priority="true"
> --runtime_dir="/tmp/Endpoint_SlaveEndpointTest_AuthorizedRequest_2_2VPZtY"
> --sandbox_directory="/mnt/mesos/sandbox" --strict="true"
> --switch_user="true" --systemd_enable_support="true"
> --systemd_runtime_directory="/run/systemd/system" --version="false"
> --work_dir="/tmp/Endpoint_SlaveEndpointTest_AuthorizedRequest_2_diz0gu"
> I0116 09:51:46.513836 30025 credentials.hpp:86] Loading credential for
> authentication from '/tmp/Endpoint_SlaveEndpointTest_
> AuthorizedRequest_2_2VPZtY/credential'
> I0116 09:51:46.514055 30025 slave.cpp:352] Agent using credential for:
> test-principal
> I0116 09:51:46.514088 30025 credentials.hpp:37] Loading credentials for
> authentication from '/tmp/Endpoint_SlaveEndpointTest_
> AuthorizedRequest_2_2VPZtY/http_credentials'
> I0116 09:51:46.514416 30025 http.cpp:922] Using default 'basic' HTTP
> authenticator for realm 'mesos-agent-readonly'
> I0116 09:51:46.514598 30025 http.cpp:922] Using default 'basic' HTTP
> authenticator for realm 'mesos-agent-readwrite'
> I0116 09:51:46.515904 30025 slave.cpp:539] Agent resources: cpus(*):2;
> mem(*):1024; disk(*):1024; ports(*):[31000-32000]
> I0116 09:51:46.516005 30025 slave.cpp:547] Agent attributes: [  ]
> I0116 09:51:46.516022 30025 slave.cpp:552] Agent hostname: e2ceffa41f81
> I0116 09:51:46.517729 30027 state.cpp:60] Recovering state from
> '/tmp/Endpoint_SlaveEndpointTest_AuthorizedRequest_2_diz0gu/meta'
> I0116 09:51:46.518080 30017 status_update_manager.cpp:203] Recovering
> status update manager
> I0116 09:51:46.518301 30016 containerizer.cpp:599] Recovering containerizer
> I0116 09:51:46.520084 30019 provisioner.cpp:251] Provisioner recovery
> complete
> I0116 09:51:46.520517 30022 slave.cpp:5417] Finished recovery
> I0116 09:51:46.521075 30022 slave.cpp:5591] Querying resource estimator
> for oversubscribable resources
> I0116 09:51:46.521334 30017 slave.cpp:5605] Received oversubscribable
> resources {} from the resource estimator
> I0116 09:51:46.524288 30024 process.cpp:3676] Handling HTTP event for
> process 'slave(679)' with path: '/slave(679)/containers'
> I0116 09:51:46.525705 30026 http.cpp:874] Authorizing principal
> 'test-principal' to GET the '/containers' endpoint
> I0116 09:51:46.530148 30023 slave.cpp:796] Agent terminating
> [       OK ] Endpoint/SlaveEndpointTest.AuthorizedRequest/2 (33 ms)
> [ RUN      ] Endpoint/SlaveEndpointTest.UnauthorizedRequest/0
> I0116 09:51:46.542531 29995 containerizer.cpp:220] Using isolation:
> posix/cpu,posix/mem,filesystem/posix,network/cni
> W0116 09:51:46.543054 29995 backend.cpp:76] Failed to create 'aufs'
> backend: AufsBackend requires root privileges, but is running as user mesos
> W0116 09:51:46.543205 29995 backend.cpp:76] Failed to create 'bind'
> backend: BindBackend requires root privileges
> I0116 09:51:46.546699 30020 slave.cpp:209] Mesos agent started on (680)@
> 172.17.0.2:35655
> I0116 09:51:46.546722 30020 slave.cpp:210] Flags at startup: --acls=""
> --appc_simple_discovery_uri_prefix="http://" --appc_store_dir="/tmp/mesos/store/appc"
> --authenticate_http_readonly="true" --authenticate_http_readwrite="true"
> --authenticatee="crammd5" --authentication_backoff_factor="1secs"
> --authorizer="local" --cgroups_cpu_enable_pids_and_tids_count="false"
> --cgroups_enable_cfs="false" --cgroups_hierarchy="/sys/fs/cgroup"
> --cgroups_limit_swap="false" --cgroups_root="mesos" --container_disk_watch_interval="15secs"
> --containerizers="mesos" --credential="/tmp/Endpoint_SlaveEndpointTest_
> UnauthorizedRequest_0_283CCV/credential" --default_role="*"
> --disk_watch_interval="1mins" --docker="docker"
> --docker_kill_orphans="true" --docker_registry="https://
> registry-1.docker.io" --docker_remove_delay="6hrs"
> --docker_socket="/var/run/docker.sock" --docker_stop_timeout="0ns"
> --docker_store_dir="/tmp/mesos/store/docker" --docker_volume_checkpoint_
> dir="/var/run/mesos/isolators/docker/volume" --enforce_container_disk_quota="false"
> --executor_registration_timeout="1mins" --executor_shutdown_grace_period="5secs"
> --fetcher_cache_dir="/tmp/Endpoint_SlaveEndpointTest_
> UnauthorizedRequest_0_283CCV/fetch" --fetcher_cache_size="2GB"
> --frameworks_home="" --gc_delay="1weeks" --gc_disk_headroom="0.1"
> --hadoop_home="" --help="false" --hostname_lookup="true"
> --http_authenticators="basic" --http_command_executor="false"
> --http_credentials="/tmp/Endpoint_SlaveEndpointTest_
> UnauthorizedRequest_0_283CCV/http_credentials" --http_heartbeat_interval="30secs"
> --image_provisioner_backend="copy" --initialize_driver_logging="true"
> --isolation="posix/cpu,posix/mem" --launcher="posix"
> --launcher_dir="/mesos/mesos-1.2.0/_build/src" --logbufsecs="0"
> --logging_level="INFO" --max_completed_executors_per_framework="150"
> --oversubscribed_resources_interval="15secs" --perf_duration="10secs"
> --perf_interval="1mins" --qos_correction_interval_min="0ns"
> --quiet="false" --recover="reconnect" --recovery_timeout="15mins"
> --registration_backoff_factor="10ms" --resources="cpus:2;gpus:0;
> mem:1024;disk:1024;ports:[31000-32000]" --revocable_cpu_low_priority="true"
> --runtime_dir="/tmp/Endpoint_SlaveEndpointTest_UnauthorizedRequest_0_283CCV"
> --sandbox_directory="/mnt/mesos/sandbox" --strict="true"
> --switch_user="true" --systemd_enable_support="true"
> --systemd_runtime_directory="/run/systemd/system" --version="false"
> --work_dir="/tmp/Endpoint_SlaveEndpointTest_UnauthorizedRequest_0_dMm5jr"
> I0116 09:51:46.547276 30020 credentials.hpp:86] Loading credential for
> authentication from '/tmp/Endpoint_SlaveEndpointTest_
> UnauthorizedRequest_0_283CCV/credential'
> I0116 09:51:46.547462 30020 slave.cpp:352] Agent using credential for:
> test-principal
> I0116 09:51:46.547482 30020 credentials.hpp:37] Loading credentials for
> authentication from '/tmp/Endpoint_SlaveEndpointTest_
> UnauthorizedRequest_0_283CCV/http_credentials'
> I0116 09:51:46.547718 30020 http.cpp:922] Using default 'basic' HTTP
> authenticator for realm 'mesos-agent-readonly'
> I0116 09:51:46.547843 30020 http.cpp:922] Using default 'basic' HTTP
> authenticator for realm 'mesos-agent-readwrite'
> I0116 09:51:46.548887 30020 slave.cpp:539] Agent resources: cpus(*):2;
> mem(*):1024; disk(*):1024; ports(*):[31000-32000]
> I0116 09:51:46.548974 30020 slave.cpp:547] Agent attributes: [  ]
> I0116 09:51:46.548987 30020 slave.cpp:552] Agent hostname: e2ceffa41f81
> I0116 09:51:46.550458 30024 state.cpp:60] Recovering state from
> '/tmp/Endpoint_SlaveEndpointTest_UnauthorizedRequest_0_dMm5jr/meta'
> I0116 09:51:46.550839 30029 status_update_manager.cpp:203] Recovering
> status update manager
> I0116 09:51:46.551076 30022 containerizer.cpp:599] Recovering containerizer
> I0116 09:51:46.552680 30017 provisioner.cpp:251] Provisioner recovery
> complete
> I0116 09:51:46.553056 30024 slave.cpp:5417] Finished recovery
> I0116 09:51:46.553587 30024 slave.cpp:5591] Querying resource estimator
> for oversubscribable resources
> I0116 09:51:46.553863 30023 slave.cpp:5605] Received oversubscribable
> resources {} from the resource estimator
> I0116 09:51:46.556442 30025 process.cpp:3676] Handling HTTP event for
> process 'slave(680)' with path: '/slave(680)/monitor/statistics'
> I0116 09:51:46.558060 30017 http.cpp:874] Authorizing principal
> 'test-principal' to GET the '/monitor/statistics' endpoint
> I0116 09:51:46.561043 30018 slave.cpp:796] Agent terminating
> [       OK ] Endpoint/SlaveEndpointTest.UnauthorizedRequest/0 (29 ms)
> [ RUN      ] Endpoint/SlaveEndpointTest.UnauthorizedRequest/1
> I0116 09:51:46.573585 29995 containerizer.cpp:220] Using isolation:
> posix/cpu,posix/mem,filesystem/posix,network/cni
> W0116 09:51:46.574321 29995 backend.cpp:76] Failed to create 'aufs'
> backend: AufsBackend requires root privileges, but is running as user mesos
> W0116 09:51:46.574524 29995 backend.cpp:76] Failed to create 'bind'
> backend: BindBackend requires root privileges
> I0116 09:51:46.578233 30023 slave.cpp:209] Mesos agent started on (681)@
> 172.17.0.2:35655
> I0116 09:51:46.578258 30023 slave.cpp:210] Flags at startup: --acls=""
> --appc_simple_discovery_uri_prefix="http://" --appc_store_dir="/tmp/mesos/store/appc"
> --authenticate_http_readonly="true" --authenticate_http_readwrite="true"
> --authenticatee="crammd5" --authentication_backoff_factor="1secs"
> --authorizer="local" --cgroups_cpu_enable_pids_and_tids_count="false"
> --cgroups_enable_cfs="false" --cgroups_hierarchy="/sys/fs/cgroup"
> --cgroups_limit_swap="false" --cgroups_root="mesos" --container_disk_watch_interval="15secs"
> --containerizers="mesos" --credential="/tmp/Endpoint_SlaveEndpointTest_
> UnauthorizedRequest_1_Qkek5S/credential" --default_role="*"
> --disk_watch_interval="1mins" --docker="docker"
> --docker_kill_orphans="true" --docker_registry="https://
> registry-1.docker.io" --docker_remove_delay="6hrs"
> --docker_socket="/var/run/docker.sock" --docker_stop_timeout="0ns"
> --docker_store_dir="/tmp/mesos/store/docker" --docker_volume_checkpoint_
> dir="/var/run/mesos/isolators/docker/volume" --enforce_container_disk_quota="false"
> --executor_registration_timeout="1mins" --executor_shutdown_grace_period="5secs"
> --fetcher_cache_dir="/tmp/Endpoint_SlaveEndpointTest_
> UnauthorizedRequest_1_Qkek5S/fetch" --fetcher_cache_size="2GB"
> --frameworks_home="" --gc_delay="1weeks" --gc_disk_headroom="0.1"
> --hadoop_home="" --help="false" --hostname_lookup="true"
> --http_authenticators="basic" --http_command_executor="false"
> --http_credentials="/tmp/Endpoint_SlaveEndpointTest_
> UnauthorizedRequest_1_Qkek5S/http_credentials" --http_heartbeat_interval="30secs"
> --image_provisioner_backend="copy" --initialize_driver_logging="true"
> --isolation="posix/cpu,posix/mem" --launcher="posix"
> --launcher_dir="/mesos/mesos-1.2.0/_build/src" --logbufsecs="0"
> --logging_level="INFO" --max_completed_executors_per_framework="150"
> --oversubscribed_resources_interval="15secs" --perf_duration="10secs"
> --perf_interval="1mins" --qos_correction_interval_min="0ns"
> --quiet="false" --recover="reconnect" --recovery_timeout="15mins"
> --registration_backoff_factor="10ms" --resources="cpus:2;gpus:0;
> mem:1024;disk:1024;ports:[31000-32000]" --revocable_cpu_low_priority="true"
> --runtime_dir="/tmp/Endpoint_SlaveEndpointTest_UnauthorizedRequest_1_Qkek5S"
> --sandbox_directory="/mnt/mesos/sandbox" --strict="true"
> --switch_user="true" --systemd_enable_support="true"
> --systemd_runtime_directory="/run/systemd/system" --version="false"
> --work_dir="/tmp/Endpoint_SlaveEndpointTest_UnauthorizedRequest_1_Pa4PHo"
> I0116 09:51:46.578958 30023 credentials.hpp:86] Loading credential for
> authentication from '/tmp/Endpoint_SlaveEndpointTest_
> UnauthorizedRequest_1_Qkek5S/credential'
> I0116 09:51:46.579126 30023 slave.cpp:352] Agent using credential for:
> test-principal
> I0116 09:51:46.579146 30023 credentials.hpp:37] Loading credentials for
> authentication from '/tmp/Endpoint_SlaveEndpointTest_
> UnauthorizedRequest_1_Qkek5S/http_credentials'
> I0116 09:51:46.579442 30023 http.cpp:922] Using default 'basic' HTTP
> authenticator for realm 'mesos-agent-readonly'
> I0116 09:51:46.579633 30023 http.cpp:922] Using default 'basic' HTTP
> authenticator for realm 'mesos-agent-readwrite'
> I0116 09:51:46.581562 30023 slave.cpp:539] Agent resources: cpus(*):2;
> mem(*):1024; disk(*):1024; ports(*):[31000-32000]
> I0116 09:51:46.581728 30023 slave.cpp:547] Agent attributes: [  ]
> I0116 09:51:46.581768 30023 slave.cpp:552] Agent hostname: e2ceffa41f81
> I0116 09:51:46.583212 30025 state.cpp:60] Recovering state from
> '/tmp/Endpoint_SlaveEndpointTest_UnauthorizedRequest_1_Pa4PHo/meta'
> I0116 09:51:46.583648 30016 status_update_manager.cpp:203] Recovering
> status update manager
> I0116 09:51:46.583866 30023 containerizer.cpp:599] Recovering containerizer
> I0116 09:51:46.585520 30025 provisioner.cpp:251] Provisioner recovery
> complete
> I0116 09:51:46.585973 30020 slave.cpp:5417] Finished recovery
> I0116 09:51:46.586565 30020 slave.cpp:5591] Querying resource estimator
> for oversubscribable resources
> I0116 09:51:46.586885 30026 slave.cpp:5605] Received oversubscribable
> resources {} from the resource estimator
> I0116 09:51:46.589584 30015 process.cpp:3676] Handling HTTP event for
> process 'slave(681)' with path: '/slave(681)/monitor/statistics.json'
> I0116 09:51:46.591138 30024 http.cpp:874] Authorizing principal
> 'test-principal' to GET the '/monitor/statistics.json' endpoint
> I0116 09:51:46.594167 30027 slave.cpp:796] Agent terminating
> [       OK ] Endpoint/SlaveEndpointTest.UnauthorizedRequest/1 (31 ms)
> [ RUN      ] Endpoint/SlaveEndpointTest.UnauthorizedRequest/2
> I0116 09:51:46.604389 29995 containerizer.cpp:220] Using isolation:
> posix/cpu,posix/mem,filesystem/posix,network/cni
> W0116 09:51:46.604957 29995 backend.cpp:76] Failed to create 'aufs'
> backend: AufsBackend requires root privileges, but is running as user mesos
> W0116 09:51:46.605130 29995 backend.cpp:76] Failed to create 'bind'
> backend: BindBackend requires root privileges
> I0116 09:51:46.608289 30023 slave.cpp:209] Mesos agent started on (682)@
> 172.17.0.2:35655
> I0116 09:51:46.608315 30023 slave.cpp:210] Flags at startup: --acls=""
> --appc_simple_discovery_uri_prefix="http://" --appc_store_dir="/tmp/mesos/store/appc"
> --authenticate_http_readonly="true" --authenticate_http_readwrite="true"
> --authenticatee="crammd5" --authentication_backoff_factor="1secs"
> --authorizer="local" --cgroups_cpu_enable_pids_and_tids_count="false"
> --cgroups_enable_cfs="false" --cgroups_hierarchy="/sys/fs/cgroup"
> --cgroups_limit_swap="false" --cgroups_root="mesos" --container_disk_watch_interval="15secs"
> --containerizers="mesos" --credential="/tmp/Endpoint_SlaveEndpointTest_
> UnauthorizedRequest_2_e0VISQ/credential" --default_role="*"
> --disk_watch_interval="1mins" --docker="docker"
> --docker_kill_orphans="true" --docker_registry="https://
> registry-1.docker.io" --docker_remove_delay="6hrs"
> --docker_socket="/var/run/docker.sock" --docker_stop_timeout="0ns"
> --docker_store_dir="/tmp/mesos/store/docker" --docker_volume_checkpoint_
> dir="/var/run/mesos/isolators/docker/volume" --enforce_container_disk_quota="false"
> --executor_registration_timeout="1mins" --executor_shutdown_grace_period="5secs"
> --fetcher_cache_dir="/tmp/Endpoint_SlaveEndpointTest_
> UnauthorizedRequest_2_e0VISQ/fetch" --fetcher_cache_size="2GB"
> --frameworks_home="" --gc_delay="1weeks" --gc_disk_headroom="0.1"
> --hadoop_home="" --help="false" --hostname_lookup="true"
> --http_authenticators="basic" --http_command_executor="false"
> --http_credentials="/tmp/Endpoint_SlaveEndpointTest_
> UnauthorizedRequest_2_e0VISQ/http_credentials" --http_heartbeat_interval="30secs"
> --image_provisioner_backend="copy" --initialize_driver_logging="true"
> --isolation="posix/cpu,posix/mem" --launcher="posix"
> --launcher_dir="/mesos/mesos-1.2.0/_build/src" --logbufsecs="0"
> --logging_level="INFO" --max_completed_executors_per_framework="150"
> --oversubscribed_resources_interval="15secs" --perf_duration="10secs"
> --perf_interval="1mins" --qos_correction_interval_min="0ns"
> --quiet="false" --recover="reconnect" --recovery_timeout="15mins"
> --registration_backoff_factor="10ms" --resources="cpus:2;gpus:0;
> mem:1024;disk:1024;ports:[31000-32000]" --revocable_cpu_low_priority="true"
> --runtime_dir="/tmp/Endpoint_SlaveEndpointTest_UnauthorizedRequest_2_e0VISQ"
> --sandbox_directory="/mnt/mesos/sandbox" --strict="true"
> --switch_user="true" --systemd_enable_support="true"
> --systemd_runtime_directory="/run/systemd/system" --version="false"
> --work_dir="/tmp/Endpoint_SlaveEndpointTest_UnauthorizedRequest_2_3Rw9pm"
> I0116 09:51:46.608819 30023 credentials.hpp:86] Loading credential for
> authentication from '/tmp/Endpoint_SlaveEndpointTest_
> UnauthorizedRequest_2_e0VISQ/credential'
> I0116 09:51:46.609014 30023 slave.cpp:352] Agent using credential for:
> test-principal
> I0116 09:51:46.609040 30023 credentials.hpp:37] Loading credentials for
> authentication from '/tmp/Endpoint_SlaveEndpointTest_
> UnauthorizedRequest_2_e0VISQ/http_credentials'
> I0116 09:51:46.609347 30023 http.cpp:922] Using default 'basic' HTTP
> authenticator for realm 'mesos-agent-readonly'
> I0116 09:51:46.609520 30023 http.cpp:922] Using default 'basic' HTTP
> authenticator for realm 'mesos-agent-readwrite'
> I0116 09:51:46.610852 30023 slave.cpp:539] Agent resources: cpus(*):2;
> mem(*):1024; disk(*):1024; ports(*):[31000-32000]
> I0116 09:51:46.610965 30023 slave.cpp:547] Agent attributes: [  ]
> I0116 09:51:46.610991 30023 slave.cpp:552] Agent hostname: e2ceffa41f81
> I0116 09:51:46.612813 30015 state.cpp:60] Recovering state from
> '/tmp/Endpoint_SlaveEndpointTest_UnauthorizedRequest_2_3Rw9pm/meta'
> I0116 09:51:46.613232 30029 status_update_manager.cpp:203] Recovering
> status update manager
> I0116 09:51:46.613477 30022 containerizer.cpp:599] Recovering containerizer
> I0116 09:51:46.615188 30026 provisioner.cpp:251] Provisioner recovery
> complete
> I0116 09:51:46.615689 30015 slave.cpp:5417] Finished recovery
> I0116 09:51:46.616334 30015 slave.cpp:5591] Querying resource estimator
> for oversubscribable resources
> I0116 09:51:46.616644 30014 slave.cpp:5605] Received oversubscribable
> resources {} from the resource estimator
> I0116 09:51:46.619860 30017 process.cpp:3676] Handling HTTP event for
> process 'slave(682)' with path: '/slave(682)/containers'
> I0116 09:51:46.621522 30019 http.cpp:874] Authorizing principal
> 'test-principal' to GET the '/containers' endpoint
> I0116 09:51:46.624193 30021 slave.cpp:796] Agent terminating
> [       OK ] Endpoint/SlaveEndpointTest.UnauthorizedRequest/2 (31 ms)
> [ RUN      ] Endpoint/SlaveEndpointTest.NoAuthorizer/0
> I0116 09:51:46.638782 29995 containerizer.cpp:220] Using isolation:
> posix/cpu,posix/mem,filesystem/posix,network/cni
> W0116 09:51:46.639811 29995 backend.cpp:76] Failed to create 'aufs'
> backend: AufsBackend requires root privileges, but is running as user mesos
> W0116 09:51:46.640041 29995 backend.cpp:76] Failed to create 'bind'
> backend: BindBackend requires root privileges
> I0116 09:51:46.642457 29995 cluster.cpp:446] Creating default 'local'
> authorizer
> I0116 09:51:46.644047 30028 slave.cpp:209] Mesos agent started on (683)@
> 172.17.0.2:35655
> I0116 09:51:46.644073 30028 slave.cpp:210] Flags at startup: --acls=""
> --appc_simple_discovery_uri_prefix="http://" --appc_store_dir="/tmp/mesos/store/appc"
> --authenticate_http_readonly="true" --authenticate_http_readwrite="true"
> --authenticatee="crammd5" --authentication_backoff_factor="1secs"
> --authorizer="local" --cgroups_cpu_enable_pids_and_tids_count="false"
> --cgroups_enable_cfs="false" --cgroups_hierarchy="/sys/fs/cgroup"
> --cgroups_limit_swap="false" --cgroups_root="mesos" --container_disk_watch_interval="15secs"
> --containerizers="mesos" --credential="/tmp/Endpoint_SlaveEndpointTest_
> NoAuthorizer_0_QyJJ0O/credential" --default_role="*"
> --disk_watch_interval="1mins" --docker="docker"
> --docker_kill_orphans="true" --docker_registry="https://
> registry-1.docker.io" --docker_remove_delay="6hrs"
> --docker_socket="/var/run/docker.sock" --docker_stop_timeout="0ns"
> --docker_store_dir="/tmp/mesos/store/docker" --docker_volume_checkpoint_
> dir="/var/run/mesos/isolators/docker/volume" --enforce_container_disk_quota="false"
> --executor_registration_timeout="1mins" --executor_shutdown_grace_period="5secs"
> --fetcher_cache_dir="/tmp/Endpoint_SlaveEndpointTest_NoAuthorizer_0_QyJJ0O/fetch"
> --fetcher_cache_size="2GB" --frameworks_home="" --gc_delay="1weeks"
> --gc_disk_headroom="0.1" --hadoop_home="" --help="false"
> --hostname_lookup="true" --http_authenticators="basic"
> --http_command_executor="false" --http_credentials="/tmp/
> Endpoint_SlaveEndpointTest_NoAuthorizer_0_QyJJ0O/http_credentials"
> --http_heartbeat_interval="30secs" --image_provisioner_backend="copy"
> --initialize_driver_logging="true" --isolation="posix/cpu,posix/mem"
> --launcher="posix" --launcher_dir="/mesos/mesos-1.2.0/_build/src"
> --logbufsecs="0" --logging_level="INFO" --max_completed_executors_per_framework="150"
> --oversubscribed_resources_interval="15secs" --perf_duration="10secs"
> --perf_interval="1mins" --qos_correction_interval_min="0ns"
> --quiet="false" --recover="reconnect" --recovery_timeout="15mins"
> --registration_backoff_factor="10ms" --resources="cpus:2;gpus:0;
> mem:1024;disk:1024;ports:[31000-32000]" --revocable_cpu_low_priority="true"
> --runtime_dir="/tmp/Endpoint_SlaveEndpointTest_NoAuthorizer_0_QyJJ0O"
> --sandbox_directory="/mnt/mesos/sandbox" --strict="true"
> --switch_user="true" --systemd_enable_support="true"
> --systemd_runtime_directory="/run/systemd/system" --version="false"
> --work_dir="/tmp/Endpoint_SlaveEndpointTest_NoAuthorizer_0_VSkQsk"
> I0116 09:51:46.644632 30028 credentials.hpp:86] Loading credential for
> authentication from '/tmp/Endpoint_SlaveEndpointTest_
> NoAuthorizer_0_QyJJ0O/credential'
> I0116 09:51:46.644876 30028 slave.cpp:352] Agent using credential for:
> test-principal
> I0116 09:51:46.644902 30028 credentials.hpp:37] Loading credentials for
> authentication from '/tmp/Endpoint_SlaveEndpointTest_
> NoAuthorizer_0_QyJJ0O/http_credentials'
> I0116 09:51:46.645268 30028 http.cpp:922] Using default 'basic' HTTP
> authenticator for realm 'mesos-agent-readonly'
> I0116 09:51:46.645401 30028 http.cpp:922] Using default 'basic' HTTP
> authenticator for realm 'mesos-agent-readwrite'
> I0116 09:51:46.646754 30028 slave.cpp:539] Agent resources: cpus(*):2;
> mem(*):1024; disk(*):1024; ports(*):[31000-32000]
> I0116 09:51:46.646878 30028 slave.cpp:547] Agent attributes: [  ]
> I0116 09:51:46.646898 30028 slave.cpp:552] Agent hostname: e2ceffa41f81
> I0116 09:51:46.648572 30023 state.cpp:60] Recovering state from
> '/tmp/Endpoint_SlaveEndpointTest_NoAuthorizer_0_VSkQsk/meta'
> I0116 09:51:46.648880 30027 status_update_manager.cpp:203] Recovering
> status update manager
> I0116 09:51:46.649127 30024 containerizer.cpp:599] Recovering containerizer
> I0116 09:51:46.650606 30023 provisioner.cpp:251] Provisioner recovery
> complete
> I0116 09:51:46.650980 30014 slave.cpp:5417] Finished recovery
> I0116 09:51:46.651558 30014 slave.cpp:5591] Querying resource estimator
> for oversubscribable resources
> I0116 09:51:46.651875 30027 slave.cpp:5605] Received oversubscribable
> resources {} from the resource estimator
> I0116 09:51:46.654917 30023 process.cpp:3676] Handling HTTP event for
> process 'slave(683)' with path: '/slave(683)/monitor/statistics'
> I0116 09:51:46.656316 30028 http.cpp:874] Authorizing principal
> 'test-principal' to GET the '/monitor/statistics' endpoint
> I0116 09:51:46.659951 30015 slave.cpp:796] Agent terminating
> [       OK ] Endpoint/SlaveEndpointTest.NoAuthorizer/0 (35 ms)
> [ RUN      ] Endpoint/SlaveEndpointTest.NoAuthorizer/1
> I0116 09:51:46.673064 29995 containerizer.cpp:220] Using isolation:
> posix/cpu,posix/mem,filesystem/posix,network/cni
> W0116 09:51:46.673629 29995 backend.cpp:76] Failed to create 'aufs'
> backend: AufsBackend requires root privileges, but is running as user mesos
> W0116 09:51:46.673831 29995 backend.cpp:76] Failed to create 'bind'
> backend: BindBackend requires root privileges
> I0116 09:51:46.675446 29995 cluster.cpp:446] Creating default 'local'
> authorizer
> I0116 09:51:46.677063 30029 slave.cpp:209] Mesos agent started on (684)@
> 172.17.0.2:35655
> I0116 09:51:46.677089 30029 slave.cpp:210] Flags at startup: --acls=""
> --appc_simple_discovery_uri_prefix="http://" --appc_store_dir="/tmp/mesos/store/appc"
> --authenticate_http_readonly="true" --authenticate_http_readwrite="true"
> --authenticatee="crammd5" --authentication_backoff_factor="1secs"
> --authorizer="local" --cgroups_cpu_enable_pids_and_tids_count="false"
> --cgroups_enable_cfs="false" --cgroups_hierarchy="/sys/fs/cgroup"
> --cgroups_limit_swap="false" --cgroups_root="mesos" --container_disk_watch_interval="15secs"
> --containerizers="mesos" --credential="/tmp/Endpoint_SlaveEndpointTest_
> NoAuthorizer_1_2SlHvN/credential" --default_role="*"
> --disk_watch_interval="1mins" --docker="docker"
> --docker_kill_orphans="true" --docker_registry="https://
> registry-1.docker.io" --docker_remove_delay="6hrs"
> --docker_socket="/var/run/docker.sock" --docker_stop_timeout="0ns"
> --docker_store_dir="/tmp/mesos/store/docker" --docker_volume_checkpoint_
> dir="/var/run/mesos/isolators/docker/volume" --enforce_container_disk_quota="false"
> --executor_registration_timeout="1mins" --executor_shutdown_grace_period="5secs"
> --fetcher_cache_dir="/tmp/Endpoint_SlaveEndpointTest_NoAuthorizer_1_2SlHvN/fetch"
> --fetcher_cache_size="2GB" --frameworks_home="" --gc_delay="1weeks"
> --gc_disk_headroom="0.1" --hadoop_home="" --help="false"
> --hostname_lookup="true" --http_authenticators="basic"
> --http_command_executor="false" --http_credentials="/tmp/
> Endpoint_SlaveEndpointTest_NoAuthorizer_1_2SlHvN/http_credentials"
> --http_heartbeat_interval="30secs" --image_provisioner_backend="copy"
> --initialize_driver_logging="true" --isolation="posix/cpu,posix/mem"
> --launcher="posix" --launcher_dir="/mesos/mesos-1.2.0/_build/src"
> --logbufsecs="0" --logging_level="INFO" --max_completed_executors_per_framework="150"
> --oversubscribed_resources_interval="15secs" --perf_duration="10secs"
> --perf_interval="1mins" --qos_correction_interval_min="0ns"
> --quiet="false" --recover="reconnect" --recovery_timeout="15mins"
> --registration_backoff_factor="10ms" --resources="cpus:2;gpus:0;
> mem:1024;disk:1024;ports:[31000-32000]" --revocable_cpu_low_priority="true"
> --runtime_dir="/tmp/Endpoint_SlaveEndpointTest_NoAuthorizer_1_2SlHvN"
> --sandbox_directory="/mnt/mesos/sandbox" --strict="true"
> --switch_user="true" --systemd_enable_support="true"
> --systemd_runtime_directory="/run/systemd/system" --version="false"
> --work_dir="/tmp/Endpoint_SlaveEndpointTest_NoAuthorizer_1_VGY6Ri"
> I0116 09:51:46.677721 30029 credentials.hpp:86] Loading credential for
> authentication from '/tmp/Endpoint_SlaveEndpointTest_
> NoAuthorizer_1_2SlHvN/credential'
> I0116 09:51:46.677924 30029 slave.cpp:352] Agent using credential for:
> test-principal
> I0116 09:51:46.677952 30029 credentials.hpp:37] Loading credentials for
> authentication from '/tmp/Endpoint_SlaveEndpointTest_
> NoAuthorizer_1_2SlHvN/http_credentials'
> I0116 09:51:46.678208 30029 http.cpp:922] Using default 'basic' HTTP
> authenticator for realm 'mesos-agent-readonly'
> I0116 09:51:46.678366 30029 http.cpp:922] Using default 'basic' HTTP
> authenticator for realm 'mesos-agent-readwrite'
> I0116 09:51:46.679630 30029 slave.cpp:539] Agent resources: cpus(*):2;
> mem(*):1024; disk(*):1024; ports(*):[31000-32000]
> I0116 09:51:46.679725 30029 slave.cpp:547] Agent attributes: [  ]
> I0116 09:51:46.679747 30029 slave.cpp:552] Agent hostname: e2ceffa41f81
> I0116 09:51:46.681366 30028 state.cpp:60] Recovering state from
> '/tmp/Endpoint_SlaveEndpointTest_NoAuthorizer_1_VGY6Ri/meta'
> I0116 09:51:46.681709 30027 status_update_manager.cpp:203] Recovering
> status update manager
> I0116 09:51:46.681936 30015 containerizer.cpp:599] Recovering containerizer
> I0116 09:51:46.683468 30015 provisioner.cpp:251] Provisioner recovery
> complete
> I0116 09:51:46.683886 30018 slave.cpp:5417] Finished recovery
> I0116 09:51:46.684502 30018 slave.cpp:5591] Querying resource estimator
> for oversubscribable resources
> I0116 09:51:46.684775 30020 slave.cpp:5605] Received oversubscribable
> resources {} from the resource estimator
> I0116 09:51:46.687891 30022 process.cpp:3676] Handling HTTP event for
> process 'slave(684)' with path: '/slave(684)/monitor/statistics.json'
> I0116 09:51:46.690178 30018 http.cpp:874] Authorizing principal
> 'test-principal' to GET the '/monitor/statistics.json' endpoint
> I0116 09:51:46.694223 30016 slave.cpp:796] Agent terminating
> [       OK ] Endpoint/SlaveEndpointTest.NoAuthorizer/1 (33 ms)
> [ RUN      ] Endpoint/SlaveEndpointTest.NoAuthorizer/2
> I0116 09:51:46.705404 29995 containerizer.cpp:220] Using isolation:
> posix/cpu,posix/mem,filesystem/posix,network/cni
> W0116 09:51:46.705979 29995 backend.cpp:76] Failed to create 'aufs'
> backend: AufsBackend requires root privileges, but is running as user mesos
> W0116 09:51:46.706132 29995 backend.cpp:76] Failed to create 'bind'
> backend: BindBackend requires root privileges
> I0116 09:51:46.707629 29995 cluster.cpp:446] Creating default 'local'
> authorizer
> I0116 09:51:46.709239 30019 slave.cpp:209] Mesos agent started on (685)@
> 172.17.0.2:35655
> I0116 09:51:46.709260 30019 slave.cpp:210] Flags at startup: --acls=""
> --appc_simple_discovery_uri_prefix="http://" --appc_store_dir="/tmp/mesos/store/appc"
> --authenticate_http_readonly="true" --authenticate_http_readwrite="true"
> --authenticatee="crammd5" --authentication_backoff_factor="1secs"
> --authorizer="local" --cgroups_cpu_enable_pids_and_tids_count="false"
> --cgroups_enable_cfs="false" --cgroups_hierarchy="/sys/fs/cgroup"
> --cgroups_limit_swap="false" --cgroups_root="mesos" --container_disk_watch_interval="15secs"
> --containerizers="mesos" --credential="/tmp/Endpoint_SlaveEndpointTest_
> NoAuthorizer_2_07OmmM/credential" --default_role="*"
> --disk_watch_interval="1mins" --docker="docker"
> --docker_kill_orphans="true" --docker_registry="https://
> registry-1.docker.io" --docker_remove_delay="6hrs"
> --docker_socket="/var/run/docker.sock" --docker_stop_timeout="0ns"
> --docker_store_dir="/tmp/mesos/store/docker" --docker_volume_checkpoint_
> dir="/var/run/mesos/isolators/docker/volume" --enforce_container_disk_quota="false"
> --executor_registration_timeout="1mins" --executor_shutdown_grace_period="5secs"
> --fetcher_cache_dir="/tmp/Endpoint_SlaveEndpointTest_NoAuthorizer_2_07OmmM/fetch"
> --fetcher_cache_size="2GB" --frameworks_home="" --gc_delay="1weeks"
> --gc_disk_headroom="0.1" --hadoop_home="" --help="false"
> --hostname_lookup="true" --http_authenticators="basic"
> --http_command_executor="false" --http_credentials="/tmp/
> Endpoint_SlaveEndpointTest_NoAuthorizer_2_07OmmM/http_credentials"
> --http_heartbeat_interval="30secs" --image_provisioner_backend="copy"
> --initialize_driver_logging="true" --isolation="posix/cpu,posix/mem"
> --launcher="posix" --launcher_dir="/mesos/mesos-1.2.0/_build/src"
> --logbufsecs="0" --logging_level="INFO" --max_completed_executors_per_framework="150"
> --oversubscribed_resources_interval="15secs" --perf_duration="10secs"
> --perf_interval="1mins" --qos_correction_interval_min="0ns"
> --quiet="false" --recover="reconnect" --recovery_timeout="15mins"
> --registration_backoff_factor="10ms" --resources="cpus:2;gpus:0;
> mem:1024;disk:1024;ports:[31000-32000]" --revocable_cpu_low_priority="true"
> --runtime_dir="/tmp/Endpoint_SlaveEndpointTest_NoAuthorizer_2_07OmmM"
> --sandbox_directory="/mnt/mesos/sandbox" --strict="true"
> --switch_user="true" --systemd_enable_support="true"
> --systemd_runtime_directory="/run/systemd/system" --version="false"
> --work_dir="/tmp/Endpoint_SlaveEndpointTest_NoAuthorizer_2_ZZdmDh"
> I0116 09:51:46.709749 30019 credentials.hpp:86] Loading credential for
> authentication from '/tmp/Endpoint_SlaveEndpointTest_
> NoAuthorizer_2_07OmmM/credential'
> I0116 09:51:46.709928 30019 slave.cpp:352] Agent using credential for:
> test-principal
> I0116 09:51:46.709956 30019 credentials.hpp:37] Loading credentials for
> authentication from '/tmp/Endpoint_SlaveEndpointTest_
> NoAuthorizer_2_07OmmM/http_credentials'
> I0116 09:51:46.710218 30019 http.cpp:922] Using default 'basic' HTTP
> authenticator for realm 'mesos-agent-readonly'
> I0116 09:51:46.710355 30019 http.cpp:922] Using default 'basic' HTTP
> authenticator for realm 'mesos-agent-readwrite'
> I0116 09:51:46.711472 30019 slave.cpp:539] Agent resources: cpus(*):2;
> mem(*):1024; disk(*):1024; ports(*):[31000-32000]
> I0116 09:51:46.711549 30019 slave.cpp:547] Agent attributes: [  ]
> I0116 09:51:46.711562 30019 slave.cpp:552] Agent hostname: e2ceffa41f81
> I0116 09:51:46.713201 30021 state.cpp:60] Recovering state from
> '/tmp/Endpoint_SlaveEndpointTest_NoAuthorizer_2_ZZdmDh/meta'
> I0116 09:51:46.713732 30025 status_update_manager.cpp:203] Recovering
> status update manager
> I0116 09:51:46.713961 30026 containerizer.cpp:599] Recovering containerizer
> I0116 09:51:46.715881 30021 provisioner.cpp:251] Provisioner recovery
> complete
> I0116 09:51:46.716437 30024 slave.cpp:5417] Finished recovery
> I0116 09:51:46.717211 30024 slave.cpp:5591] Querying resource estimator
> for oversubscribable resources
> I0116 09:51:46.717609 30016 slave.cpp:5605] Received oversubscribable
> resources {} from the resource estimator
> I0116 09:51:46.720813 30023 process.cpp:3676] Handling HTTP event for
> process 'slave(685)' with path: '/slave(685)/containers'
> I0116 09:51:46.722326 30014 http.cpp:874] Authorizing principal
> 'test-principal' to GET the '/containers' endpoint
> I0116 09:51:46.726469 30019 slave.cpp:796] Agent terminating
> [       OK ] Endpoint/SlaveEndpointTest.NoAuthorizer/2 (32 ms)
> [----------] 9 tests from Endpoint/SlaveEndpointTest (300 ms total)
>
> [----------] Global test environment tear-down
> [==========] 1448 tests from 164 test cases ran. (422988 ms total)
> [  PASSED  ] 1447 tests.
> [  FAILED  ] 1 test, listed below:
> [  FAILED  ] FaultToleranceTest.FrameworkReregister
>
>  1 FAILED TEST
>   YOU HAVE 14 DISABLED TESTS
>
> make[4]: *** [check-local] Error 1
> make[4]: Leaving directory `/mesos/mesos-1.2.0/_build/src'
> make[3]: *** [check-am] Error 2
> make[3]: Leaving directory `/mesos/mesos-1.2.0/_build/src'
> make[2]: *** [check] Error 2
> make[2]: Leaving directory `/mesos/mesos-1.2.0/_build/src'
> make[1]: *** [check-recursive] Error 1
> make[1]: Leaving directory `/mesos/mesos-1.2.0/_build'
> make: *** [distcheck] Error 1
> + docker rmi mesos-1484557246-15527
> Untagged: mesos-1484557246-15527:latest
> Deleted: sha256:7e41de3bcd89de24d2fa1732bbf3b7
> 94315d57c4b39272819a3352d81e66fda7
> Deleted: sha256:3f6233d3d412d3c2f0e5b139662726
> 087a62de91e42bcfdbe6e29f16cf168a23
> Deleted: sha256:33d2cfbd359052567396d05fa7d728
> 358ade0ac7c19448cf92c19eb49eef33c0
> Deleted: sha256:0c3332f718962c35fd4e057e96c499
> 2cead66190e3dad31a3a06ed4f9e06f593
> Deleted: sha256:dac2d6d60faf5096869c781be0055f
> 76e7cc9fc11dfeb6c55eef6dc46213e668
> Deleted: sha256:dba0ff0440cf8fdae0611e8c4f2b8e
> a943aba113a2cea180616465a35c96d7b5
> Deleted: sha256:25788368e293262f41ac6a0cee1620
> 440ade6ab611c0bd63a179155ce4bb21f6
> Deleted: sha256:b331f2b012fd0d73f71fc8b108fa74
> c60f92532c044aa7c89e047d600375e8a8
> Deleted: sha256:08713ecad5b9582ca5dc964b143e3d
> 7d96ae1007fccd437c3fa282a28ed6c812
> Deleted: sha256:f0e7c7649e66da55f977e7c9a5f2f7
> 4e420818b97793e63fe6cf2aeba5bad72a
> Deleted: sha256:dff9b65efc5da7bf593769012fca1b
> 273ff65e61c9ce33557038f77d509b81e2
> Deleted: sha256:9e9afcccf4a164a4cab96a39dcfae3
> 2e865ec5a1510acb7b1a5da47536a367a0
> Deleted: sha256:d9f66a16251428503ead9223880864
> bada17004c0b8386fd1447d5c869efe47b
> Deleted: sha256:1d83ae0590cb47b6d908e14c8edc95
> 5f2001185219b52a3c7979fdcdfa6fa543
> Deleted: sha256:043c7708b6e96b2126cbcf93771444
> 784e406e2999fc007ef7bcc7958126a2f0
> Deleted: sha256:312106843ae2f45d1b2fa20c66ddb0
> 218ef2866c937c1ee01f33afafd5fe11e5
> Deleted: sha256:f12d0668d5f137baee384875fba45a
> 5554f2ed5a352354b6586cedb2d3a02164
> Deleted: sha256:263a1dd3cfe471a0459f980a3a02e0
> 5e922357e6bb4a8632ec7ce91d68027846
> Deleted: sha256:55008d69864fe805b9caffb9c2a1a9
> 3f3faf98eca874a94e8e59e97f79c087e0
> Deleted: sha256:2bd3154e97de566b758629fd7559ed
> fe520ae2cc15e48ebe3b2287b569b22a8e
> Deleted: sha256:a9b827d4b09db7670234d5b1540e14
> ca2889a98689c865da57028145026fcfa5
> Deleted: sha256:2ff7af7b209346b763568ca675e3e5
> cfc526a54899110cb80e564bd300c7777b
> Deleted: sha256:5f49c4d879bed096cdc0419c13e00c
> 75468316639bbd83088ddfd8a71e3ee45b
> Deleted: sha256:fbc0794a6e54fbabc24a52cdb68a74
> a37416b8b85c8e40d0533e4cc582bc99b1
> Build step 'Execute shell' marked build as failure
>

Mime
  • Unnamed multipart/alternative (inline, None, 0 bytes)
View raw message