mesos-builds mailing list archives

Site index · List index
Message view « Date » · « Thread »
Top « Date » · « Thread »
From Greg Mann <g...@mesosphere.io>
Subject Re: Build failed in Jenkins: Mesos-Buildbot » cmake,gcc,--verbose,GLOG_v=1 MESOS_VERBOSE=1,ubuntu:14.04,(docker||Hadoop)&&(!ubuntu-us1)&&(!ubuntu-eu2) #3198
Date Fri, 27 Jan 2017 21:39:19 GMT
I created a ticket to track this here:
https://issues.apache.org/jira/browse/MESOS-7023

Kevin, since you have context on the IO switchboard, do you have a spare
cycle to triage and see if this is a real issue, or test-only?

On Fri, Jan 27, 2017 at 12:21 PM, Kevin Klues <klueska@mesosphere.io> wrote:

> It's different the error with this one is:
>
> /mesos/src/tests/containerizer/io_switchboard_tests.cpp:1052: Failure
> Value of: statusFailed->reason()
>   Actual: 1
> Expected: TaskStatus::REASON_IO_SWITCHBOARD_EXITED
>
>
> On Fri, Jan 27, 2017 at 11:27 AM Greg Mann <greg@mesosphere.io> wrote:
>
>> Kevin, Anand, does this look like the same IOSwitchboard issue you guys
>> have been working on? I think this is a different test, but perhaps the
>> same root cause? The relevant log from this build's console output is
>> attached.
>>
>> On Fri, Jan 27, 2017 at 11:20 AM, Apache Jenkins Server <
>> jenkins@builds.apache.org> wrote:
>>
>> See <https://builds.apache.org/job/Mesos-Buildbot/BUILDTOOL=
>> cmake,COMPILER=gcc,CONFIGURATION=--verbose,ENVIRONMENT=GLOG_v=1%20MESOS_
>> VERBOSE=1,OS=ubuntu%3A14.04,label_exp=(docker%7C%7CHadoop)
>> &&(!ubuntu-us1)&&(!ubuntu-eu2)/3198/changes>
>>
>> Changes:
>>
>> [vinodkone] Added Dmitry Zhuk to contributors.
>>
>> ------------------------------------------
>> [...truncated 165002 lines...]
>> I0127 19:20:05.123771 26250 slave.cpp:352] Agent using credential for:
>> test-principal
>> I0127 19:20:05.123790 26250 credentials.hpp:37] Loading credentials for
>> authentication from '/tmp/Endpoint_SlaveEndpointTest_
>> AuthorizedRequest_1_NT0LgZ/http_credentials'
>> I0127 19:20:05.123920 26250 http.cpp:922] Using default 'basic' HTTP
>> authenticator for realm 'mesos-agent-readonly'
>> I0127 19:20:05.123975 26250 http.cpp:922] Using default 'basic' HTTP
>> authenticator for realm 'mesos-agent-readwrite'
>> I0127 19:20:05.124395 26250 slave.cpp:539] Agent resources: cpus(*):2;
>> mem(*):1024; disk(*):1024; ports(*):[31000-32000]
>> I0127 19:20:05.124444 26250 slave.cpp:547] Agent attributes: [  ]
>> I0127 19:20:05.124454 26250 slave.cpp:552] Agent hostname: 2e493164cbc4
>> I0127 19:20:05.124838 26250 status_update_manager.cpp:177] Pausing
>> sending status updates
>> I0127 19:20:05.125099 26250 state.cpp:60] Recovering state from
>> '/tmp/Endpoint_SlaveEndpointTest_AuthorizedRequest_1_2bjoB8/meta'
>> I0127 19:20:05.125247 26250 status_update_manager.cpp:203] Recovering
>> status update manager
>> I0127 19:20:05.125308 26250 containerizer.cpp:599] Recovering
>> containerizer
>> I0127 19:20:05.125802 26250 provisioner.cpp:251] Provisioner recovery
>> complete
>> I0127 19:20:05.125967 26250 slave.cpp:5422] Finished recovery
>> I0127 19:20:05.126452 26250 slave.cpp:5596] Querying resource estimator
>> for oversubscribable resources
>> I0127 19:20:05.126618 26250 slave.cpp:5610] Received oversubscribable
>> resources {} from the resource estimator
>> I0127 19:20:05.127507 26252 process.cpp:3697] Handling HTTP event for
>> process 'slave(680)' with path: '/slave(680)/monitor/statistics.json'
>> I0127 19:20:05.127966 26246 http.cpp:874] Authorizing principal
>> 'test-principal' to GET the '/monitor/statistics.json' endpoint
>> I0127 19:20:05.130669 26245 slave.cpp:801] Agent terminating
>> [       OK ] Endpoint/SlaveEndpointTest.AuthorizedRequest/1 (27 ms)
>> [ RUN      ] Endpoint/SlaveEndpointTest.AuthorizedRequest/2
>> I0127 19:20:05.148943 26238 containerizer.cpp:220] Using isolation:
>> posix/cpu,posix/mem,filesystem/posix,network/cni
>> W0127 19:20:05.149219 26238 backend.cpp:76] Failed to create 'aufs'
>> backend: AufsBackend requires root privileges
>> W0127 19:20:05.149281 26238 backend.cpp:76] Failed to create 'bind'
>> backend: BindBackend requires root privileges
>> I0127 19:20:05.150223 26251 slave.cpp:209] Mesos agent started on (681)@
>> 172.17.0.3:59334
>> I0127 19:20:05.150240 26251 slave.cpp:210] Flags at startup: --acls=""
>> --appc_simple_discovery_uri_prefix="http://"
>> --appc_store_dir="/tmp/mesos/store/appc" --authenticate_http_readonly="true"
>> --authenticate_http_readwrite="true" --authenticatee="crammd5"
>> --authentication_backoff_factor="1secs" --authorizer="local"
>> --cgroups_cpu_enable_pids_and_tids_count="false"
>> --cgroups_enable_cfs="false" --cgroups_hierarchy="/sys/fs/cgroup"
>> --cgroups_limit_swap="false" --cgroups_root="mesos" --container_disk_watch_interval="15secs"
>> --containerizers="mesos" --credential="/tmp/Endpoint_SlaveEndpointTest_
>> AuthorizedRequest_2_iQUsao/credential" --default_role="*"
>> --disk_watch_interval="1mins" --docker="docker"
>> --docker_kill_orphans="true" --docker_registry="https://
>> registry-1.docker.io" --docker_remove_delay="6hrs"
>> --docker_socket="/var/run/docker.sock" --docker_stop_timeout="0ns"
>> --docker_store_dir="/tmp/mesos/store/docker" --docker_volume_checkpoint_
>> dir="/var/run/mesos/isolators/docker/volume" --enforce_container_disk_quota="false"
>> --executor_registration_timeout="1mins" --executor_shutdown_grace_period="5secs"
>> --fetcher_cache_dir="/tmp/Endpoint_SlaveEndpointTest_
>> AuthorizedRequest_2_iQUsao/fetch" --fetcher_cache_size="2GB"
>> --frameworks_home="" --gc_delay="1weeks" --gc_disk_headroom="0.1"
>> --hadoop_home="" --help="false" --hostname_lookup="true"
>> --http_authenticators="basic" --http_command_executor="false"
>> --http_credentials="/tmp/Endpoint_SlaveEndpointTest_
>> AuthorizedRequest_2_iQUsao/http_credentials" --http_heartbeat_interval="30secs"
>> --image_provisioner_backend="copy" --initialize_driver_logging="true"
>> --isolation="posix/cpu,posix/mem" --launcher="posix"
>> --launcher_dir="/mesos/build/src" --logbufsecs="0"
>> --logging_level="INFO" --max_completed_executors_per_framework="150"
>> --oversubscribed_resources_interval="15secs" --perf_duration="10secs"
>> --perf_interval="1mins" --qos_correction_interval_min="0ns"
>> --quiet="false" --recover="reconnect" --recovery_timeout="15mins"
>> --registration_backoff_factor="10ms" --resources="cpus:2;gpus:0;
>> mem:1024;disk:1024;ports:[31000-32000]" --revocable_cpu_low_priority="true"
>> --runtime_dir="/tmp/Endpoint_SlaveEndpointTest_AuthorizedRequest_2_iQUsao"
>> --sandbox_directory="/mnt/mesos/sandbox" --strict="true"
>> --switch_user="true" --systemd_enable_support="true"
>> --systemd_runtime_directory="/run/systemd/system" --version="false"
>> --work_dir="/tmp/Endpoint_SlaveEndpointTest_AuthorizedRequest_2_w9qCqx"
>> I0127 19:20:05.150483 26251 credentials.hpp:86] Loading credential for
>> authentication from '/tmp/Endpoint_SlaveEndpointTest_
>> AuthorizedRequest_2_iQUsao/credential'
>> I0127 19:20:05.150590 26251 slave.cpp:352] Agent using credential for:
>> test-principal
>> I0127 19:20:05.150605 26251 credentials.hpp:37] Loading credentials for
>> authentication from '/tmp/Endpoint_SlaveEndpointTest_
>> AuthorizedRequest_2_iQUsao/http_credentials'
>> I0127 19:20:05.150717 26251 http.cpp:922] Using default 'basic' HTTP
>> authenticator for realm 'mesos-agent-readonly'
>> I0127 19:20:05.150770 26251 http.cpp:922] Using default 'basic' HTTP
>> authenticator for realm 'mesos-agent-readwrite'
>> I0127 19:20:05.151159 26251 slave.cpp:539] Agent resources: cpus(*):2;
>> mem(*):1024; disk(*):1024; ports(*):[31000-32000]
>> I0127 19:20:05.151191 26251 slave.cpp:547] Agent attributes: [  ]
>> I0127 19:20:05.151197 26251 slave.cpp:552] Agent hostname: 2e493164cbc4
>> I0127 19:20:05.151257 26245 status_update_manager.cpp:177] Pausing
>> sending status updates
>> I0127 19:20:05.151608 26251 state.cpp:60] Recovering state from
>> '/tmp/Endpoint_SlaveEndpointTest_AuthorizedRequest_2_w9qCqx/meta'
>> I0127 19:20:05.151707 26251 status_update_manager.cpp:203] Recovering
>> status update manager
>> I0127 19:20:05.151746 26251 containerizer.cpp:599] Recovering
>> containerizer
>> I0127 19:20:05.152127 26251 provisioner.cpp:251] Provisioner recovery
>> complete
>> I0127 19:20:05.152212 26251 slave.cpp:5422] Finished recovery
>> I0127 19:20:05.152537 26251 slave.cpp:5596] Querying resource estimator
>> for oversubscribable resources
>> I0127 19:20:05.152647 26251 slave.cpp:5610] Received oversubscribable
>> resources {} from the resource estimator
>> I0127 19:20:05.153687 26241 process.cpp:3697] Handling HTTP event for
>> process 'slave(681)' with path: '/slave(681)/containers'
>> I0127 19:20:05.154251 26239 http.cpp:874] Authorizing principal
>> 'test-principal' to GET the '/containers' endpoint
>> I0127 19:20:05.155908 26251 slave.cpp:801] Agent terminating
>> [       OK ] Endpoint/SlaveEndpointTest.AuthorizedRequest/2 (12 ms)
>> [ RUN      ] Endpoint/SlaveEndpointTest.UnauthorizedRequest/0
>> I0127 19:20:05.160609 26238 containerizer.cpp:220] Using isolation:
>> posix/cpu,posix/mem,filesystem/posix,network/cni
>> W0127 19:20:05.160853 26238 backend.cpp:76] Failed to create 'aufs'
>> backend: AufsBackend requires root privileges
>> W0127 19:20:05.160889 26238 backend.cpp:76] Failed to create 'bind'
>> backend: BindBackend requires root privileges
>> I0127 19:20:05.161722 26241 slave.cpp:209] Mesos agent started on (682)@
>> 172.17.0.3:59334
>> I0127 19:20:05.161738 26241 slave.cpp:210] Flags at startup: --acls=""
>> --appc_simple_discovery_uri_prefix="http://"
>> --appc_store_dir="/tmp/mesos/store/appc" --authenticate_http_readonly="true"
>> --authenticate_http_readwrite="true" --authenticatee="crammd5"
>> --authentication_backoff_factor="1secs" --authorizer="local"
>> --cgroups_cpu_enable_pids_and_tids_count="false"
>> --cgroups_enable_cfs="false" --cgroups_hierarchy="/sys/fs/cgroup"
>> --cgroups_limit_swap="false" --cgroups_root="mesos" --container_disk_watch_interval="15secs"
>> --containerizers="mesos" --credential="/tmp/Endpoint_SlaveEndpointTest_
>> UnauthorizedRequest_0_iME4dN/credential" --default_role="*"
>> --disk_watch_interval="1mins" --docker="docker"
>> --docker_kill_orphans="true" --docker_registry="https://
>> registry-1.docker.io" --docker_remove_delay="6hrs"
>> --docker_socket="/var/run/docker.sock" --docker_stop_timeout="0ns"
>> --docker_store_dir="/tmp/mesos/store/docker" --docker_volume_checkpoint_
>> dir="/var/run/mesos/isolators/docker/volume" --enforce_container_disk_quota="false"
>> --executor_registration_timeout="1mins" --executor_shutdown_grace_period="5secs"
>> --fetcher_cache_dir="/tmp/Endpoint_SlaveEndpointTest_
>> UnauthorizedRequest_0_iME4dN/fetch" --fetcher_cache_size="2GB"
>> --frameworks_home="" --gc_delay="1weeks" --gc_disk_headroom="0.1"
>> --hadoop_home="" --help="false" --hostname_lookup="true"
>> --http_authenticators="basic" --http_command_executor="false"
>> --http_credentials="/tmp/Endpoint_SlaveEndpointTest_
>> UnauthorizedRequest_0_iME4dN/http_credentials"
>> --http_heartbeat_interval="30secs" --image_provisioner_backend="copy"
>> --initialize_driver_logging="true" --isolation="posix/cpu,posix/mem"
>> --launcher="posix" --launcher_dir="/mesos/build/src" --logbufsecs="0"
>> --logging_level="INFO" --max_completed_executors_per_framework="150"
>> --oversubscribed_resources_interval="15secs" --perf_duration="10secs"
>> --perf_interval="1mins" --qos_correction_interval_min="0ns"
>> --quiet="false" --recover="reconnect" --recovery_timeout="15mins"
>> --registration_backoff_factor="10ms" --resources="cpus:2;gpus:0;
>> mem:1024;disk:1024;ports:[31000-32000]" --revocable_cpu_low_priority="true"
>> --runtime_dir="/tmp/Endpoint_SlaveEndpointTest_UnauthorizedRequest_0_iME4dN"
>> --sandbox_directory="/mnt/mesos/sandbox" --strict="true"
>> --switch_user="true" --systemd_enable_support="true"
>> --systemd_runtime_directory="/run/systemd/system" --version="false"
>> --work_dir="/tmp/Endpoint_SlaveEndpointTest_UnauthorizedRequest_0_3AjlsW"
>> I0127 19:20:05.162123 26241 credentials.hpp:86] Loading credential for
>> authentication from '/tmp/Endpoint_SlaveEndpointTest_
>> UnauthorizedRequest_0_iME4dN/credential'
>> I0127 19:20:05.162222 26241 slave.cpp:352] Agent using credential for:
>> test-principal
>> I0127 19:20:05.162238 26241 credentials.hpp:37] Loading credentials for
>> authentication from '/tmp/Endpoint_SlaveEndpointTest_
>> UnauthorizedRequest_0_iME4dN/http_credentials'
>> I0127 19:20:05.162358 26241 http.cpp:922] Using default 'basic' HTTP
>> authenticator for realm 'mesos-agent-readonly'
>> I0127 19:20:05.162405 26241 http.cpp:922] Using default 'basic' HTTP
>> authenticator for realm 'mesos-agent-readwrite'
>> I0127 19:20:05.162804 26241 slave.cpp:539] Agent resources: cpus(*):2;
>> mem(*):1024; disk(*):1024; ports(*):[31000-32000]
>> I0127 19:20:05.162852 26241 slave.cpp:547] Agent attributes: [  ]
>> I0127 19:20:05.162863 26241 slave.cpp:552] Agent hostname: 2e493164cbc4
>> I0127 19:20:05.163383 26251 state.cpp:60] Recovering state from
>> '/tmp/Endpoint_SlaveEndpointTest_UnauthorizedRequest_0_3AjlsW/meta'
>> I0127 19:20:05.163581 26245 status_update_manager.cpp:177] Pausing
>> sending status updates
>> I0127 19:20:05.163611 26245 status_update_manager.cpp:203] Recovering
>> status update manager
>> I0127 19:20:05.163682 26245 containerizer.cpp:599] Recovering
>> containerizer
>> I0127 19:20:05.164335 26241 provisioner.cpp:251] Provisioner recovery
>> complete
>> I0127 19:20:05.164707 26241 slave.cpp:5422] Finished recovery
>> I0127 19:20:05.165154 26241 slave.cpp:5596] Querying resource estimator
>> for oversubscribable resources
>> I0127 19:20:05.165249 26247 slave.cpp:5610] Received oversubscribable
>> resources {} from the resource estimator
>> I0127 19:20:05.166203 26248 process.cpp:3697] Handling HTTP event for
>> process 'slave(682)' with path: '/slave(682)/monitor/statistics'
>> I0127 19:20:05.166685 26252 http.cpp:874] Authorizing principal
>> 'test-principal' to GET the '/monitor/statistics' endpoint
>> I0127 19:20:05.167692 26248 slave.cpp:801] Agent terminating
>> [       OK ] Endpoint/SlaveEndpointTest.UnauthorizedRequest/0 (12 ms)
>> [ RUN      ] Endpoint/SlaveEndpointTest.UnauthorizedRequest/1
>> I0127 19:20:05.173415 26238 containerizer.cpp:220] Using isolation:
>> posix/cpu,posix/mem,filesystem/posix,network/cni
>> W0127 19:20:05.173770 26238 backend.cpp:76] Failed to create 'aufs'
>> backend: AufsBackend requires root privileges
>> W0127 19:20:05.173817 26238 backend.cpp:76] Failed to create 'bind'
>> backend: BindBackend requires root privileges
>> I0127 19:20:05.175066 26253 slave.cpp:209] Mesos agent started on (683)@
>> 172.17.0.3:59334
>> I0127 19:20:05.175287 26253 slave.cpp:210] Flags at startup: --acls=""
>> --appc_simple_discovery_uri_prefix="http://"
>> --appc_store_dir="/tmp/mesos/store/appc" --authenticate_http_readonly="true"
>> --authenticate_http_readwrite="true" --authenticatee="crammd5"
>> --authentication_backoff_factor="1secs" --authorizer="local"
>> --cgroups_cpu_enable_pids_and_tids_count="false"
>> --cgroups_enable_cfs="false" --cgroups_hierarchy="/sys/fs/cgroup"
>> --cgroups_limit_swap="false" --cgroups_root="mesos" --container_disk_watch_interval="15secs"
>> --containerizers="mesos" --credential="/tmp/Endpoint_SlaveEndpointTest_
>> UnauthorizedRequest_1_YoAHpc/credential" --default_role="*"
>> --disk_watch_interval="1mins" --docker="docker"
>> --docker_kill_orphans="true" --docker_registry="https://
>> registry-1.docker.io" --docker_remove_delay="6hrs"
>> --docker_socket="/var/run/docker.sock" --docker_stop_timeout="0ns"
>> --docker_store_dir="/tmp/mesos/store/docker" --docker_volume_checkpoint_
>> dir="/var/run/mesos/isolators/docker/volume" --enforce_container_disk_quota="false"
>> --executor_registration_timeout="1mins" --executor_shutdown_grace_period="5secs"
>> --fetcher_cache_dir="/tmp/Endpoint_SlaveEndpointTest_
>> UnauthorizedRequest_1_YoAHpc/fetch" --fetcher_cache_size="2GB"
>> --frameworks_home="" --gc_delay="1weeks" --gc_disk_headroom="0.1"
>> --hadoop_home="" --help="false" --hostname_lookup="true"
>> --http_authenticators="basic" --http_command_executor="false"
>> --http_credentials="/tmp/Endpoint_SlaveEndpointTest_
>> UnauthorizedRequest_1_YoAHpc/http_credentials"
>> --http_heartbeat_interval="30secs" --image_provisioner_backend="copy"
>> --initialize_driver_logging="true" --isolation="posix/cpu,posix/mem"
>> --launcher="posix" --launcher_dir="/mesos/build/src" --logbufsecs="0"
>> --logging_level="INFO" --max_completed_executors_per_framework="150"
>> --oversubscribed_resources_interval="15secs" --perf_duration="10secs"
>> --perf_interval="1mins" --qos_correction_interval_min="0ns"
>> --quiet="false" --recover="reconnect" --recovery_timeout="15mins"
>> --registration_backoff_factor="10ms" --resources="cpus:2;gpus:0;
>> mem:1024;disk:1024;ports:[31000-32000]" --revocable_cpu_low_priority="true"
>> --runtime_dir="/tmp/Endpoint_SlaveEndpointTest_UnauthorizedRequest_1_YoAHpc"
>> --sandbox_directory="/mnt/mesos/sandbox" --strict="true"
>> --switch_user="true" --systemd_enable_support="true"
>> --systemd_runtime_directory="/run/systemd/system" --version="false"
>> --work_dir="/tmp/Endpoint_SlaveEndpointTest_UnauthorizedRequest_1_PkAXBl"
>> I0127 19:20:05.175725 26253 credentials.hpp:86] Loading credential for
>> authentication from '/tmp/Endpoint_SlaveEndpointTest_
>> UnauthorizedRequest_1_YoAHpc/credential'
>> I0127 19:20:05.175917 26253 slave.cpp:352] Agent using credential for:
>> test-principal
>> I0127 19:20:05.175932 26253 credentials.hpp:37] Loading credentials for
>> authentication from '/tmp/Endpoint_SlaveEndpointTest_
>> UnauthorizedRequest_1_YoAHpc/http_credentials'
>> I0127 19:20:05.176077 26253 http.cpp:922] Using default 'basic' HTTP
>> authenticator for realm 'mesos-agent-readonly'
>> I0127 19:20:05.176143 26253 http.cpp:922] Using default 'basic' HTTP
>> authenticator for realm 'mesos-agent-readwrite'
>> I0127 19:20:05.176590 26253 slave.cpp:539] Agent resources: cpus(*):2;
>> mem(*):1024; disk(*):1024; ports(*):[31000-32000]
>> I0127 19:20:05.176627 26253 slave.cpp:547] Agent attributes: [  ]
>> I0127 19:20:05.176638 26253 slave.cpp:552] Agent hostname: 2e493164cbc4
>> I0127 19:20:05.176758 26247 status_update_manager.cpp:177] Pausing
>> sending status updates
>> I0127 19:20:05.177186 26253 state.cpp:60] Recovering state from
>> '/tmp/Endpoint_SlaveEndpointTest_UnauthorizedRequest_1_PkAXBl/meta'
>> I0127 19:20:05.177388 26252 status_update_manager.cpp:203] Recovering
>> status update manager
>> I0127 19:20:05.177501 26240 containerizer.cpp:599] Recovering
>> containerizer
>> I0127 19:20:05.178134 26251 provisioner.cpp:251] Provisioner recovery
>> complete
>> I0127 19:20:05.178373 26242 slave.cpp:5422] Finished recovery
>> I0127 19:20:05.178902 26242 slave.cpp:5596] Querying resource estimator
>> for oversubscribable resources
>> I0127 19:20:05.179108 26254 slave.cpp:5610] Received oversubscribable
>> resources {} from the resource estimator
>> I0127 19:20:05.179890 26247 process.cpp:3697] Handling HTTP event for
>> process 'slave(683)' with path: '/slave(683)/monitor/statistics.json'
>> I0127 19:20:05.180335 26247 http.cpp:874] Authorizing principal
>> 'test-principal' to GET the '/monitor/statistics.json' endpoint
>> I0127 19:20:05.181316 26238 slave.cpp:801] Agent terminating
>> [       OK ] Endpoint/SlaveEndpointTest.UnauthorizedRequest/1 (13 ms)
>> [ RUN      ] Endpoint/SlaveEndpointTest.UnauthorizedRequest/2
>> I0127 19:20:05.187044 26238 containerizer.cpp:220] Using isolation:
>> posix/cpu,posix/mem,filesystem/posix,network/cni
>> W0127 19:20:05.187412 26238 backend.cpp:76] Failed to create 'aufs'
>> backend: AufsBackend requires root privileges
>> W0127 19:20:05.187458 26238 backend.cpp:76] Failed to create 'bind'
>> backend: BindBackend requires root privileges
>> I0127 19:20:05.188892 26243 slave.cpp:209] Mesos agent started on (684)@
>> 172.17.0.3:59334
>> I0127 19:20:05.189136 26243 slave.cpp:210] Flags at startup: --acls=""
>> --appc_simple_discovery_uri_prefix="http://"
>> --appc_store_dir="/tmp/mesos/store/appc" --authenticate_http_readonly="true"
>> --authenticate_http_readwrite="true" --authenticatee="crammd5"
>> --authentication_backoff_factor="1secs" --authorizer="local"
>> --cgroups_cpu_enable_pids_and_tids_count="false"
>> --cgroups_enable_cfs="false" --cgroups_hierarchy="/sys/fs/cgroup"
>> --cgroups_limit_swap="false" --cgroups_root="mesos" --container_disk_watch_interval="15secs"
>> --containerizers="mesos" --credential="/tmp/Endpoint_SlaveEndpointTest_
>> UnauthorizedRequest_2_xBJbKB/credential" --default_role="*"
>> --disk_watch_interval="1mins" --docker="docker"
>> --docker_kill_orphans="true" --docker_registry="https://
>> registry-1.docker.io" --docker_remove_delay="6hrs"
>> --docker_socket="/var/run/docker.sock" --docker_stop_timeout="0ns"
>> --docker_store_dir="/tmp/mesos/store/docker" --docker_volume_checkpoint_
>> dir="/var/run/mesos/isolators/docker/volume" --enforce_container_disk_quota="false"
>> --executor_registration_timeout="1mins" --executor_shutdown_grace_period="5secs"
>> --fetcher_cache_dir="/tmp/Endpoint_SlaveEndpointTest_
>> UnauthorizedRequest_2_xBJbKB/fetch" --fetcher_cache_size="2GB"
>> --frameworks_home="" --gc_delay="1weeks" --gc_disk_headroom="0.1"
>> --hadoop_home="" --help="false" --hostname_lookup="true"
>> --http_authenticators="basic" --http_command_executor="false"
>> --http_credentials="/tmp/Endpoint_SlaveEndpointTest_
>> UnauthorizedRequest_2_xBJbKB/http_credentials"
>> --http_heartbeat_interval="30secs" --image_provisioner_backend="copy"
>> --initialize_driver_logging="true" --isolation="posix/cpu,posix/mem"
>> --launcher="posix" --launcher_dir="/mesos/build/src" --logbufsecs="0"
>> --logging_level="INFO" --max_completed_executors_per_framework="150"
>> --oversubscribed_resources_interval="15secs" --perf_duration="10secs"
>> --perf_interval="1mins" --qos_correction_interval_min="0ns"
>> --quiet="false" --recover="reconnect" --recovery_timeout="15mins"
>> --registration_backoff_factor="10ms" --resources="cpus:2;gpus:0;
>> mem:1024;disk:1024;ports:[31000-32000]" --revocable_cpu_low_priority="true"
>> --runtime_dir="/tmp/Endpoint_SlaveEndpointTest_UnauthorizedRequest_2_xBJbKB"
>> --sandbox_directory="/mnt/mesos/sandbox" --strict="true"
>> --switch_user="true" --systemd_enable_support="true"
>> --systemd_runtime_directory="/run/systemd/system" --version="false"
>> --work_dir="/tmp/Endpoint_SlaveEndpointTest_UnauthorizedRequest_2_8GSeUK"
>> I0127 19:20:05.189512 26243 credentials.hpp:86] Loading credential for
>> authentication from '/tmp/Endpoint_SlaveEndpointTest_
>> UnauthorizedRequest_2_xBJbKB/credential'
>> I0127 19:20:05.189713 26243 slave.cpp:352] Agent using credential for:
>> test-principal
>> I0127 19:20:05.189728 26243 credentials.hpp:37] Loading credentials for
>> authentication from '/tmp/Endpoint_SlaveEndpointTest_
>> UnauthorizedRequest_2_xBJbKB/http_credentials'
>> I0127 19:20:05.189855 26243 http.cpp:922] Using default 'basic' HTTP
>> authenticator for realm 'mesos-agent-readonly'
>> I0127 19:20:05.189921 26243 http.cpp:922] Using default 'basic' HTTP
>> authenticator for realm 'mesos-agent-readwrite'
>> I0127 19:20:05.190341 26243 slave.cpp:539] Agent resources: cpus(*):2;
>> mem(*):1024; disk(*):1024; ports(*):[31000-32000]
>> I0127 19:20:05.190377 26243 slave.cpp:547] Agent attributes: [  ]
>> I0127 19:20:05.190389 26243 slave.cpp:552] Agent hostname: 2e493164cbc4
>> I0127 19:20:05.190748 26243 status_update_manager.cpp:177] Pausing
>> sending status updates
>> I0127 19:20:05.190981 26243 state.cpp:60] Recovering state from
>> '/tmp/Endpoint_SlaveEndpointTest_UnauthorizedRequest_2_8GSeUK/meta'
>> I0127 19:20:05.191126 26243 status_update_manager.cpp:203] Recovering
>> status update manager
>> I0127 19:20:05.191190 26243 containerizer.cpp:599] Recovering
>> containerizer
>> I0127 19:20:05.191725 26241 provisioner.cpp:251] Provisioner recovery
>> complete
>> I0127 19:20:05.191977 26239 slave.cpp:5422] Finished recovery
>> I0127 19:20:05.192395 26239 slave.cpp:5596] Querying resource estimator
>> for oversubscribable resources
>> I0127 19:20:05.192576 26239 slave.cpp:5610] Received oversubscribable
>> resources {} from the resource estimator
>> I0127 19:20:05.193348 26247 process.cpp:3697] Handling HTTP event for
>> process 'slave(684)' with path: '/slave(684)/containers'
>> I0127 19:20:05.193680 26247 http.cpp:874] Authorizing principal
>> 'test-principal' to GET the '/containers' endpoint
>> I0127 19:20:05.194741 26238 slave.cpp:801] Agent terminating
>> [       OK ] Endpoint/SlaveEndpointTest.UnauthorizedRequest/2 (20 ms)
>> [ RUN      ] Endpoint/SlaveEndpointTest.NoAuthorizer/0
>> I0127 19:20:05.206912 26238 containerizer.cpp:220] Using isolation:
>> posix/cpu,posix/mem,filesystem/posix,network/cni
>> W0127 19:20:05.207170 26238 backend.cpp:76] Failed to create 'aufs'
>> backend: AufsBackend requires root privileges
>> W0127 19:20:05.207365 26238 backend.cpp:76] Failed to create 'bind'
>> backend: BindBackend requires root privileges
>> I0127 19:20:05.208168 26238 cluster.cpp:446] Creating default 'local'
>> authorizer
>> I0127 19:20:05.208892 26244 slave.cpp:209] Mesos agent started on (685)@
>> 172.17.0.3:59334
>> I0127 19:20:05.208909 26244 slave.cpp:210] Flags at startup: --acls=""
>> --appc_simple_discovery_uri_prefix="http://"
>> --appc_store_dir="/tmp/mesos/store/appc" --authenticate_http_readonly="true"
>> --authenticate_http_readwrite="true" --authenticatee="crammd5"
>> --authentication_backoff_factor="1secs" --authorizer="local"
>> --cgroups_cpu_enable_pids_and_tids_count="false"
>> --cgroups_enable_cfs="false" --cgroups_hierarchy="/sys/fs/cgroup"
>> --cgroups_limit_swap="false" --cgroups_root="mesos" --container_disk_watch_interval="15secs"
>> --containerizers="mesos" --credential="/tmp/Endpoint_SlaveEndpointTest_
>> NoAuthorizer_0_88MJg1/credential" --default_role="*"
>> --disk_watch_interval="1mins" --docker="docker"
>> --docker_kill_orphans="true" --docker_registry="https://
>> registry-1.docker.io" --docker_remove_delay="6hrs"
>> --docker_socket="/var/run/docker.sock" --docker_stop_timeout="0ns"
>> --docker_store_dir="/tmp/mesos/store/docker" --docker_volume_checkpoint_
>> dir="/var/run/mesos/isolators/docker/volume" --enforce_container_disk_quota="false"
>> --executor_registration_timeout="1mins" --executor_shutdown_grace_period="5secs"
>> --fetcher_cache_dir="/tmp/Endpoint_SlaveEndpointTest_NoAuthorizer_0_88MJg1/fetch"
>> --fetcher_cache_size="2GB" --frameworks_home="" --gc_delay="1weeks"
>> --gc_disk_headroom="0.1" --hadoop_home="" --help="false"
>> --hostname_lookup="true" --http_authenticators="basic"
>> --http_command_executor="false" --http_credentials="/tmp/
>> Endpoint_SlaveEndpointTest_NoAuthorizer_0_88MJg1/http_credentials"
>> --http_heartbeat_interval="30secs" --image_provisioner_backend="copy"
>> --initialize_driver_logging="true" --isolation="posix/cpu,posix/mem"
>> --launcher="posix" --launcher_dir="/mesos/build/src" --logbufsecs="0"
>> --logging_level="INFO" --max_completed_executors_per_framework="150"
>> --oversubscribed_resources_interval="15secs" --perf_duration="10secs"
>> --perf_interval="1mins" --qos_correction_interval_min="0ns"
>> --quiet="false" --recover="reconnect" --recovery_timeout="15mins"
>> --registration_backoff_factor="10ms" --resources="cpus:2;gpus:0;
>> mem:1024;disk:1024;ports:[31000-32000]" --revocable_cpu_low_priority="true"
>> --runtime_dir="/tmp/Endpoint_SlaveEndpointTest_NoAuthorizer_0_88MJg1"
>> --sandbox_directory="/mnt/mesos/sandbox" --strict="true"
>> --switch_user="true" --systemd_enable_support="true"
>> --systemd_runtime_directory="/run/systemd/system" --version="false"
>> --work_dir="/tmp/Endpoint_SlaveEndpointTest_NoAuthorizer_0_KCRvna"
>> I0127 19:20:05.209398 26244 credentials.hpp:86] Loading credential for
>> authentication from '/tmp/Endpoint_SlaveEndpointTest_
>> NoAuthorizer_0_88MJg1/credential'
>> I0127 19:20:05.209502 26244 slave.cpp:352] Agent using credential for:
>> test-principal
>> I0127 19:20:05.209519 26244 credentials.hpp:37] Loading credentials for
>> authentication from '/tmp/Endpoint_SlaveEndpointTest_
>> NoAuthorizer_0_88MJg1/http_credentials'
>> I0127 19:20:05.209643 26244 http.cpp:922] Using default 'basic' HTTP
>> authenticator for realm 'mesos-agent-readonly'
>> I0127 19:20:05.209697 26244 http.cpp:922] Using default 'basic' HTTP
>> authenticator for realm 'mesos-agent-readwrite'
>> I0127 19:20:05.210113 26244 slave.cpp:539] Agent resources: cpus(*):2;
>> mem(*):1024; disk(*):1024; ports(*):[31000-32000]
>> I0127 19:20:05.210146 26244 slave.cpp:547] Agent attributes: [  ]
>> I0127 19:20:05.210151 26244 slave.cpp:552] Agent hostname: 2e493164cbc4
>> I0127 19:20:05.210206 26242 status_update_manager.cpp:177] Pausing
>> sending status updates
>> I0127 19:20:05.210561 26241 state.cpp:60] Recovering state from
>> '/tmp/Endpoint_SlaveEndpointTest_NoAuthorizer_0_KCRvna/meta'
>> I0127 19:20:05.210846 26248 status_update_manager.cpp:203] Recovering
>> status update manager
>> I0127 19:20:05.210922 26241 containerizer.cpp:599] Recovering
>> containerizer
>> I0127 19:20:05.211534 26241 provisioner.cpp:251] Provisioner recovery
>> complete
>> I0127 19:20:05.211724 26249 slave.cpp:5422] Finished recovery
>> I0127 19:20:05.212139 26249 slave.cpp:5596] Querying resource estimator
>> for oversubscribable resources
>> I0127 19:20:05.212271 26253 slave.cpp:5610] Received oversubscribable
>> resources {} from the resource estimator
>> I0127 19:20:05.213207 26251 process.cpp:3697] Handling HTTP event for
>> process 'slave(685)' with path: '/slave(685)/monitor/statistics'
>> I0127 19:20:05.213690 26242 http.cpp:874] Authorizing principal
>> 'test-principal' to GET the '/monitor/statistics' endpoint
>> I0127 19:20:05.215049 26243 slave.cpp:801] Agent terminating
>> [       OK ] Endpoint/SlaveEndpointTest.NoAuthorizer/0 (13 ms)
>> [ RUN      ] Endpoint/SlaveEndpointTest.NoAuthorizer/1
>> I0127 19:20:05.220180 26238 containerizer.cpp:220] Using isolation:
>> posix/cpu,posix/mem,filesystem/posix,network/cni
>> W0127 19:20:05.220535 26238 backend.cpp:76] Failed to create 'aufs'
>> backend: AufsBackend requires root privileges
>> W0127 19:20:05.220578 26238 backend.cpp:76] Failed to create 'bind'
>> backend: BindBackend requires root privileges
>> I0127 19:20:05.221377 26238 cluster.cpp:446] Creating default 'local'
>> authorizer
>> I0127 19:20:05.222077 26243 slave.cpp:209] Mesos agent started on (686)@
>> 172.17.0.3:59334
>> I0127 19:20:05.222108 26243 slave.cpp:210] Flags at startup: --acls=""
>> --appc_simple_discovery_uri_prefix="http://"
>> --appc_store_dir="/tmp/mesos/store/appc" --authenticate_http_readonly="true"
>> --authenticate_http_readwrite="true" --authenticatee="crammd5"
>> --authentication_backoff_factor="1secs" --authorizer="local"
>> --cgroups_cpu_enable_pids_and_tids_count="false"
>> --cgroups_enable_cfs="false" --cgroups_hierarchy="/sys/fs/cgroup"
>> --cgroups_limit_swap="false" --cgroups_root="mesos" --container_disk_watch_interval="15secs"
>> --containerizers="mesos" --credential="/tmp/Endpoint_SlaveEndpointTest_
>> NoAuthorizer_1_yVjVWq/credential" --default_role="*"
>> --disk_watch_interval="1mins" --docker="docker"
>> --docker_kill_orphans="true" --docker_registry="https://
>> registry-1.docker.io" --docker_remove_delay="6hrs"
>> --docker_socket="/var/run/docker.sock" --docker_stop_timeout="0ns"
>> --docker_store_dir="/tmp/mesos/store/docker" --docker_volume_checkpoint_
>> dir="/var/run/mesos/isolators/docker/volume" --enforce_container_disk_quota="false"
>> --executor_registration_timeout="1mins" --executor_shutdown_grace_period="5secs"
>> --fetcher_cache_dir="/tmp/Endpoint_SlaveEndpointTest_NoAuthorizer_1_yVjVWq/fetch"
>> --fetcher_cache_size="2GB" --frameworks_home="" --gc_delay="1weeks"
>> --gc_disk_headroom="0.1" --hadoop_home="" --help="false"
>> --hostname_lookup="true" --http_authenticators="basic"
>> --http_command_executor="false" --http_credentials="/tmp/
>> Endpoint_SlaveEndpointTest_NoAuthorizer_1_yVjVWq/http_credentials"
>> --http_heartbeat_interval="30secs" --image_provisioner_backend="copy"
>> --initialize_driver_logging="true" --isolation="posix/cpu,posix/mem"
>> --launcher="posix" --launcher_dir="/mesos/build/src" --logbufsecs="0"
>> --logging_level="INFO" --max_completed_executors_per_framework="150"
>> --oversubscribed_resources_interval="15secs" --perf_duration="10secs"
>> --perf_interval="1mins" --qos_correction_interval_min="0ns"
>> --quiet="false" --recover="reconnect" --recovery_timeout="15mins"
>> --registration_backoff_factor="10ms" --resources="cpus:2;gpus:0;
>> mem:1024;disk:1024;ports:[31000-32000]" --revocable_cpu_low_priority="true"
>> --runtime_dir="/tmp/Endpoint_SlaveEndpointTest_NoAuthorizer_1_yVjVWq"
>> --sandbox_directory="/mnt/mesos/sandbox" --strict="true"
>> --switch_user="true" --systemd_enable_support="true"
>> --systemd_runtime_directory="/run/systemd/system" --version="false"
>> --work_dir="/tmp/Endpoint_SlaveEndpointTest_NoAuthorizer_1_fO5x1z"
>> I0127 19:20:05.222529 26243 credentials.hpp:86] Loading credential for
>> authentication from '/tmp/Endpoint_SlaveEndpointTest_
>> NoAuthorizer_1_yVjVWq/credential'
>> I0127 19:20:05.222681 26243 slave.cpp:352] Agent using credential for:
>> test-principal
>> I0127 19:20:05.222693 26243 credentials.hpp:37] Loading credentials for
>> authentication from '/tmp/Endpoint_SlaveEndpointTest_
>> NoAuthorizer_1_yVjVWq/http_credentials'
>> I0127 19:20:05.222823 26243 http.cpp:922] Using default 'basic' HTTP
>> authenticator for realm 'mesos-agent-readonly'
>> I0127 19:20:05.222898 26243 http.cpp:922] Using default 'basic' HTTP
>> authenticator for realm 'mesos-agent-readwrite'
>> I0127 19:20:05.223286 26243 slave.cpp:539] Agent resources: cpus(*):2;
>> mem(*):1024; disk(*):1024; ports(*):[31000-32000]
>> I0127 19:20:05.223326 26243 slave.cpp:547] Agent attributes: [  ]
>> I0127 19:20:05.223354 26243 slave.cpp:552] Agent hostname: 2e493164cbc4
>> I0127 19:20:05.223454 26253 status_update_manager.cpp:177] Pausing
>> sending status updates
>> I0127 19:20:05.223789 26243 state.cpp:60] Recovering state from
>> '/tmp/Endpoint_SlaveEndpointTest_NoAuthorizer_1_fO5x1z/meta'
>> I0127 19:20:05.223938 26243 status_update_manager.cpp:203] Recovering
>> status update manager
>> I0127 19:20:05.224155 26239 containerizer.cpp:599] Recovering
>> containerizer
>> I0127 19:20:05.224788 26246 provisioner.cpp:251] Provisioner recovery
>> complete
>> I0127 19:20:05.224907 26246 slave.cpp:5422] Finished recovery
>> I0127 19:20:05.225402 26246 slave.cpp:5596] Querying resource estimator
>> for oversubscribable resources
>> I0127 19:20:05.225484 26239 slave.cpp:5610] Received oversubscribable
>> resources {} from the resource estimator
>> I0127 19:20:05.226248 26245 process.cpp:3697] Handling HTTP event for
>> process 'slave(686)' with path: '/slave(686)/monitor/statistics.json'
>> I0127 19:20:05.226696 26246 http.cpp:874] Authorizing principal
>> 'test-principal' to GET the '/monitor/statistics.json' endpoint
>> I0127 19:20:05.228323 26242 slave.cpp:801] Agent terminating
>> [       OK ] Endpoint/SlaveEndpointTest.NoAuthorizer/1 (14 ms)
>> [ RUN      ] Endpoint/SlaveEndpointTest.NoAuthorizer/2
>> I0127 19:20:05.234925 26238 containerizer.cpp:220] Using isolation:
>> posix/cpu,posix/mem,filesystem/posix,network/cni
>> W0127 19:20:05.235294 26238 backend.cpp:76] Failed to create 'aufs'
>> backend: AufsBackend requires root privileges
>> W0127 19:20:05.235343 26238 backend.cpp:76] Failed to create 'bind'
>> backend: BindBackend requires root privileges
>> I0127 19:20:05.236002 26238 cluster.cpp:446] Creating default 'local'
>> authorizer
>> I0127 19:20:05.236630 26250 slave.cpp:209] Mesos agent started on (687)@
>> 172.17.0.3:59334
>> I0127 19:20:05.236647 26250 slave.cpp:210] Flags at startup: --acls=""
>> --appc_simple_discovery_uri_prefix="http://"
>> --appc_store_dir="/tmp/mesos/store/appc" --authenticate_http_readonly="true"
>> --authenticate_http_readwrite="true" --authenticatee="crammd5"
>> --authentication_backoff_factor="1secs" --authorizer="local"
>> --cgroups_cpu_enable_pids_and_tids_count="false"
>> --cgroups_enable_cfs="false" --cgroups_hierarchy="/sys/fs/cgroup"
>> --cgroups_limit_swap="false" --cgroups_root="mesos" --container_disk_watch_interval="15secs"
>> --containerizers="mesos" --credential="/tmp/Endpoint_SlaveEndpointTest_
>> NoAuthorizer_2_Wi9bMQ/credential" --default_role="*"
>> --disk_watch_interval="1mins" --docker="docker"
>> --docker_kill_orphans="true" --docker_registry="https://
>> registry-1.docker.io" --docker_remove_delay="6hrs"
>> --docker_socket="/var/run/docker.sock" --docker_stop_timeout="0ns"
>> --docker_store_dir="/tmp/mesos/store/docker" --docker_volume_checkpoint_
>> dir="/var/run/mesos/isolators/docker/volume" --enforce_container_disk_quota="false"
>> --executor_registration_timeout="1mins" --executor_shutdown_grace_period="5secs"
>> --fetcher_cache_dir="/tmp/Endpoint_SlaveEndpointTest_NoAuthorizer_2_Wi9bMQ/fetch"
>> --fetcher_cache_size="2GB" --frameworks_home="" --gc_delay="1weeks"
>> --gc_disk_headroom="0.1" --hadoop_home="" --help="false"
>> --hostname_lookup="true" --http_authenticators="basic"
>> --http_command_executor="false" --http_credentials="/tmp/
>> Endpoint_SlaveEndpointTest_NoAuthorizer_2_Wi9bMQ/http_credentials"
>> --http_heartbeat_interval="30secs" --image_provisioner_backend="copy"
>> --initialize_driver_logging="true" --isolation="posix/cpu,posix/mem"
>> --launcher="posix" --launcher_dir="/mesos/build/src" --logbufsecs="0"
>> --logging_level="INFO" --max_completed_executors_per_framework="150"
>> --oversubscribed_resources_interval="15secs" --perf_duration="10secs"
>> --perf_interval="1mins" --qos_correction_interval_min="0ns"
>> --quiet="false" --recover="reconnect" --recovery_timeout="15mins"
>> --registration_backoff_factor="10ms" --resources="cpus:2;gpus:0;
>> mem:1024;disk:1024;ports:[31000-32000]" --revocable_cpu_low_priority="true"
>> --runtime_dir="/tmp/Endpoint_SlaveEndpointTest_NoAuthorizer_2_Wi9bMQ"
>> --sandbox_directory="/mnt/mesos/sandbox" --strict="true"
>> --switch_user="true" --systemd_enable_support="true"
>> --systemd_runtime_directory="/run/systemd/system" --version="false"
>> --work_dir="/tmp/Endpoint_SlaveEndpointTest_NoAuthorizer_2_GocvOZ"
>> I0127 19:20:05.237076 26250 credentials.hpp:86] Loading credential for
>> authentication from '/tmp/Endpoint_SlaveEndpointTest_
>> NoAuthorizer_2_Wi9bMQ/credential'
>> I0127 19:20:05.237157 26250 slave.cpp:352] Agent using credential for:
>> test-principal
>> I0127 19:20:05.237169 26250 credentials.hpp:37] Loading credentials for
>> authentication from '/tmp/Endpoint_SlaveEndpointTest_
>> NoAuthorizer_2_Wi9bMQ/http_credentials'
>> I0127 19:20:05.237259 26250 http.cpp:922] Using default 'basic' HTTP
>> authenticator for realm 'mesos-agent-readonly'
>> I0127 19:20:05.237399 26250 http.cpp:922] Using default 'basic' HTTP
>> authenticator for realm 'mesos-agent-readwrite'
>> I0127 19:20:05.237825 26250 slave.cpp:539] Agent resources: cpus(*):2;
>> mem(*):1024; disk(*):1024; ports(*):[31000-32000]
>> I0127 19:20:05.237874 26250 slave.cpp:547] Agent attributes: [  ]
>> I0127 19:20:05.237884 26250 slave.cpp:552] Agent hostname: 2e493164cbc4
>> I0127 19:20:05.237964 26254 status_update_manager.cpp:177] Pausing
>> sending status updates
>> I0127 19:20:05.238512 26249 state.cpp:60] Recovering state from
>> '/tmp/Endpoint_SlaveEndpointTest_NoAuthorizer_2_GocvOZ/meta'
>> I0127 19:20:05.238693 26247 status_update_manager.cpp:203] Recovering
>> status update manager
>> I0127 19:20:05.238811 26253 containerizer.cpp:599] Recovering
>> containerizer
>> I0127 19:20:05.239555 26246 provisioner.cpp:251] Provisioner recovery
>> complete
>> I0127 19:20:05.239789 26254 slave.cpp:5422] Finished recovery
>> I0127 19:20:05.240228 26254 slave.cpp:5596] Querying resource estimator
>> for oversubscribable resources
>> I0127 19:20:05.240330 26250 slave.cpp:5610] Received oversubscribable
>> resources {} from the resource estimator
>> I0127 19:20:05.241132 26250 process.cpp:3697] Handling HTTP event for
>> process 'slave(687)' with path: '/slave(687)/containers'
>> I0127 19:20:05.241499 26250 http.cpp:874] Authorizing principal
>> 'test-principal' to GET the '/containers' endpoint
>> I0127 19:20:05.242611 26249 slave.cpp:801] Agent terminating
>> [       OK ] Endpoint/SlaveEndpointTest.NoAuthorizer/2 (13 ms)
>> [----------] 9 tests from Endpoint/SlaveEndpointTest (140 ms total)
>>
>> [----------] Global test environment tear-down
>> [==========] 1414 tests from 158 test cases ran. (192968 ms total)
>> [  PASSED  ] 1413 tests.
>> [  FAILED  ] 1 test, listed below:
>> [  FAILED  ] IOSwitchboardTest.RecoverThenKillSwitchboardCont
>> ainerDestroyed
>>
>>  1 FAILED TEST
>>   YOU HAVE 14 DISABLED TESTS
>>
>> make[3]: Leaving directory `/mesos/build'
>> make[3]: *** [CMakeFiles/check] Error 1
>> make[2]: *** [CMakeFiles/check.dir/all] Error 2
>> make[2]: Leaving directory `/mesos/build'
>> make[1]: *** [CMakeFiles/check.dir/rule] Error 2
>> make[1]: Leaving directory `/mesos/build'
>> make: *** [check] Error 2
>> + docker rmi mesos-1485541771-7978
>> Untagged: mesos-1485541771-7978:latest
>> Deleted: sha256:2460b7c646525022964fde56a42080
>> 255daf24b409834914a791efcc7bae9253
>> Deleted: sha256:763d8bf30ad29afa2f9d9b327322df
>> d6bb172458e8466c9f4e4ea491145a6217
>> Deleted: sha256:72ffd788a74e4327ad7fd805800898
>> 65b77cad89bd5a161e8b3a7cc4d4fd0796
>> Deleted: sha256:896390aa83f4c81bc9ebc34757de44
>> f9bdf1b7447f7402c4d246a1dfee104107
>> Deleted: sha256:aa779c987e21f6e65dde10daf38ff7
>> 5ac7d3fe7b9f8d2eed5282dc14b5df5789
>> Deleted: sha256:88b4b8d596620878453d0009111929
>> aa47f9a5214bda95f3bcab7244a5022f41
>> Deleted: sha256:dad00b4acc1c19d824cad851db0f25
>> 3f670252e6b0bbd0de18f1a8388139b883
>> Deleted: sha256:6cbf09f61f7acc26fa54c9e5cce755
>> 27b6a6e8177517ac5b25db254b6fff65cd
>> Deleted: sha256:4fe7d9e1443ac24d4f42cb62199e9c
>> 3a5cdb09075d20223ce8ddfad9a8b28136
>> Deleted: sha256:5b57a570e8e946af161b46714619b3
>> 3a65e88351082f2fb34152bf08263fb106
>> Deleted: sha256:fb3a09c91c988d2a87dbe219ff13ec
>> 9b7e78d1f44bf1557a0b6baed551f5e2f9
>> Deleted: sha256:b34a30079f5c738e58ec4bbe09de74
>> 9b0020310b0287a27d9032905827ea3ace
>> Deleted: sha256:f248b48f8489cdced7f73f89dd89ef
>> 51c0931d661736b7dd2e1e92b6be227100
>> Deleted: sha256:a36628b29b5fe190088800fe743903
>> 49bc2668f56ac27ff7f2553eb83cdd9c82
>> Deleted: sha256:ab1049c574b9ff5e7d928e7ab2a1ac
>> b903e5db586b6ed12c812fa719145bbe63
>> Deleted: sha256:21a43b53c42104ef19c8ced4c614b9
>> 1e1bded39875c609ed00b2a3c59eb1dfc0
>> Deleted: sha256:c2acdcaffee234ed28b1e1e85259a2
>> 51a0aa46530a1fb0a95d78a0ae7cf34413
>> Deleted: sha256:63f1de6cbfc4763a66f855362e15b8
>> 5d6262ee1e65f83192b9df8fde7332af17
>> Deleted: sha256:8363905f1ad90a13821de610768530
>> a0eb304c693dcd24d3a99bb71a5f306240
>> Deleted: sha256:156c2c1a0ce6407bc041965669ff51
>> 62140b23fbf9d4d1482600e08330ce355b
>> Deleted: sha256:bcf97f8ad8d2a3a698c2419b15195b
>> f3572a9e93b54cca98fea1c1baf26e2a75
>> Deleted: sha256:af88d58e06c6365661d2a438fd49be
>> 78f8fc85c170fc56ec1d61e9f4bff578ed
>> Deleted: sha256:7e18b09f3a84ff8b90caa66b11d527
>> b4a2d07882ba418ed9a725e1268be1f2d3
>> Deleted: sha256:8421e918dd878373a5fb3d35231a58
>> fb55d69de5f71cf45ab4552b5a24775635
>> Build step 'Execute shell' marked build as failure
>>
>>
>>

Mime
  • Unnamed multipart/alternative (inline, None, 0 bytes)
View raw message