mesos-builds mailing list archives

Site index · List index
Message view « Date » · « Thread »
Top « Date » · « Thread »
From Greg Mann <g...@mesosphere.io>
Subject Re: Build failed in Jenkins: Mesos-Buildbot » cmake,gcc,--verbose --enable-libevent --enable-ssl,GLOG_v=1 MESOS_VERBOSE=1,ubuntu:14.04,(docker||Hadoop)&&(!ubuntu-us1)&&(!ubuntu-eu2) #3202
Date Mon, 30 Jan 2017 00:54:14 GMT
It looks like a couple tickets for this flaky test have been resolved
previously, but the error shown here is different. I created a new ticket
to track: https://issues.apache.org/jira/browse/MESOS-7029

Cheers,
Greg

On Sun, Jan 29, 2017 at 3:37 PM, Apache Jenkins Server <
jenkins@builds.apache.org> wrote:

> See <https://builds.apache.org/job/Mesos-Buildbot/BUILDTOOL=
> cmake,COMPILER=gcc,CONFIGURATION=--verbose%20--enable-libevent%20--enable-
> ssl,ENVIRONMENT=GLOG_v=1%20MESOS_VERBOSE=1,OS=ubuntu%
> 3A14.04,label_exp=(docker%7C%7CHadoop)&&(!ubuntu-us1)&&(!
> ubuntu-eu2)/3202/changes>
>
> Changes:
>
> [anand] Added an overload for `acceptsMediaType()`.
>
> [anand] Added constants for referring to request/response streaming
> headers.
>
> [anand] Renamed `streamingRequest` to `streamingMediaType`.
>
> [anand] Introduced `RequestMediaTypes`.
>
> [anand] Added some assertions to the switchboard request handler.
>
> [anand] Added support for the new streaming request/response headers.
>
> [anand] Modified existing tests to support new headers for request
> streaming.
>
> [anand] Added a test for validating streaming request/response headers.
>
> [yujie.jay] Supported auto backend in MesosContainerizer.
>
> ------------------------------------------
> [...truncated 176303 lines...]
> I0129 23:36:56.053136 27116 status_update_manager.cpp:177] Pausing sending
> status updates
> I0129 23:36:56.053396 27116 state.cpp:60] Recovering state from
> '/tmp/Endpoint_SlaveEndpointTest_AuthorizedRequest_1_Us7gOj/meta'
> I0129 23:36:56.053526 27116 status_update_manager.cpp:203] Recovering
> status update manager
> I0129 23:36:56.053593 27116 containerizer.cpp:599] Recovering containerizer
> I0129 23:36:56.054289 27118 provisioner.cpp:410] Provisioner recovery
> complete
> I0129 23:36:56.054460 27111 slave.cpp:5422] Finished recovery
> I0129 23:36:56.054920 27111 slave.cpp:5596] Querying resource estimator
> for oversubscribable resources
> I0129 23:36:56.055070 27121 slave.cpp:5610] Received oversubscribable
> resources {} from the resource estimator
> I0129 23:36:56.055994 27113 process.cpp:3697] Handling HTTP event for
> process 'slave(681)' with path: '/slave(681)/monitor/statistics.json'
> I0129 23:36:56.056398 27125 http.cpp:871] Authorizing principal
> 'test-principal' to GET the '/monitor/statistics.json' endpoint
> I0129 23:36:56.057615 27122 slave.cpp:801] Agent terminating
> [       OK ] Endpoint/SlaveEndpointTest.AuthorizedRequest/1 (13 ms)
> [ RUN      ] Endpoint/SlaveEndpointTest.AuthorizedRequest/2
> I0129 23:36:56.063793 27110 containerizer.cpp:220] Using isolation:
> posix/cpu,posix/mem,filesystem/posix,network/cni
> W0129 23:36:56.064142 27110 backend.cpp:76] Failed to create 'aufs'
> backend: AufsBackend requires root privileges
> W0129 23:36:56.064189 27110 backend.cpp:76] Failed to create 'bind'
> backend: BindBackend requires root privileges
> I0129 23:36:56.064211 27110 provisioner.cpp:249] Using default backend
> 'copy'
> I0129 23:36:56.065542 27120 slave.cpp:209] Mesos agent started on (682)@
> 172.17.0.2:59854
> I0129 23:36:56.065575 27120 slave.cpp:210] Flags at startup: --acls=""
> --appc_simple_discovery_uri_prefix="http://" --appc_store_dir="/tmp/mesos/store/appc"
> --authenticate_http_readonly="true" --authenticate_http_readwrite="true"
> --authenticatee="crammd5" --authentication_backoff_factor="1secs"
> --authorizer="local" --cgroups_cpu_enable_pids_and_tids_count="false"
> --cgroups_enable_cfs="false" --cgroups_hierarchy="/sys/fs/cgroup"
> --cgroups_limit_swap="false" --cgroups_root="mesos" --container_disk_watch_interval="15secs"
> --containerizers="mesos" --credential="/tmp/Endpoint_SlaveEndpointTest_
> AuthorizedRequest_2_9VO1bK/credential" --default_role="*"
> --disk_watch_interval="1mins" --docker="docker"
> --docker_kill_orphans="true" --docker_registry="https://
> registry-1.docker.io" --docker_remove_delay="6hrs"
> --docker_socket="/var/run/docker.sock" --docker_stop_timeout="0ns"
> --docker_store_dir="/tmp/mesos/store/docker" --docker_volume_checkpoint_
> dir="/var/run/mesos/isolators/docker/volume" --enforce_container_disk_quota="false"
> --executor_registration_timeout="1mins" --executor_shutdown_grace_period="5secs"
> --fetcher_cache_dir="/tmp/Endpoint_SlaveEndpointTest_
> AuthorizedRequest_2_9VO1bK/fetch" --fetcher_cache_size="2GB"
> --frameworks_home="" --gc_delay="1weeks" --gc_disk_headroom="0.1"
> --hadoop_home="" --help="false" --hostname_lookup="true"
> --http_authenticators="basic" --http_command_executor="false"
> --http_credentials="/tmp/Endpoint_SlaveEndpointTest_
> AuthorizedRequest_2_9VO1bK/http_credentials" --http_heartbeat_interval="30secs"
> --initialize_driver_logging="true" --isolation="posix/cpu,posix/mem"
> --launcher="posix" --launcher_dir="/mesos/build/src" --logbufsecs="0"
> --logging_level="INFO" --max_completed_executors_per_framework="150"
> --oversubscribed_resources_interval="15secs" --perf_duration="10secs"
> --perf_interval="1mins" --qos_correction_interval_min="0ns"
> --quiet="false" --recover="reconnect" --recovery_timeout="15mins"
> --registration_backoff_factor="10ms" --resources="cpus:2;gpus:0;
> mem:1024;disk:1024;ports:[31000-32000]" --revocable_cpu_low_priority="true"
> --runtime_dir="/tmp/Endpoint_SlaveEndpointTest_AuthorizedRequest_2_9VO1bK"
> --sandbox_directory="/mnt/mesos/sandbox" --strict="true"
> --switch_user="true" --systemd_enable_support="true"
> --systemd_runtime_directory="/run/systemd/system" --version="false"
> --work_dir="/tmp/Endpoint_SlaveEndpointTest_AuthorizedRequest_2_iaxlvs"
> I0129 23:36:56.066030 27120 credentials.hpp:86] Loading credential for
> authentication from '/tmp/Endpoint_SlaveEndpointTest_
> AuthorizedRequest_2_9VO1bK/credential'
> I0129 23:36:56.066144 27120 slave.cpp:352] Agent using credential for:
> test-principal
> I0129 23:36:56.066161 27120 credentials.hpp:37] Loading credentials for
> authentication from '/tmp/Endpoint_SlaveEndpointTest_
> AuthorizedRequest_2_9VO1bK/http_credentials'
> I0129 23:36:56.066361 27120 http.cpp:919] Using default 'basic' HTTP
> authenticator for realm 'mesos-agent-readonly'
> I0129 23:36:56.066445 27120 http.cpp:919] Using default 'basic' HTTP
> authenticator for realm 'mesos-agent-readwrite'
> I0129 23:36:56.066926 27120 slave.cpp:539] Agent resources: cpus(*):2;
> mem(*):1024; disk(*):1024; ports(*):[31000-32000]
> I0129 23:36:56.066961 27120 slave.cpp:547] Agent attributes: [  ]
> I0129 23:36:56.066967 27120 slave.cpp:552] Agent hostname: 617631e753c5
> I0129 23:36:56.067032 27112 status_update_manager.cpp:177] Pausing sending
> status updates
> I0129 23:36:56.067536 27112 state.cpp:60] Recovering state from
> '/tmp/Endpoint_SlaveEndpointTest_AuthorizedRequest_2_iaxlvs/meta'
> I0129 23:36:56.067725 27112 status_update_manager.cpp:203] Recovering
> status update manager
> I0129 23:36:56.067973 27125 containerizer.cpp:599] Recovering containerizer
> I0129 23:36:56.068511 27126 provisioner.cpp:410] Provisioner recovery
> complete
> I0129 23:36:56.068737 27126 slave.cpp:5422] Finished recovery
> I0129 23:36:56.069239 27126 slave.cpp:5596] Querying resource estimator
> for oversubscribable resources
> I0129 23:36:56.069494 27112 slave.cpp:5610] Received oversubscribable
> resources {} from the resource estimator
> I0129 23:36:56.070333 27126 process.cpp:3697] Handling HTTP event for
> process 'slave(682)' with path: '/slave(682)/containers'
> I0129 23:36:56.070830 27113 http.cpp:871] Authorizing principal
> 'test-principal' to GET the '/containers' endpoint
> I0129 23:36:56.072185 27115 slave.cpp:801] Agent terminating
> [       OK ] Endpoint/SlaveEndpointTest.AuthorizedRequest/2 (19 ms)
> [ RUN      ] Endpoint/SlaveEndpointTest.UnauthorizedRequest/0
> I0129 23:36:56.082031 27110 containerizer.cpp:220] Using isolation:
> posix/cpu,posix/mem,filesystem/posix,network/cni
> W0129 23:36:56.082288 27110 backend.cpp:76] Failed to create 'aufs'
> backend: AufsBackend requires root privileges
> W0129 23:36:56.082326 27110 backend.cpp:76] Failed to create 'bind'
> backend: BindBackend requires root privileges
> I0129 23:36:56.082345 27110 provisioner.cpp:249] Using default backend
> 'copy'
> I0129 23:36:56.083418 27120 slave.cpp:209] Mesos agent started on (683)@
> 172.17.0.2:59854
> I0129 23:36:56.083434 27120 slave.cpp:210] Flags at startup: --acls=""
> --appc_simple_discovery_uri_prefix="http://" --appc_store_dir="/tmp/mesos/store/appc"
> --authenticate_http_readonly="true" --authenticate_http_readwrite="true"
> --authenticatee="crammd5" --authentication_backoff_factor="1secs"
> --authorizer="local" --cgroups_cpu_enable_pids_and_tids_count="false"
> --cgroups_enable_cfs="false" --cgroups_hierarchy="/sys/fs/cgroup"
> --cgroups_limit_swap="false" --cgroups_root="mesos" --container_disk_watch_interval="15secs"
> --containerizers="mesos" --credential="/tmp/Endpoint_SlaveEndpointTest_
> UnauthorizedRequest_0_qGuO6S/credential" --default_role="*"
> --disk_watch_interval="1mins" --docker="docker"
> --docker_kill_orphans="true" --docker_registry="https://
> registry-1.docker.io" --docker_remove_delay="6hrs"
> --docker_socket="/var/run/docker.sock" --docker_stop_timeout="0ns"
> --docker_store_dir="/tmp/mesos/store/docker" --docker_volume_checkpoint_
> dir="/var/run/mesos/isolators/docker/volume" --enforce_container_disk_quota="false"
> --executor_registration_timeout="1mins" --executor_shutdown_grace_period="5secs"
> --fetcher_cache_dir="/tmp/Endpoint_SlaveEndpointTest_
> UnauthorizedRequest_0_qGuO6S/fetch" --fetcher_cache_size="2GB"
> --frameworks_home="" --gc_delay="1weeks" --gc_disk_headroom="0.1"
> --hadoop_home="" --help="false" --hostname_lookup="true"
> --http_authenticators="basic" --http_command_executor="false"
> --http_credentials="/tmp/Endpoint_SlaveEndpointTest_
> UnauthorizedRequest_0_qGuO6S/http_credentials" --http_heartbeat_interval="30secs"
> --initialize_driver_logging="true" --isolation="posix/cpu,posix/mem"
> --launcher="posix" --launcher_dir="/mesos/build/src" --logbufsecs="0"
> --logging_level="INFO" --max_completed_executors_per_framework="150"
> --oversubscribed_resources_interval="15secs" --perf_duration="10secs"
> --perf_interval="1mins" --qos_correction_interval_min="0ns"
> --quiet="false" --recover="reconnect" --recovery_timeout="15mins"
> --registration_backoff_factor="10ms" --resources="cpus:2;gpus:0;
> mem:1024;disk:1024;ports:[31000-32000]" --revocable_cpu_low_priority="true"
> --runtime_dir="/tmp/Endpoint_SlaveEndpointTest_UnauthorizedRequest_0_qGuO6S"
> --sandbox_directory="/mnt/mesos/sandbox" --strict="true"
> --switch_user="true" --systemd_enable_support="true"
> --systemd_runtime_directory="/run/systemd/system" --version="false"
> --work_dir="/tmp/Endpoint_SlaveEndpointTest_UnauthorizedRequest_0_ERg6mB"
> I0129 23:36:56.083719 27120 credentials.hpp:86] Loading credential for
> authentication from '/tmp/Endpoint_SlaveEndpointTest_
> UnauthorizedRequest_0_qGuO6S/credential'
> I0129 23:36:56.083808 27120 slave.cpp:352] Agent using credential for:
> test-principal
> I0129 23:36:56.083819 27120 credentials.hpp:37] Loading credentials for
> authentication from '/tmp/Endpoint_SlaveEndpointTest_
> UnauthorizedRequest_0_qGuO6S/http_credentials'
> I0129 23:36:56.083907 27120 http.cpp:919] Using default 'basic' HTTP
> authenticator for realm 'mesos-agent-readonly'
> I0129 23:36:56.083950 27120 http.cpp:919] Using default 'basic' HTTP
> authenticator for realm 'mesos-agent-readwrite'
> I0129 23:36:56.084326 27120 slave.cpp:539] Agent resources: cpus(*):2;
> mem(*):1024; disk(*):1024; ports(*):[31000-32000]
> I0129 23:36:56.084357 27120 slave.cpp:547] Agent attributes: [  ]
> I0129 23:36:56.084362 27120 slave.cpp:552] Agent hostname: 617631e753c5
> I0129 23:36:56.084444 27118 status_update_manager.cpp:177] Pausing sending
> status updates
> I0129 23:36:56.084765 27117 state.cpp:60] Recovering state from
> '/tmp/Endpoint_SlaveEndpointTest_UnauthorizedRequest_0_ERg6mB/meta'
> I0129 23:36:56.084980 27125 status_update_manager.cpp:203] Recovering
> status update manager
> I0129 23:36:56.085048 27120 containerizer.cpp:599] Recovering containerizer
> I0129 23:36:56.085547 27117 provisioner.cpp:410] Provisioner recovery
> complete
> I0129 23:36:56.085750 27111 slave.cpp:5422] Finished recovery
> I0129 23:36:56.086098 27111 slave.cpp:5596] Querying resource estimator
> for oversubscribable resources
> I0129 23:36:56.086220 27111 slave.cpp:5610] Received oversubscribable
> resources {} from the resource estimator
> I0129 23:36:56.087108 27120 process.cpp:3697] Handling HTTP event for
> process 'slave(683)' with path: '/slave(683)/monitor/statistics'
> I0129 23:36:56.087468 27120 http.cpp:871] Authorizing principal
> 'test-principal' to GET the '/monitor/statistics' endpoint
> I0129 23:36:56.088527 27117 slave.cpp:801] Agent terminating
> [       OK ] Endpoint/SlaveEndpointTest.UnauthorizedRequest/0 (12 ms)
> [ RUN      ] Endpoint/SlaveEndpointTest.UnauthorizedRequest/1
> I0129 23:36:56.094481 27110 containerizer.cpp:220] Using isolation:
> posix/cpu,posix/mem,filesystem/posix,network/cni
> W0129 23:36:56.094838 27110 backend.cpp:76] Failed to create 'aufs'
> backend: AufsBackend requires root privileges
> W0129 23:36:56.094952 27110 backend.cpp:76] Failed to create 'bind'
> backend: BindBackend requires root privileges
> I0129 23:36:56.094974 27110 provisioner.cpp:249] Using default backend
> 'copy'
> I0129 23:36:56.096738 27119 slave.cpp:209] Mesos agent started on (684)@
> 172.17.0.2:59854
> I0129 23:36:56.096755 27119 slave.cpp:210] Flags at startup: --acls=""
> --appc_simple_discovery_uri_prefix="http://" --appc_store_dir="/tmp/mesos/store/appc"
> --authenticate_http_readonly="true" --authenticate_http_readwrite="true"
> --authenticatee="crammd5" --authentication_backoff_factor="1secs"
> --authorizer="local" --cgroups_cpu_enable_pids_and_tids_count="false"
> --cgroups_enable_cfs="false" --cgroups_hierarchy="/sys/fs/cgroup"
> --cgroups_limit_swap="false" --cgroups_root="mesos" --container_disk_watch_interval="15secs"
> --containerizers="mesos" --credential="/tmp/Endpoint_SlaveEndpointTest_
> UnauthorizedRequest_1_Fdpda2/credential" --default_role="*"
> --disk_watch_interval="1mins" --docker="docker"
> --docker_kill_orphans="true" --docker_registry="https://
> registry-1.docker.io" --docker_remove_delay="6hrs"
> --docker_socket="/var/run/docker.sock" --docker_stop_timeout="0ns"
> --docker_store_dir="/tmp/mesos/store/docker" --docker_volume_checkpoint_
> dir="/var/run/mesos/isolators/docker/volume" --enforce_container_disk_quota="false"
> --executor_registration_timeout="1mins" --executor_shutdown_grace_period="5secs"
> --fetcher_cache_dir="/tmp/Endpoint_SlaveEndpointTest_
> UnauthorizedRequest_1_Fdpda2/fetch" --fetcher_cache_size="2GB"
> --frameworks_home="" --gc_delay="1weeks" --gc_disk_headroom="0.1"
> --hadoop_home="" --help="false" --hostname_lookup="true"
> --http_authenticators="basic" --http_command_executor="false"
> --http_credentials="/tmp/Endpoint_SlaveEndpointTest_
> UnauthorizedRequest_1_Fdpda2/http_credentials" --http_heartbeat_interval="30secs"
> --initialize_driver_logging="true" --isolation="posix/cpu,posix/mem"
> --launcher="posix" --launcher_dir="/mesos/build/src" --logbufsecs="0"
> --logging_level="INFO" --max_completed_executors_per_framework="150"
> --oversubscribed_resources_interval="15secs" --perf_duration="10secs"
> --perf_interval="1mins" --qos_correction_interval_min="0ns"
> --quiet="false" --recover="reconnect" --recovery_timeout="15mins"
> --registration_backoff_factor="10ms" --resources="cpus:2;gpus:0;
> mem:1024;disk:1024;ports:[31000-32000]" --revocable_cpu_low_priority="true"
> --runtime_dir="/tmp/Endpoint_SlaveEndpointTest_UnauthorizedRequest_1_Fdpda2"
> --sandbox_directory="/mnt/mesos/sandbox" --strict="true"
> --switch_user="true" --systemd_enable_support="true"
> --systemd_runtime_directory="/run/systemd/system" --version="false"
> --work_dir="/tmp/Endpoint_SlaveEndpointTest_UnauthorizedRequest_1_CTgxoK"
> I0129 23:36:56.097229 27119 credentials.hpp:86] Loading credential for
> authentication from '/tmp/Endpoint_SlaveEndpointTest_
> UnauthorizedRequest_1_Fdpda2/credential'
> I0129 23:36:56.097345 27119 slave.cpp:352] Agent using credential for:
> test-principal
> I0129 23:36:56.097617 27119 credentials.hpp:37] Loading credentials for
> authentication from '/tmp/Endpoint_SlaveEndpointTest_
> UnauthorizedRequest_1_Fdpda2/http_credentials'
> I0129 23:36:56.097774 27119 http.cpp:919] Using default 'basic' HTTP
> authenticator for realm 'mesos-agent-readonly'
> I0129 23:36:56.097905 27119 http.cpp:919] Using default 'basic' HTTP
> authenticator for realm 'mesos-agent-readwrite'
> I0129 23:36:56.098407 27119 slave.cpp:539] Agent resources: cpus(*):2;
> mem(*):1024; disk(*):1024; ports(*):[31000-32000]
> I0129 23:36:56.098445 27119 slave.cpp:547] Agent attributes: [  ]
> I0129 23:36:56.098453 27119 slave.cpp:552] Agent hostname: 617631e753c5
> I0129 23:36:56.098522 27111 status_update_manager.cpp:177] Pausing sending
> status updates
> I0129 23:36:56.099030 27119 state.cpp:60] Recovering state from
> '/tmp/Endpoint_SlaveEndpointTest_UnauthorizedRequest_1_CTgxoK/meta'
> I0129 23:36:56.099284 27122 status_update_manager.cpp:203] Recovering
> status update manager
> I0129 23:36:56.099400 27124 containerizer.cpp:599] Recovering containerizer
> I0129 23:36:56.099995 27114 provisioner.cpp:410] Provisioner recovery
> complete
> I0129 23:36:56.100180 27124 slave.cpp:5422] Finished recovery
> I0129 23:36:56.100677 27124 slave.cpp:5596] Querying resource estimator
> for oversubscribable resources
> I0129 23:36:56.100765 27124 slave.cpp:5610] Received oversubscribable
> resources {} from the resource estimator
> I0129 23:36:56.101585 27119 process.cpp:3697] Handling HTTP event for
> process 'slave(684)' with path: '/slave(684)/monitor/statistics.json'
> I0129 23:36:56.102032 27119 http.cpp:871] Authorizing principal
> 'test-principal' to GET the '/monitor/statistics.json' endpoint
> I0129 23:36:56.103145 27117 slave.cpp:801] Agent terminating
> [       OK ] Endpoint/SlaveEndpointTest.UnauthorizedRequest/1 (19 ms)
> [ RUN      ] Endpoint/SlaveEndpointTest.UnauthorizedRequest/2
> I0129 23:36:56.113044 27110 containerizer.cpp:220] Using isolation:
> posix/cpu,posix/mem,filesystem/posix,network/cni
> W0129 23:36:56.113303 27110 backend.cpp:76] Failed to create 'aufs'
> backend: AufsBackend requires root privileges
> W0129 23:36:56.113342 27110 backend.cpp:76] Failed to create 'bind'
> backend: BindBackend requires root privileges
> I0129 23:36:56.113358 27110 provisioner.cpp:249] Using default backend
> 'copy'
> I0129 23:36:56.114979 27113 slave.cpp:209] Mesos agent started on (685)@
> 172.17.0.2:59854
> I0129 23:36:56.114995 27113 slave.cpp:210] Flags at startup: --acls=""
> --appc_simple_discovery_uri_prefix="http://" --appc_store_dir="/tmp/mesos/store/appc"
> --authenticate_http_readonly="true" --authenticate_http_readwrite="true"
> --authenticatee="crammd5" --authentication_backoff_factor="1secs"
> --authorizer="local" --cgroups_cpu_enable_pids_and_tids_count="false"
> --cgroups_enable_cfs="false" --cgroups_hierarchy="/sys/fs/cgroup"
> --cgroups_limit_swap="false" --cgroups_root="mesos" --container_disk_watch_interval="15secs"
> --containerizers="mesos" --credential="/tmp/Endpoint_SlaveEndpointTest_
> UnauthorizedRequest_2_tyVdpb/credential" --default_role="*"
> --disk_watch_interval="1mins" --docker="docker"
> --docker_kill_orphans="true" --docker_registry="https://
> registry-1.docker.io" --docker_remove_delay="6hrs"
> --docker_socket="/var/run/docker.sock" --docker_stop_timeout="0ns"
> --docker_store_dir="/tmp/mesos/store/docker" --docker_volume_checkpoint_
> dir="/var/run/mesos/isolators/docker/volume" --enforce_container_disk_quota="false"
> --executor_registration_timeout="1mins" --executor_shutdown_grace_period="5secs"
> --fetcher_cache_dir="/tmp/Endpoint_SlaveEndpointTest_
> UnauthorizedRequest_2_tyVdpb/fetch" --fetcher_cache_size="2GB"
> --frameworks_home="" --gc_delay="1weeks" --gc_disk_headroom="0.1"
> --hadoop_home="" --help="false" --hostname_lookup="true"
> --http_authenticators="basic" --http_command_executor="false"
> --http_credentials="/tmp/Endpoint_SlaveEndpointTest_
> UnauthorizedRequest_2_tyVdpb/http_credentials" --http_heartbeat_interval="30secs"
> --initialize_driver_logging="true" --isolation="posix/cpu,posix/mem"
> --launcher="posix" --launcher_dir="/mesos/build/src" --logbufsecs="0"
> --logging_level="INFO" --max_completed_executors_per_framework="150"
> --oversubscribed_resources_interval="15secs" --perf_duration="10secs"
> --perf_interval="1mins" --qos_correction_interval_min="0ns"
> --quiet="false" --recover="reconnect" --recovery_timeout="15mins"
> --registration_backoff_factor="10ms" --resources="cpus:2;gpus:0;
> mem:1024;disk:1024;ports:[31000-32000]" --revocable_cpu_low_priority="true"
> --runtime_dir="/tmp/Endpoint_SlaveEndpointTest_UnauthorizedRequest_2_tyVdpb"
> --sandbox_directory="/mnt/mesos/sandbox" --strict="true"
> --switch_user="true" --systemd_enable_support="true"
> --systemd_runtime_directory="/run/systemd/system" --version="false"
> --work_dir="/tmp/Endpoint_SlaveEndpointTest_UnauthorizedRequest_2_9rSsAT"
> I0129 23:36:56.115254 27113 credentials.hpp:86] Loading credential for
> authentication from '/tmp/Endpoint_SlaveEndpointTest_
> UnauthorizedRequest_2_tyVdpb/credential'
> I0129 23:36:56.115351 27113 slave.cpp:352] Agent using credential for:
> test-principal
> I0129 23:36:56.115365 27113 credentials.hpp:37] Loading credentials for
> authentication from '/tmp/Endpoint_SlaveEndpointTest_
> UnauthorizedRequest_2_tyVdpb/http_credentials'
> I0129 23:36:56.115468 27113 http.cpp:919] Using default 'basic' HTTP
> authenticator for realm 'mesos-agent-readonly'
> I0129 23:36:56.115507 27113 http.cpp:919] Using default 'basic' HTTP
> authenticator for realm 'mesos-agent-readwrite'
> I0129 23:36:56.115864 27113 slave.cpp:539] Agent resources: cpus(*):2;
> mem(*):1024; disk(*):1024; ports(*):[31000-32000]
> I0129 23:36:56.115896 27113 slave.cpp:547] Agent attributes: [  ]
> I0129 23:36:56.115902 27113 slave.cpp:552] Agent hostname: 617631e753c5
> I0129 23:36:56.116250 27113 status_update_manager.cpp:177] Pausing sending
> status updates
> I0129 23:36:56.116436 27113 state.cpp:60] Recovering state from
> '/tmp/Endpoint_SlaveEndpointTest_UnauthorizedRequest_2_9rSsAT/meta'
> I0129 23:36:56.116559 27113 status_update_manager.cpp:203] Recovering
> status update manager
> I0129 23:36:56.116606 27113 containerizer.cpp:599] Recovering containerizer
> I0129 23:36:56.116993 27113 provisioner.cpp:410] Provisioner recovery
> complete
> I0129 23:36:56.117097 27113 slave.cpp:5422] Finished recovery
> I0129 23:36:56.117431 27113 slave.cpp:5596] Querying resource estimator
> for oversubscribable resources
> I0129 23:36:56.117555 27113 slave.cpp:5610] Received oversubscribable
> resources {} from the resource estimator
> I0129 23:36:56.118405 27114 process.cpp:3697] Handling HTTP event for
> process 'slave(685)' with path: '/slave(685)/containers'
> I0129 23:36:56.118770 27117 http.cpp:871] Authorizing principal
> 'test-principal' to GET the '/containers' endpoint
> I0129 23:36:56.119694 27110 slave.cpp:801] Agent terminating
> [       OK ] Endpoint/SlaveEndpointTest.UnauthorizedRequest/2 (11 ms)
> [ RUN      ] Endpoint/SlaveEndpointTest.NoAuthorizer/0
> I0129 23:36:56.124245 27110 containerizer.cpp:220] Using isolation:
> posix/cpu,posix/mem,filesystem/posix,network/cni
> W0129 23:36:56.124619 27110 backend.cpp:76] Failed to create 'aufs'
> backend: AufsBackend requires root privileges
> W0129 23:36:56.124660 27110 backend.cpp:76] Failed to create 'bind'
> backend: BindBackend requires root privileges
> I0129 23:36:56.124680 27110 provisioner.cpp:249] Using default backend
> 'copy'
> I0129 23:36:56.125433 27110 cluster.cpp:446] Creating default 'local'
> authorizer
> I0129 23:36:56.126142 27121 slave.cpp:209] Mesos agent started on (686)@
> 172.17.0.2:59854
> I0129 23:36:56.126369 27121 slave.cpp:210] Flags at startup: --acls=""
> --appc_simple_discovery_uri_prefix="http://" --appc_store_dir="/tmp/mesos/store/appc"
> --authenticate_http_readonly="true" --authenticate_http_readwrite="true"
> --authenticatee="crammd5" --authentication_backoff_factor="1secs"
> --authorizer="local" --cgroups_cpu_enable_pids_and_tids_count="false"
> --cgroups_enable_cfs="false" --cgroups_hierarchy="/sys/fs/cgroup"
> --cgroups_limit_swap="false" --cgroups_root="mesos" --container_disk_watch_interval="15secs"
> --containerizers="mesos" --credential="/tmp/Endpoint_SlaveEndpointTest_
> NoAuthorizer_0_naHpMk/credential" --default_role="*"
> --disk_watch_interval="1mins" --docker="docker"
> --docker_kill_orphans="true" --docker_registry="https://
> registry-1.docker.io" --docker_remove_delay="6hrs"
> --docker_socket="/var/run/docker.sock" --docker_stop_timeout="0ns"
> --docker_store_dir="/tmp/mesos/store/docker" --docker_volume_checkpoint_
> dir="/var/run/mesos/isolators/docker/volume" --enforce_container_disk_quota="false"
> --executor_registration_timeout="1mins" --executor_shutdown_grace_period="5secs"
> --fetcher_cache_dir="/tmp/Endpoint_SlaveEndpointTest_NoAuthorizer_0_naHpMk/fetch"
> --fetcher_cache_size="2GB" --frameworks_home="" --gc_delay="1weeks"
> --gc_disk_headroom="0.1" --hadoop_home="" --help="false"
> --hostname_lookup="true" --http_authenticators="basic"
> --http_command_executor="false" --http_credentials="/tmp/
> Endpoint_SlaveEndpointTest_NoAuthorizer_0_naHpMk/http_credentials"
> --http_heartbeat_interval="30secs" --initialize_driver_logging="true"
> --isolation="posix/cpu,posix/mem" --launcher="posix"
> --launcher_dir="/mesos/build/src" --logbufsecs="0" --logging_level="INFO"
> --max_completed_executors_per_framework="150" --oversubscribed_resources_interval="15secs"
> --perf_duration="10secs" --perf_interval="1mins"
> --qos_correction_interval_min="0ns" --quiet="false" --recover="reconnect"
> --recovery_timeout="15mins" --registration_backoff_factor="10ms"
> --resources="cpus:2;gpus:0;mem:1024;disk:1024;ports:[31000-32000]"
> --revocable_cpu_low_priority="true" --runtime_dir="/tmp/Endpoint_
> SlaveEndpointTest_NoAuthorizer_0_naHpMk" --sandbox_directory="/mnt/mesos/sandbox"
> --strict="true" --switch_user="true" --systemd_enable_support="true"
> --systemd_runtime_directory="/run/systemd/system" --version="false"
> --work_dir="/tmp/Endpoint_SlaveEndpointTest_NoAuthorizer_0_eo7PV2"
> I0129 23:36:56.126761 27121 credentials.hpp:86] Loading credential for
> authentication from '/tmp/Endpoint_SlaveEndpointTest_
> NoAuthorizer_0_naHpMk/credential'
> I0129 23:36:56.126924 27121 slave.cpp:352] Agent using credential for:
> test-principal
> I0129 23:36:56.126965 27121 credentials.hpp:37] Loading credentials for
> authentication from '/tmp/Endpoint_SlaveEndpointTest_
> NoAuthorizer_0_naHpMk/http_credentials'
> I0129 23:36:56.127104 27121 http.cpp:919] Using default 'basic' HTTP
> authenticator for realm 'mesos-agent-readonly'
> I0129 23:36:56.127264 27121 http.cpp:919] Using default 'basic' HTTP
> authenticator for realm 'mesos-agent-readwrite'
> I0129 23:36:56.127822 27121 slave.cpp:539] Agent resources: cpus(*):2;
> mem(*):1024; disk(*):1024; ports(*):[31000-32000]
> I0129 23:36:56.127904 27121 slave.cpp:547] Agent attributes: [  ]
> I0129 23:36:56.127917 27121 slave.cpp:552] Agent hostname: 617631e753c5
> I0129 23:36:56.128371 27121 status_update_manager.cpp:177] Pausing sending
> status updates
> I0129 23:36:56.128773 27121 state.cpp:60] Recovering state from
> '/tmp/Endpoint_SlaveEndpointTest_NoAuthorizer_0_eo7PV2/meta'
> I0129 23:36:56.129113 27118 status_update_manager.cpp:203] Recovering
> status update manager
> I0129 23:36:56.129217 27115 containerizer.cpp:599] Recovering containerizer
> I0129 23:36:56.129787 27112 provisioner.cpp:410] Provisioner recovery
> complete
> I0129 23:36:56.129993 27113 slave.cpp:5422] Finished recovery
> I0129 23:36:56.130447 27113 slave.cpp:5596] Querying resource estimator
> for oversubscribable resources
> I0129 23:36:56.130625 27116 slave.cpp:5610] Received oversubscribable
> resources {} from the resource estimator
> I0129 23:36:56.131422 27116 process.cpp:3697] Handling HTTP event for
> process 'slave(686)' with path: '/slave(686)/monitor/statistics'
> I0129 23:36:56.131701 27116 http.cpp:871] Authorizing principal
> 'test-principal' to GET the '/monitor/statistics' endpoint
> I0129 23:36:56.132772 27118 slave.cpp:801] Agent terminating
> [       OK ] Endpoint/SlaveEndpointTest.NoAuthorizer/0 (12 ms)
> [ RUN      ] Endpoint/SlaveEndpointTest.NoAuthorizer/1
> I0129 23:36:56.137364 27110 containerizer.cpp:220] Using isolation:
> posix/cpu,posix/mem,filesystem/posix,network/cni
> W0129 23:36:56.137615 27110 backend.cpp:76] Failed to create 'aufs'
> backend: AufsBackend requires root privileges
> W0129 23:36:56.137652 27110 backend.cpp:76] Failed to create 'bind'
> backend: BindBackend requires root privileges
> I0129 23:36:56.137670 27110 provisioner.cpp:249] Using default backend
> 'copy'
> I0129 23:36:56.138362 27110 cluster.cpp:446] Creating default 'local'
> authorizer
> I0129 23:36:56.138931 27124 slave.cpp:209] Mesos agent started on (687)@
> 172.17.0.2:59854
> I0129 23:36:56.138947 27124 slave.cpp:210] Flags at startup: --acls=""
> --appc_simple_discovery_uri_prefix="http://" --appc_store_dir="/tmp/mesos/store/appc"
> --authenticate_http_readonly="true" --authenticate_http_readwrite="true"
> --authenticatee="crammd5" --authentication_backoff_factor="1secs"
> --authorizer="local" --cgroups_cpu_enable_pids_and_tids_count="false"
> --cgroups_enable_cfs="false" --cgroups_hierarchy="/sys/fs/cgroup"
> --cgroups_limit_swap="false" --cgroups_root="mesos" --container_disk_watch_interval="15secs"
> --containerizers="mesos" --credential="/tmp/Endpoint_SlaveEndpointTest_
> NoAuthorizer_1_pKD6hu/credential" --default_role="*"
> --disk_watch_interval="1mins" --docker="docker"
> --docker_kill_orphans="true" --docker_registry="https://
> registry-1.docker.io" --docker_remove_delay="6hrs"
> --docker_socket="/var/run/docker.sock" --docker_stop_timeout="0ns"
> --docker_store_dir="/tmp/mesos/store/docker" --docker_volume_checkpoint_
> dir="/var/run/mesos/isolators/docker/volume" --enforce_container_disk_quota="false"
> --executor_registration_timeout="1mins" --executor_shutdown_grace_period="5secs"
> --fetcher_cache_dir="/tmp/Endpoint_SlaveEndpointTest_NoAuthorizer_1_pKD6hu/fetch"
> --fetcher_cache_size="2GB" --frameworks_home="" --gc_delay="1weeks"
> --gc_disk_headroom="0.1" --hadoop_home="" --help="false"
> --hostname_lookup="true" --http_authenticators="basic"
> --http_command_executor="false" --http_credentials="/tmp/
> Endpoint_SlaveEndpointTest_NoAuthorizer_1_pKD6hu/http_credentials"
> --http_heartbeat_interval="30secs" --initialize_driver_logging="true"
> --isolation="posix/cpu,posix/mem" --launcher="posix"
> --launcher_dir="/mesos/build/src" --logbufsecs="0" --logging_level="INFO"
> --max_completed_executors_per_framework="150" --oversubscribed_resources_interval="15secs"
> --perf_duration="10secs" --perf_interval="1mins"
> --qos_correction_interval_min="0ns" --quiet="false" --recover="reconnect"
> --recovery_timeout="15mins" --registration_backoff_factor="10ms"
> --resources="cpus:2;gpus:0;mem:1024;disk:1024;ports:[31000-32000]"
> --revocable_cpu_low_priority="true" --runtime_dir="/tmp/Endpoint_
> SlaveEndpointTest_NoAuthorizer_1_pKD6hu" --sandbox_directory="/mnt/mesos/sandbox"
> --strict="true" --switch_user="true" --systemd_enable_support="true"
> --systemd_runtime_directory="/run/systemd/system" --version="false"
> --work_dir="/tmp/Endpoint_SlaveEndpointTest_NoAuthorizer_1_KMgppc"
> I0129 23:36:56.139185 27124 credentials.hpp:86] Loading credential for
> authentication from '/tmp/Endpoint_SlaveEndpointTest_
> NoAuthorizer_1_pKD6hu/credential'
> I0129 23:36:56.139258 27124 slave.cpp:352] Agent using credential for:
> test-principal
> I0129 23:36:56.139268 27124 credentials.hpp:37] Loading credentials for
> authentication from '/tmp/Endpoint_SlaveEndpointTest_
> NoAuthorizer_1_pKD6hu/http_credentials'
> I0129 23:36:56.139358 27124 http.cpp:919] Using default 'basic' HTTP
> authenticator for realm 'mesos-agent-readonly'
> I0129 23:36:56.139397 27124 http.cpp:919] Using default 'basic' HTTP
> authenticator for realm 'mesos-agent-readwrite'
> I0129 23:36:56.139721 27124 slave.cpp:539] Agent resources: cpus(*):2;
> mem(*):1024; disk(*):1024; ports(*):[31000-32000]
> I0129 23:36:56.139755 27124 slave.cpp:547] Agent attributes: [  ]
> I0129 23:36:56.139763 27124 slave.cpp:552] Agent hostname: 617631e753c5
> I0129 23:36:56.139834 27125 status_update_manager.cpp:177] Pausing sending
> status updates
> I0129 23:36:56.140220 27124 state.cpp:60] Recovering state from
> '/tmp/Endpoint_SlaveEndpointTest_NoAuthorizer_1_KMgppc/meta'
> I0129 23:36:56.140399 27112 status_update_manager.cpp:203] Recovering
> status update manager
> I0129 23:36:56.140491 27126 containerizer.cpp:599] Recovering containerizer
> I0129 23:36:56.141108 27118 provisioner.cpp:410] Provisioner recovery
> complete
> I0129 23:36:56.141283 27118 slave.cpp:5422] Finished recovery
> I0129 23:36:56.141818 27118 slave.cpp:5596] Querying resource estimator
> for oversubscribable resources
> I0129 23:36:56.142060 27125 slave.cpp:5610] Received oversubscribable
> resources {} from the resource estimator
> I0129 23:36:56.142901 27125 process.cpp:3697] Handling HTTP event for
> process 'slave(687)' with path: '/slave(687)/monitor/statistics.json'
> I0129 23:36:56.143338 27125 http.cpp:871] Authorizing principal
> 'test-principal' to GET the '/monitor/statistics.json' endpoint
> I0129 23:36:56.144480 27125 slave.cpp:801] Agent terminating
> [       OK ] Endpoint/SlaveEndpointTest.NoAuthorizer/1 (11 ms)
> [ RUN      ] Endpoint/SlaveEndpointTest.NoAuthorizer/2
> I0129 23:36:56.149081 27110 containerizer.cpp:220] Using isolation:
> posix/cpu,posix/mem,filesystem/posix,network/cni
> W0129 23:36:56.149319 27110 backend.cpp:76] Failed to create 'aufs'
> backend: AufsBackend requires root privileges
> W0129 23:36:56.149355 27110 backend.cpp:76] Failed to create 'bind'
> backend: BindBackend requires root privileges
> I0129 23:36:56.149372 27110 provisioner.cpp:249] Using default backend
> 'copy'
> I0129 23:36:56.149857 27110 cluster.cpp:446] Creating default 'local'
> authorizer
> I0129 23:36:56.150339 27116 slave.cpp:209] Mesos agent started on (688)@
> 172.17.0.2:59854
> I0129 23:36:56.150358 27116 slave.cpp:210] Flags at startup: --acls=""
> --appc_simple_discovery_uri_prefix="http://" --appc_store_dir="/tmp/mesos/store/appc"
> --authenticate_http_readonly="true" --authenticate_http_readwrite="true"
> --authenticatee="crammd5" --authentication_backoff_factor="1secs"
> --authorizer="local" --cgroups_cpu_enable_pids_and_tids_count="false"
> --cgroups_enable_cfs="false" --cgroups_hierarchy="/sys/fs/cgroup"
> --cgroups_limit_swap="false" --cgroups_root="mesos" --container_disk_watch_interval="15secs"
> --containerizers="mesos" --credential="/tmp/Endpoint_SlaveEndpointTest_
> NoAuthorizer_2_451jVD/credential" --default_role="*"
> --disk_watch_interval="1mins" --docker="docker"
> --docker_kill_orphans="true" --docker_registry="https://
> registry-1.docker.io" --docker_remove_delay="6hrs"
> --docker_socket="/var/run/docker.sock" --docker_stop_timeout="0ns"
> --docker_store_dir="/tmp/mesos/store/docker" --docker_volume_checkpoint_
> dir="/var/run/mesos/isolators/docker/volume" --enforce_container_disk_quota="false"
> --executor_registration_timeout="1mins" --executor_shutdown_grace_period="5secs"
> --fetcher_cache_dir="/tmp/Endpoint_SlaveEndpointTest_NoAuthorizer_2_451jVD/fetch"
> --fetcher_cache_size="2GB" --frameworks_home="" --gc_delay="1weeks"
> --gc_disk_headroom="0.1" --hadoop_home="" --help="false"
> --hostname_lookup="true" --http_authenticators="basic"
> --http_command_executor="false" --http_credentials="/tmp/
> Endpoint_SlaveEndpointTest_NoAuthorizer_2_451jVD/http_credentials"
> --http_heartbeat_interval="30secs" --initialize_driver_logging="true"
> --isolation="posix/cpu,posix/mem" --launcher="posix"
> --launcher_dir="/mesos/build/src" --logbufsecs="0" --logging_level="INFO"
> --max_completed_executors_per_framework="150" --oversubscribed_resources_interval="15secs"
> --perf_duration="10secs" --perf_interval="1mins"
> --qos_correction_interval_min="0ns" --quiet="false" --recover="reconnect"
> --recovery_timeout="15mins" --registration_backoff_factor="10ms"
> --resources="cpus:2;gpus:0;mem:1024;disk:1024;ports:[31000-32000]"
> --revocable_cpu_low_priority="true" --runtime_dir="/tmp/Endpoint_
> SlaveEndpointTest_NoAuthorizer_2_451jVD" --sandbox_directory="/mnt/mesos/sandbox"
> --strict="true" --switch_user="true" --systemd_enable_support="true"
> --systemd_runtime_directory="/run/systemd/system" --version="false"
> --work_dir="/tmp/Endpoint_SlaveEndpointTest_NoAuthorizer_2_l27I0l"
> I0129 23:36:56.150780 27116 credentials.hpp:86] Loading credential for
> authentication from '/tmp/Endpoint_SlaveEndpointTest_
> NoAuthorizer_2_451jVD/credential'
> I0129 23:36:56.150852 27116 slave.cpp:352] Agent using credential for:
> test-principal
> I0129 23:36:56.150864 27116 credentials.hpp:37] Loading credentials for
> authentication from '/tmp/Endpoint_SlaveEndpointTest_
> NoAuthorizer_2_451jVD/http_credentials'
> I0129 23:36:56.150954 27116 http.cpp:919] Using default 'basic' HTTP
> authenticator for realm 'mesos-agent-readonly'
> I0129 23:36:56.151001 27116 http.cpp:919] Using default 'basic' HTTP
> authenticator for realm 'mesos-agent-readwrite'
> I0129 23:36:56.151348 27116 slave.cpp:539] Agent resources: cpus(*):2;
> mem(*):1024; disk(*):1024; ports(*):[31000-32000]
> I0129 23:36:56.151383 27116 slave.cpp:547] Agent attributes: [  ]
> I0129 23:36:56.151389 27116 slave.cpp:552] Agent hostname: 617631e753c5
> I0129 23:36:56.151527 27117 status_update_manager.cpp:177] Pausing sending
> status updates
> I0129 23:36:56.151782 27111 state.cpp:60] Recovering state from
> '/tmp/Endpoint_SlaveEndpointTest_NoAuthorizer_2_l27I0l/meta'
> I0129 23:36:56.151933 27116 status_update_manager.cpp:203] Recovering
> status update manager
> I0129 23:36:56.152015 27116 containerizer.cpp:599] Recovering containerizer
> I0129 23:36:56.152556 27121 provisioner.cpp:410] Provisioner recovery
> complete
> I0129 23:36:56.152695 27121 slave.cpp:5422] Finished recovery
> I0129 23:36:56.153182 27121 slave.cpp:5596] Querying resource estimator
> for oversubscribable resources
> I0129 23:36:56.153255 27114 slave.cpp:5610] Received oversubscribable
> resources {} from the resource estimator
> I0129 23:36:56.154140 27114 process.cpp:3697] Handling HTTP event for
> process 'slave(688)' with path: '/slave(688)/containers'
> I0129 23:36:56.154618 27120 http.cpp:871] Authorizing principal
> 'test-principal' to GET the '/containers' endpoint
> I0129 23:36:56.155901 27115 slave.cpp:801] Agent terminating
> [       OK ] Endpoint/SlaveEndpointTest.NoAuthorizer/2 (16 ms)
> [----------] 9 tests from Endpoint/SlaveEndpointTest (139 ms total)
>
> [----------] Global test environment tear-down
> [==========] 1415 tests from 158 test cases ran. (184647 ms total)
> [  PASSED  ] 1414 tests.
> [  FAILED  ] 1 test, listed below:
> [  FAILED  ] FaultToleranceTest.FrameworkReregister
>
>  1 FAILED TEST
>   YOU HAVE 14 DISABLED TESTS
>
> make[3]: *** [CMakeFiles/check] Error 1
> make[3]: Leaving directory `/mesos/build'
> make[2]: *** [CMakeFiles/check.dir/all] Error 2
> make[2]: Leaving directory `/mesos/build'
> make[1]: Leaving directory `/mesos/build'
> make[1]: *** [CMakeFiles/check.dir/rule] Error 2
> make: *** [check] Error 2
> + docker rmi mesos-1485730165-12525
> Untagged: mesos-1485730165-12525:latest
> Deleted: sha256:ef27d502b65c29c45de06c60e47388
> a681fb9f50419c82d69765e8e200830329
> Deleted: sha256:c5e3acd7c6e95de73a710d861d7f88
> e56cab2b88221f6097c289995f95ae887e
> Deleted: sha256:9af1df6c19d687dcc9beb8c48cc149
> b9fbeb98d29d7afee52e5ac01dfccb8f5f
> Deleted: sha256:4dde1d5b37bca427544242fa8fdcbc
> 4c1bc1a4b3fe83fa350bd9d42d7a4e66b9
> Deleted: sha256:86c54f2f53916aa48ee720881bc3d1
> 20360a5d382755187ba67313a449d56b9c
> Deleted: sha256:ceeb2db13627dd3bec2757852ed000
> e9073e9bc11c5d4c8261132b3a5e752ab6
> Deleted: sha256:ddf416d7dbf9eb5a9df27ebfd68fcc
> 964aeddac443ec6e823e2248a0805b0122
> Deleted: sha256:bbecbbbeb372b9c4085ca2bad97e0c
> 66b00b402155d2f7125b4382b2873b1b63
> Deleted: sha256:5189245fec2e968538a3fbace676e9
> 243d238c7d15e65da443ebcdbb71f77546
> Deleted: sha256:65d8ed7239597e4bb0d455bec3475f
> 6cde9f1eca367a27cabc46b14e6da1939f
> Deleted: sha256:acd6a54a5f0e43bcdc9b8c12fe1267
> 967c6d557efb9c535bb1e9010f1d791144
> Deleted: sha256:db00d0a7ac4b337e7161bf32ed840d
> 61b018cc8040d18f7266893e22b75d718e
> Deleted: sha256:2ba4cd7330f4c1717aa29ceda7855c
> f3cfe18ec596411782e93952612c70f090
> Deleted: sha256:1f268a7ce48dc863097c2377dbf930
> d6015379add3b0e4ab33674a8a1226a5fc
> Deleted: sha256:8ebeefb6c66b048ac1657c30b3ed02
> 53250198dcc8bafd2767d02c6aa413d0e6
> Deleted: sha256:4d5555e5d2119801470acd39312cf5
> e6318b0439a5e76aa1de09ed91572fbdc8
> Deleted: sha256:01b978604244c36a4d7046062ba89d
> b89b7b01bec988f4d9ffd9b2037c21cf85
> Deleted: sha256:9145641f5d622555b46fc6f864c2e9
> 7d3750375501843a71326f97843c6f2742
> Deleted: sha256:24262927daad22e589ec6abce2a7b7
> 5927d4cf2be9da5c4d77f5bc66471b7c87
> Deleted: sha256:0c8a5fdc20cc9912fd85fa078a1ed6
> 739b89bf7d78ca8ffb494dc5d5f71f19ff
> Deleted: sha256:3a8ee3b77f3443a76685dab4212def
> 8a53009a07cb4a2d7d7d108945d9bb35c2
> Deleted: sha256:652240fe1e9f44b5f6002046b1fecf
> 8c117e8219a80ef988acc8b379d052a2e8
> Deleted: sha256:f7c18e7b1633b580465805748c7c09
> 2f280cfdc27dc454c9ff8de3d82ddb5f90
> Deleted: sha256:7f3cf6fd741df0954d54efd0ed0d51
> a609ffc524d8fac29df6d24fa93877dbb2
> Build step 'Execute shell' marked build as failure
>

Mime
  • Unnamed multipart/alternative (inline, None, 0 bytes)
View raw message