mesos-builds mailing list archives

Site index · List index
Message view « Date » · « Thread »
Top « Date » · « Thread »
From Michael Park <mp...@apache.org>
Subject Re: Build failed in Jenkins: Mesos-Buildbot » cmake,clang,--verbose --enable-libevent --enable-ssl,GLOG_v=1 MESOS_VERBOSE=1,ubuntu:14.04,(docker||Hadoop)&&(!ubuntu-us1)&&(!ubuntu-eu2) #3186
Date Wed, 25 Jan 2017 21:47:06 GMT
@AlexR, what does VM lag mean?

On Wed, Jan 25, 2017 at 11:55 AM, Alex Rukletsov <alex@mesosphere.com>
wrote:

> This looks like VM lag.
>
> On Wed, Jan 25, 2017 at 8:35 PM, Michael Park <mpark@apache.org> wrote:
>
> > Filed: https://issues.apache.org/jira/browse/MESOS-6990
> >
> > On Wed, Jan 25, 2017 at 7:19 AM, Apache Jenkins Server <
> > jenkins@builds.apache.org> wrote:
> >
> > > See <https://builds.apache.org/job/Mesos-Buildbot/BUILDTOOL=
> > > cmake,COMPILER=clang,CONFIGURATION=--verbose%20--
> > > enable-libevent%20--enable-ssl,ENVIRONMENT=GLOG_v=1%
> > > 20MESOS_VERBOSE=1,OS=ubuntu%3A14.04,label_exp=(docker%7C%
> > > 7CHadoop)&&(!ubuntu-us1)&&(!ubuntu-eu2)/3186/changes>
> > >
> > > Changes:
> > >
> > > [haosdent] Fixed to comments in commit 9a80ab.
> > >
> > > ------------------------------------------
> > > [...truncated 171758 lines...]
> > > I0125 15:19:40.775300 25329 slave.cpp:352] Agent using credential for:
> > > test-principal
> > > I0125 15:19:40.775315 25329 credentials.hpp:37] Loading credentials for
> > > authentication from '/tmp/Endpoint_SlaveEndpointTest_
> > > AuthorizedRequest_1_RLt8om/http_credentials'
> > > I0125 15:19:40.775408 25329 http.cpp:922] Using default 'basic' HTTP
> > > authenticator for realm 'mesos-agent-readonly'
> > > I0125 15:19:40.775451 25329 http.cpp:922] Using default 'basic' HTTP
> > > authenticator for realm 'mesos-agent-readwrite'
> > > I0125 15:19:40.775743 25329 slave.cpp:539] Agent resources: cpus(*):2;
> > > mem(*):1024; disk(*):1024; ports(*):[31000-32000]
> > > I0125 15:19:40.775773 25329 slave.cpp:547] Agent attributes: [  ]
> > > I0125 15:19:40.775777 25329 slave.cpp:552] Agent hostname: 9cdefe4ff6bc
> > > I0125 15:19:40.775930 25322 status_update_manager.cpp:177] Pausing
> > sending
> > > status updates
> > > I0125 15:19:40.776177 25328 state.cpp:60] Recovering state from
> > > '/tmp/Endpoint_SlaveEndpointTest_AuthorizedRequest_1_iLcE4D/meta'
> > > I0125 15:19:40.776437 25326 status_update_manager.cpp:203] Recovering
> > > status update manager
> > > I0125 15:19:40.776579 25315 containerizer.cpp:599] Recovering
> > containerizer
> > > I0125 15:19:40.777109 25315 provisioner.cpp:251] Provisioner recovery
> > > complete
> > > I0125 15:19:40.777338 25315 slave.cpp:5422] Finished recovery
> > > I0125 15:19:40.777655 25315 slave.cpp:5596] Querying resource estimator
> > > for oversubscribable resources
> > > I0125 15:19:40.777806 25328 slave.cpp:5610] Received oversubscribable
> > > resources {} from the resource estimator
> > > I0125 15:19:40.778527 25330 process.cpp:3697] Handling HTTP event for
> > > process 'slave(680)' with path: '/slave(680)/monitor/statistics.json'
> > > I0125 15:19:40.778887 25318 http.cpp:874] Authorizing principal
> > > 'test-principal' to GET the '/monitor/statistics.json' endpoint
> > > I0125 15:19:40.779878 25325 slave.cpp:801] Agent terminating
> > > [       OK ] Endpoint/SlaveEndpointTest.AuthorizedRequest/1 (12 ms)
> > > [ RUN      ] Endpoint/SlaveEndpointTest.AuthorizedRequest/2
> > > I0125 15:19:40.784312 25314 containerizer.cpp:220] Using isolation:
> > > posix/cpu,posix/mem,filesystem/posix,network/cni
> > > W0125 15:19:40.784576 25314 backend.cpp:76] Failed to create 'aufs'
> > > backend: AufsBackend requires root privileges
> > > W0125 15:19:40.784610 25314 backend.cpp:76] Failed to create 'bind'
> > > backend: BindBackend requires root privileges
> > > I0125 15:19:40.785570 25320 slave.cpp:209] Mesos agent started on
> (681)@
> > > 172.17.0.3:57726
> > > I0125 15:19:40.785595 25320 slave.cpp:210] Flags at startup: --acls=""
> > > --appc_simple_discovery_uri_prefix="http://"
> > --appc_store_dir="/tmp/mesos/store/appc"
> > > --authenticate_http_readonly="true" --authenticate_http_readwrite=
> "true"
> > > --authenticatee="crammd5" --authentication_backoff_factor="1secs"
> > > --authorizer="local" --cgroups_cpu_enable_pids_and_tids_count="false"
> > > --cgroups_enable_cfs="false" --cgroups_hierarchy="/sys/fs/cgroup"
> > > --cgroups_limit_swap="false" --cgroups_root="mesos"
> > --container_disk_watch_interval="15secs"
> > > --containerizers="mesos" --credential="/tmp/Endpoint_
> SlaveEndpointTest_
> > > AuthorizedRequest_2_ZnhEPd/credential" --default_role="*"
> > > --disk_watch_interval="1mins" --docker="docker"
> > > --docker_kill_orphans="true" --docker_registry="https://
> > > registry-1.docker.io" --docker_remove_delay="6hrs"
> > > --docker_socket="/var/run/docker.sock" --docker_stop_timeout="0ns"
> > > --docker_store_dir="/tmp/mesos/store/docker"
> --docker_volume_checkpoint_
> > > dir="/var/run/mesos/isolators/docker/volume" --enforce_container_disk_
> > quota="false"
> > > --executor_registration_timeout="1mins" --executor_shutdown_grace_
> > period="5secs"
> > > --fetcher_cache_dir="/tmp/Endpoint_SlaveEndpointTest_
> > > AuthorizedRequest_2_ZnhEPd/fetch" --fetcher_cache_size="2GB"
> > > --frameworks_home="" --gc_delay="1weeks" --gc_disk_headroom="0.1"
> > > --hadoop_home="" --help="false" --hostname_lookup="true"
> > > --http_authenticators="basic" --http_command_executor="false"
> > > --http_credentials="/tmp/Endpoint_SlaveEndpointTest_
> > > AuthorizedRequest_2_ZnhEPd/http_credentials"
> --http_heartbeat_interval="
> > 30secs"
> > > --image_provisioner_backend="copy" --initialize_driver_logging="true"
> > > --isolation="posix/cpu,posix/mem" --launcher="posix"
> > > --launcher_dir="/mesos/build/src" --logbufsecs="0"
> > --logging_level="INFO"
> > > --max_completed_executors_per_framework="150"
> > --oversubscribed_resources_interval="15secs"
> > > --perf_duration="10secs" --perf_interval="1mins"
> > > --qos_correction_interval_min="0ns" --quiet="false"
> > --recover="reconnect"
> > > --recovery_timeout="15mins" --registration_backoff_factor="10ms"
> > > --resources="cpus:2;gpus:0;mem:1024;disk:1024;ports:[31000-32000]"
> > > --revocable_cpu_low_priority="true" --runtime_dir="/tmp/Endpoint_
> > > SlaveEndpointTest_AuthorizedRequest_2_ZnhEPd"
> --sandbox_directory="/mnt/
> > mesos/sandbox"
> > > --strict="true" --switch_user="true" --systemd_enable_support="true"
> > > --systemd_runtime_directory="/run/systemd/system" --version="false"
> > > --work_dir="/tmp/Endpoint_SlaveEndpointTest_
> AuthorizedRequest_2_4mSftv"
> > > I0125 15:19:40.785953 25320 credentials.hpp:86] Loading credential for
> > > authentication from '/tmp/Endpoint_SlaveEndpointTest_
> > > AuthorizedRequest_2_ZnhEPd/credential'
> > > I0125 15:19:40.786031 25320 slave.cpp:352] Agent using credential for:
> > > test-principal
> > > I0125 15:19:40.786047 25320 credentials.hpp:37] Loading credentials for
> > > authentication from '/tmp/Endpoint_SlaveEndpointTest_
> > > AuthorizedRequest_2_ZnhEPd/http_credentials'
> > > I0125 15:19:40.786161 25320 http.cpp:922] Using default 'basic' HTTP
> > > authenticator for realm 'mesos-agent-readonly'
> > > I0125 15:19:40.786214 25320 http.cpp:922] Using default 'basic' HTTP
> > > authenticator for realm 'mesos-agent-readwrite'
> > > I0125 15:19:40.786533 25320 slave.cpp:539] Agent resources: cpus(*):2;
> > > mem(*):1024; disk(*):1024; ports(*):[31000-32000]
> > > I0125 15:19:40.786576 25320 slave.cpp:547] Agent attributes: [  ]
> > > I0125 15:19:40.786588 25320 slave.cpp:552] Agent hostname: 9cdefe4ff6bc
> > > I0125 15:19:40.786833 25317 status_update_manager.cpp:177] Pausing
> > sending
> > > status updates
> > > I0125 15:19:40.786973 25320 state.cpp:60] Recovering state from
> > > '/tmp/Endpoint_SlaveEndpointTest_AuthorizedRequest_2_4mSftv/meta'
> > > I0125 15:19:40.787298 25329 status_update_manager.cpp:203] Recovering
> > > status update manager
> > > I0125 15:19:40.787384 25318 containerizer.cpp:599] Recovering
> > containerizer
> > > I0125 15:19:40.787729 25318 provisioner.cpp:251] Provisioner recovery
> > > complete
> > > I0125 15:19:40.787858 25318 slave.cpp:5422] Finished recovery
> > > I0125 15:19:40.788130 25318 slave.cpp:5596] Querying resource estimator
> > > for oversubscribable resources
> > > I0125 15:19:40.788267 25318 slave.cpp:5610] Received oversubscribable
> > > resources {} from the resource estimator
> > > I0125 15:19:40.789082 25327 process.cpp:3697] Handling HTTP event for
> > > process 'slave(681)' with path: '/slave(681)/containers'
> > > I0125 15:19:40.789597 25327 http.cpp:874] Authorizing principal
> > > 'test-principal' to GET the '/containers' endpoint
> > > I0125 15:19:40.793503 25322 slave.cpp:801] Agent terminating
> > > [       OK ] Endpoint/SlaveEndpointTest.AuthorizedRequest/2 (28 ms)
> > > [ RUN      ] Endpoint/SlaveEndpointTest.UnauthorizedRequest/0
> > > I0125 15:19:40.815058 25314 containerizer.cpp:220] Using isolation:
> > > posix/cpu,posix/mem,filesystem/posix,network/cni
> > > W0125 15:19:40.815544 25314 backend.cpp:76] Failed to create 'aufs'
> > > backend: AufsBackend requires root privileges
> > > W0125 15:19:40.815613 25314 backend.cpp:76] Failed to create 'bind'
> > > backend: BindBackend requires root privileges
> > > I0125 15:19:40.817123 25316 slave.cpp:209] Mesos agent started on
> (682)@
> > > 172.17.0.3:57726
> > > I0125 15:19:40.817323 25316 slave.cpp:210] Flags at startup: --acls=""
> > > --appc_simple_discovery_uri_prefix="http://"
> > --appc_store_dir="/tmp/mesos/store/appc"
> > > --authenticate_http_readonly="true" --authenticate_http_readwrite=
> "true"
> > > --authenticatee="crammd5" --authentication_backoff_factor="1secs"
> > > --authorizer="local" --cgroups_cpu_enable_pids_and_tids_count="false"
> > > --cgroups_enable_cfs="false" --cgroups_hierarchy="/sys/fs/cgroup"
> > > --cgroups_limit_swap="false" --cgroups_root="mesos"
> > --container_disk_watch_interval="15secs"
> > > --containerizers="mesos" --credential="/tmp/Endpoint_
> SlaveEndpointTest_
> > > UnauthorizedRequest_0_Opz5v5/credential" --default_role="*"
> > > --disk_watch_interval="1mins" --docker="docker"
> > > --docker_kill_orphans="true" --docker_registry="https://
> > > registry-1.docker.io" --docker_remove_delay="6hrs"
> > > --docker_socket="/var/run/docker.sock" --docker_stop_timeout="0ns"
> > > --docker_store_dir="/tmp/mesos/store/docker"
> --docker_volume_checkpoint_
> > > dir="/var/run/mesos/isolators/docker/volume" --enforce_container_disk_
> > quota="false"
> > > --executor_registration_timeout="1mins" --executor_shutdown_grace_
> > period="5secs"
> > > --fetcher_cache_dir="/tmp/Endpoint_SlaveEndpointTest_
> > > UnauthorizedRequest_0_Opz5v5/fetch" --fetcher_cache_size="2GB"
> > > --frameworks_home="" --gc_delay="1weeks" --gc_disk_headroom="0.1"
> > > --hadoop_home="" --help="false" --hostname_lookup="true"
> > > --http_authenticators="basic" --http_command_executor="false"
> > > --http_credentials="/tmp/Endpoint_SlaveEndpointTest_
> > > UnauthorizedRequest_0_Opz5v5/http_credentials"
> > --http_heartbeat_interval="30secs"
> > > --image_provisioner_backend="copy" --initialize_driver_logging="true"
> > > --isolation="posix/cpu,posix/mem" --launcher="posix"
> > > --launcher_dir="/mesos/build/src" --logbufsecs="0"
> > --logging_level="INFO"
> > > --max_completed_executors_per_framework="150"
> > --oversubscribed_resources_interval="15secs"
> > > --perf_duration="10secs" --perf_interval="1mins"
> > > --qos_correction_interval_min="0ns" --quiet="false"
> > --recover="reconnect"
> > > --recovery_timeout="15mins" --registration_backoff_factor="10ms"
> > > --resources="cpus:2;gpus:0;mem:1024;disk:1024;ports:[31000-32000]"
> > > --revocable_cpu_low_priority="true" --runtime_dir="/tmp/Endpoint_
> > > SlaveEndpointTest_UnauthorizedRequest_0_Opz5v5"
> > --sandbox_directory="/mnt/mesos/sandbox"
> > > --strict="true" --switch_user="true" --systemd_enable_support="true"
> > > --systemd_runtime_directory="/run/systemd/system" --version="false"
> > > --work_dir="/tmp/Endpoint_SlaveEndpointTest_
> > UnauthorizedRequest_0_DbkT4m"
> > > I0125 15:19:40.817966 25316 credentials.hpp:86] Loading credential for
> > > authentication from '/tmp/Endpoint_SlaveEndpointTest_
> > > UnauthorizedRequest_0_Opz5v5/credential'
> > > I0125 15:19:40.818243 25316 slave.cpp:352] Agent using credential for:
> > > test-principal
> > > I0125 15:19:40.818426 25316 credentials.hpp:37] Loading credentials for
> > > authentication from '/tmp/Endpoint_SlaveEndpointTest_
> > > UnauthorizedRequest_0_Opz5v5/http_credentials'
> > > I0125 15:19:40.818719 25316 http.cpp:922] Using default 'basic' HTTP
> > > authenticator for realm 'mesos-agent-readonly'
> > > I0125 15:19:40.818935 25316 http.cpp:922] Using default 'basic' HTTP
> > > authenticator for realm 'mesos-agent-readwrite'
> > > I0125 15:19:40.819560 25316 slave.cpp:539] Agent resources: cpus(*):2;
> > > mem(*):1024; disk(*):1024; ports(*):[31000-32000]
> > > I0125 15:19:40.819799 25316 slave.cpp:547] Agent attributes: [  ]
> > > I0125 15:19:40.819979 25316 slave.cpp:552] Agent hostname: 9cdefe4ff6bc
> > > I0125 15:19:40.820574 25316 status_update_manager.cpp:177] Pausing
> > sending
> > > status updates
> > > I0125 15:19:40.821029 25325 state.cpp:60] Recovering state from
> > > '/tmp/Endpoint_SlaveEndpointTest_UnauthorizedRequest_0_DbkT4m/meta'
> > > I0125 15:19:40.821511 25325 status_update_manager.cpp:203] Recovering
> > > status update manager
> > > I0125 15:19:40.821743 25325 containerizer.cpp:599] Recovering
> > containerizer
> > > I0125 15:19:40.822475 25325 provisioner.cpp:251] Provisioner recovery
> > > complete
> > > I0125 15:19:40.822810 25325 slave.cpp:5422] Finished recovery
> > > I0125 15:19:40.823434 25325 slave.cpp:5596] Querying resource estimator
> > > for oversubscribable resources
> > > I0125 15:19:40.823770 25325 slave.cpp:5610] Received oversubscribable
> > > resources {} from the resource estimator
> > > I0125 15:19:40.824954 25324 process.cpp:3697] Handling HTTP event for
> > > process 'slave(682)' with path: '/slave(682)/monitor/statistics'
> > > I0125 15:19:40.826221 25317 http.cpp:874] Authorizing principal
> > > 'test-principal' to GET the '/monitor/statistics' endpoint
> > > I0125 15:19:40.827222 25314 slave.cpp:801] Agent terminating
> > > [       OK ] Endpoint/SlaveEndpointTest.UnauthorizedRequest/0 (19 ms)
> > > [ RUN      ] Endpoint/SlaveEndpointTest.UnauthorizedRequest/1
> > > I0125 15:19:40.833523 25314 containerizer.cpp:220] Using isolation:
> > > posix/cpu,posix/mem,filesystem/posix,network/cni
> > > W0125 15:19:40.833793 25314 backend.cpp:76] Failed to create 'aufs'
> > > backend: AufsBackend requires root privileges
> > > W0125 15:19:40.833835 25314 backend.cpp:76] Failed to create 'bind'
> > > backend: BindBackend requires root privileges
> > > I0125 15:19:40.834928 25316 slave.cpp:209] Mesos agent started on
> (683)@
> > > 172.17.0.3:57726
> > > I0125 15:19:40.834959 25316 slave.cpp:210] Flags at startup: --acls=""
> > > --appc_simple_discovery_uri_prefix="http://"
> > --appc_store_dir="/tmp/mesos/store/appc"
> > > --authenticate_http_readonly="true" --authenticate_http_readwrite=
> "true"
> > > --authenticatee="crammd5" --authentication_backoff_factor="1secs"
> > > --authorizer="local" --cgroups_cpu_enable_pids_and_tids_count="false"
> > > --cgroups_enable_cfs="false" --cgroups_hierarchy="/sys/fs/cgroup"
> > > --cgroups_limit_swap="false" --cgroups_root="mesos"
> > --container_disk_watch_interval="15secs"
> > > --containerizers="mesos" --credential="/tmp/Endpoint_
> SlaveEndpointTest_
> > > UnauthorizedRequest_1_yJ7GrX/credential" --default_role="*"
> > > --disk_watch_interval="1mins" --docker="docker"
> > > --docker_kill_orphans="true" --docker_registry="https://
> > > registry-1.docker.io" --docker_remove_delay="6hrs"
> > > --docker_socket="/var/run/docker.sock" --docker_stop_timeout="0ns"
> > > --docker_store_dir="/tmp/mesos/store/docker"
> --docker_volume_checkpoint_
> > > dir="/var/run/mesos/isolators/docker/volume" --enforce_container_disk_
> > quota="false"
> > > --executor_registration_timeout="1mins" --executor_shutdown_grace_
> > period="5secs"
> > > --fetcher_cache_dir="/tmp/Endpoint_SlaveEndpointTest_
> > > UnauthorizedRequest_1_yJ7GrX/fetch" --fetcher_cache_size="2GB"
> > > --frameworks_home="" --gc_delay="1weeks" --gc_disk_headroom="0.1"
> > > --hadoop_home="" --help="false" --hostname_lookup="true"
> > > --http_authenticators="basic" --http_command_executor="false"
> > > --http_credentials="/tmp/Endpoint_SlaveEndpointTest_
> > > UnauthorizedRequest_1_yJ7GrX/http_credentials"
> > --http_heartbeat_interval="30secs"
> > > --image_provisioner_backend="copy" --initialize_driver_logging="true"
> > > --isolation="posix/cpu,posix/mem" --launcher="posix"
> > > --launcher_dir="/mesos/build/src" --logbufsecs="0"
> > --logging_level="INFO"
> > > --max_completed_executors_per_framework="150"
> > --oversubscribed_resources_interval="15secs"
> > > --perf_duration="10secs" --perf_interval="1mins"
> > > --qos_correction_interval_min="0ns" --quiet="false"
> > --recover="reconnect"
> > > --recovery_timeout="15mins" --registration_backoff_factor="10ms"
> > > --resources="cpus:2;gpus:0;mem:1024;disk:1024;ports:[31000-32000]"
> > > --revocable_cpu_low_priority="true" --runtime_dir="/tmp/Endpoint_
> > > SlaveEndpointTest_UnauthorizedRequest_1_yJ7GrX"
> > --sandbox_directory="/mnt/mesos/sandbox"
> > > --strict="true" --switch_user="true" --systemd_enable_support="true"
> > > --systemd_runtime_directory="/run/systemd/system" --version="false"
> > > --work_dir="/tmp/Endpoint_SlaveEndpointTest_
> > UnauthorizedRequest_1_5d4mXe"
> > > I0125 15:19:40.835235 25316 credentials.hpp:86] Loading credential for
> > > authentication from '/tmp/Endpoint_SlaveEndpointTest_
> > > UnauthorizedRequest_1_yJ7GrX/credential'
> > > I0125 15:19:40.835352 25316 slave.cpp:352] Agent using credential for:
> > > test-principal
> > > I0125 15:19:40.835369 25316 credentials.hpp:37] Loading credentials for
> > > authentication from '/tmp/Endpoint_SlaveEndpointTest_
> > > UnauthorizedRequest_1_yJ7GrX/http_credentials'
> > > I0125 15:19:40.835500 25316 http.cpp:922] Using default 'basic' HTTP
> > > authenticator for realm 'mesos-agent-readonly'
> > > I0125 15:19:40.835577 25316 http.cpp:922] Using default 'basic' HTTP
> > > authenticator for realm 'mesos-agent-readwrite'
> > > I0125 15:19:40.835924 25316 slave.cpp:539] Agent resources: cpus(*):2;
> > > mem(*):1024; disk(*):1024; ports(*):[31000-32000]
> > > I0125 15:19:40.835958 25316 slave.cpp:547] Agent attributes: [  ]
> > > I0125 15:19:40.835965 25316 slave.cpp:552] Agent hostname: 9cdefe4ff6bc
> > > I0125 15:19:40.836328 25316 status_update_manager.cpp:177] Pausing
> > sending
> > > status updates
> > > I0125 15:19:40.836545 25316 state.cpp:60] Recovering state from
> > > '/tmp/Endpoint_SlaveEndpointTest_UnauthorizedRequest_1_5d4mXe/meta'
> > > I0125 15:19:40.836745 25328 status_update_manager.cpp:203] Recovering
> > > status update manager
> > > I0125 15:19:40.836830 25328 containerizer.cpp:599] Recovering
> > containerizer
> > > I0125 15:19:40.837213 25328 provisioner.cpp:251] Provisioner recovery
> > > complete
> > > I0125 15:19:40.837353 25328 slave.cpp:5422] Finished recovery
> > > I0125 15:19:40.837697 25328 slave.cpp:5596] Querying resource estimator
> > > for oversubscribable resources
> > > I0125 15:19:40.837846 25328 slave.cpp:5610] Received oversubscribable
> > > resources {} from the resource estimator
> > > I0125 15:19:40.838846 25324 process.cpp:3697] Handling HTTP event for
> > > process 'slave(683)' with path: '/slave(683)/monitor/statistics.json'
> > > I0125 15:19:40.839184 25324 http.cpp:874] Authorizing principal
> > > 'test-principal' to GET the '/monitor/statistics.json' endpoint
> > > I0125 15:19:40.840384 25314 slave.cpp:801] Agent terminating
> > > [       OK ] Endpoint/SlaveEndpointTest.UnauthorizedRequest/1 (20 ms)
> > > [ RUN      ] Endpoint/SlaveEndpointTest.UnauthorizedRequest/2
> > > I0125 15:19:40.854329 25314 containerizer.cpp:220] Using isolation:
> > > posix/cpu,posix/mem,filesystem/posix,network/cni
> > > W0125 15:19:40.854709 25314 backend.cpp:76] Failed to create 'aufs'
> > > backend: AufsBackend requires root privileges
> > > W0125 15:19:40.854761 25314 backend.cpp:76] Failed to create 'bind'
> > > backend: BindBackend requires root privileges
> > > I0125 15:19:40.856863 25330 slave.cpp:209] Mesos agent started on
> (684)@
> > > 172.17.0.3:57726
> > > I0125 15:19:40.856889 25330 slave.cpp:210] Flags at startup: --acls=""
> > > --appc_simple_discovery_uri_prefix="http://"
> > --appc_store_dir="/tmp/mesos/store/appc"
> > > --authenticate_http_readonly="true" --authenticate_http_readwrite=
> "true"
> > > --authenticatee="crammd5" --authentication_backoff_factor="1secs"
> > > --authorizer="local" --cgroups_cpu_enable_pids_and_tids_count="false"
> > > --cgroups_enable_cfs="false" --cgroups_hierarchy="/sys/fs/cgroup"
> > > --cgroups_limit_swap="false" --cgroups_root="mesos"
> > --container_disk_watch_interval="15secs"
> > > --containerizers="mesos" --credential="/tmp/Endpoint_
> SlaveEndpointTest_
> > > UnauthorizedRequest_2_MyUDzP/credential" --default_role="*"
> > > --disk_watch_interval="1mins" --docker="docker"
> > > --docker_kill_orphans="true" --docker_registry="https://
> > > registry-1.docker.io" --docker_remove_delay="6hrs"
> > > --docker_socket="/var/run/docker.sock" --docker_stop_timeout="0ns"
> > > --docker_store_dir="/tmp/mesos/store/docker"
> --docker_volume_checkpoint_
> > > dir="/var/run/mesos/isolators/docker/volume" --enforce_container_disk_
> > quota="false"
> > > --executor_registration_timeout="1mins" --executor_shutdown_grace_
> > period="5secs"
> > > --fetcher_cache_dir="/tmp/Endpoint_SlaveEndpointTest_
> > > UnauthorizedRequest_2_MyUDzP/fetch" --fetcher_cache_size="2GB"
> > > --frameworks_home="" --gc_delay="1weeks" --gc_disk_headroom="0.1"
> > > --hadoop_home="" --help="false" --hostname_lookup="true"
> > > --http_authenticators="basic" --http_command_executor="false"
> > > --http_credentials="/tmp/Endpoint_SlaveEndpointTest_
> > > UnauthorizedRequest_2_MyUDzP/http_credentials"
> > --http_heartbeat_interval="30secs"
> > > --image_provisioner_backend="copy" --initialize_driver_logging="true"
> > > --isolation="posix/cpu,posix/mem" --launcher="posix"
> > > --launcher_dir="/mesos/build/src" --logbufsecs="0"
> > --logging_level="INFO"
> > > --max_completed_executors_per_framework="150"
> > --oversubscribed_resources_interval="15secs"
> > > --perf_duration="10secs" --perf_interval="1mins"
> > > --qos_correction_interval_min="0ns" --quiet="false"
> > --recover="reconnect"
> > > --recovery_timeout="15mins" --registration_backoff_factor="10ms"
> > > --resources="cpus:2;gpus:0;mem:1024;disk:1024;ports:[31000-32000]"
> > > --revocable_cpu_low_priority="true" --runtime_dir="/tmp/Endpoint_
> > > SlaveEndpointTest_UnauthorizedRequest_2_MyUDzP"
> > --sandbox_directory="/mnt/mesos/sandbox"
> > > --strict="true" --switch_user="true" --systemd_enable_support="true"
> > > --systemd_runtime_directory="/run/systemd/system" --version="false"
> > > --work_dir="/tmp/Endpoint_SlaveEndpointTest_
> > UnauthorizedRequest_2_KQ7Y16"
> > > I0125 15:19:40.857241 25330 credentials.hpp:86] Loading credential for
> > > authentication from '/tmp/Endpoint_SlaveEndpointTest_
> > > UnauthorizedRequest_2_MyUDzP/credential'
> > > I0125 15:19:40.857350 25330 slave.cpp:352] Agent using credential for:
> > > test-principal
> > > I0125 15:19:40.857362 25330 credentials.hpp:37] Loading credentials for
> > > authentication from '/tmp/Endpoint_SlaveEndpointTest_
> > > UnauthorizedRequest_2_MyUDzP/http_credentials'
> > > I0125 15:19:40.857484 25330 http.cpp:922] Using default 'basic' HTTP
> > > authenticator for realm 'mesos-agent-readonly'
> > > I0125 15:19:40.857547 25330 http.cpp:922] Using default 'basic' HTTP
> > > authenticator for realm 'mesos-agent-readwrite'
> > > I0125 15:19:40.857949 25330 slave.cpp:539] Agent resources: cpus(*):2;
> > > mem(*):1024; disk(*):1024; ports(*):[31000-32000]
> > > I0125 15:19:40.857982 25330 slave.cpp:547] Agent attributes: [  ]
> > > I0125 15:19:40.857990 25330 slave.cpp:552] Agent hostname: 9cdefe4ff6bc
> > > I0125 15:19:40.858067 25326 status_update_manager.cpp:177] Pausing
> > sending
> > > status updates
> > > I0125 15:19:40.858455 25330 state.cpp:60] Recovering state from
> > > '/tmp/Endpoint_SlaveEndpointTest_UnauthorizedRequest_2_KQ7Y16/meta'
> > > I0125 15:19:40.858700 25330 status_update_manager.cpp:203] Recovering
> > > status update manager
> > > I0125 15:19:40.858847 25317 containerizer.cpp:599] Recovering
> > containerizer
> > > I0125 15:19:40.859483 25330 provisioner.cpp:251] Provisioner recovery
> > > complete
> > > I0125 15:19:40.859716 25315 slave.cpp:5422] Finished recovery
> > > I0125 15:19:40.860141 25315 slave.cpp:5596] Querying resource estimator
> > > for oversubscribable resources
> > > I0125 15:19:40.860293 25323 slave.cpp:5610] Received oversubscribable
> > > resources {} from the resource estimator
> > > I0125 15:19:40.861191 25330 process.cpp:3697] Handling HTTP event for
> > > process 'slave(684)' with path: '/slave(684)/containers'
> > > I0125 15:19:40.861654 25324 http.cpp:874] Authorizing principal
> > > 'test-principal' to GET the '/containers' endpoint
> > > I0125 15:19:40.862803 25314 slave.cpp:801] Agent terminating
> > > [       OK ] Endpoint/SlaveEndpointTest.UnauthorizedRequest/2 (14 ms)
> > > [ RUN      ] Endpoint/SlaveEndpointTest.NoAuthorizer/0
> > > I0125 15:19:40.867519 25314 containerizer.cpp:220] Using isolation:
> > > posix/cpu,posix/mem,filesystem/posix,network/cni
> > > W0125 15:19:40.867799 25314 backend.cpp:76] Failed to create 'aufs'
> > > backend: AufsBackend requires root privileges
> > > W0125 15:19:40.867840 25314 backend.cpp:76] Failed to create 'bind'
> > > backend: BindBackend requires root privileges
> > > I0125 15:19:40.868559 25314 cluster.cpp:446] Creating default 'local'
> > > authorizer
> > > I0125 15:19:40.869129 25327 slave.cpp:209] Mesos agent started on
> (685)@
> > > 172.17.0.3:57726
> > > I0125 15:19:40.869283 25327 slave.cpp:210] Flags at startup: --acls=""
> > > --appc_simple_discovery_uri_prefix="http://"
> > --appc_store_dir="/tmp/mesos/store/appc"
> > > --authenticate_http_readonly="true" --authenticate_http_readwrite=
> "true"
> > > --authenticatee="crammd5" --authentication_backoff_factor="1secs"
> > > --authorizer="local" --cgroups_cpu_enable_pids_and_tids_count="false"
> > > --cgroups_enable_cfs="false" --cgroups_hierarchy="/sys/fs/cgroup"
> > > --cgroups_limit_swap="false" --cgroups_root="mesos"
> > --container_disk_watch_interval="15secs"
> > > --containerizers="mesos" --credential="/tmp/Endpoint_
> SlaveEndpointTest_
> > > NoAuthorizer_0_tCF3RH/credential" --default_role="*"
> > > --disk_watch_interval="1mins" --docker="docker"
> > > --docker_kill_orphans="true" --docker_registry="https://
> > > registry-1.docker.io" --docker_remove_delay="6hrs"
> > > --docker_socket="/var/run/docker.sock" --docker_stop_timeout="0ns"
> > > --docker_store_dir="/tmp/mesos/store/docker"
> --docker_volume_checkpoint_
> > > dir="/var/run/mesos/isolators/docker/volume" --enforce_container_disk_
> > quota="false"
> > > --executor_registration_timeout="1mins" --executor_shutdown_grace_
> > period="5secs"
> > > --fetcher_cache_dir="/tmp/Endpoint_SlaveEndpointTest_
> > NoAuthorizer_0_tCF3RH/fetch"
> > > --fetcher_cache_size="2GB" --frameworks_home="" --gc_delay="1weeks"
> > > --gc_disk_headroom="0.1" --hadoop_home="" --help="false"
> > > --hostname_lookup="true" --http_authenticators="basic"
> > > --http_command_executor="false" --http_credentials="/tmp/
> > > Endpoint_SlaveEndpointTest_NoAuthorizer_0_tCF3RH/http_credentials"
> > > --http_heartbeat_interval="30secs" --image_provisioner_backend="copy"
> > > --initialize_driver_logging="true" --isolation="posix/cpu,posix/mem"
> > > --launcher="posix" --launcher_dir="/mesos/build/src" --logbufsecs="0"
> > > --logging_level="INFO" --max_completed_executors_per_framework="150"
> > > --oversubscribed_resources_interval="15secs" --perf_duration="10secs"
> > > --perf_interval="1mins" --qos_correction_interval_min="0ns"
> > > --quiet="false" --recover="reconnect" --recovery_timeout="15mins"
> > > --registration_backoff_factor="10ms" --resources="cpus:2;gpus:0;
> > > mem:1024;disk:1024;ports:[31000-32000]" --revocable_cpu_low_priority="
> > true"
> > > --runtime_dir="/tmp/Endpoint_SlaveEndpointTest_NoAuthorizer_0_tCF3RH"
> > > --sandbox_directory="/mnt/mesos/sandbox" --strict="true"
> > > --switch_user="true" --systemd_enable_support="true"
> > > --systemd_runtime_directory="/run/systemd/system" --version="false"
> > > --work_dir="/tmp/Endpoint_SlaveEndpointTest_NoAuthorizer_0_t7J9hZ"
> > > I0125 15:19:40.869593 25327 credentials.hpp:86] Loading credential for
> > > authentication from '/tmp/Endpoint_SlaveEndpointTest_
> > > NoAuthorizer_0_tCF3RH/credential'
> > > I0125 15:19:40.869678 25327 slave.cpp:352] Agent using credential for:
> > > test-principal
> > > I0125 15:19:40.869688 25327 credentials.hpp:37] Loading credentials for
> > > authentication from '/tmp/Endpoint_SlaveEndpointTest_
> > > NoAuthorizer_0_tCF3RH/http_credentials'
> > > I0125 15:19:40.869824 25327 http.cpp:922] Using default 'basic' HTTP
> > > authenticator for realm 'mesos-agent-readonly'
> > > I0125 15:19:40.869874 25327 http.cpp:922] Using default 'basic' HTTP
> > > authenticator for realm 'mesos-agent-readwrite'
> > > I0125 15:19:40.870251 25327 slave.cpp:539] Agent resources: cpus(*):2;
> > > mem(*):1024; disk(*):1024; ports(*):[31000-32000]
> > > I0125 15:19:40.870282 25327 slave.cpp:547] Agent attributes: [  ]
> > > I0125 15:19:40.870287 25327 slave.cpp:552] Agent hostname: 9cdefe4ff6bc
> > > I0125 15:19:40.870565 25330 status_update_manager.cpp:177] Pausing
> > sending
> > > status updates
> > > I0125 15:19:40.870998 25317 state.cpp:60] Recovering state from
> > > '/tmp/Endpoint_SlaveEndpointTest_NoAuthorizer_0_t7J9hZ/meta'
> > > I0125 15:19:40.871481 25327 status_update_manager.cpp:203] Recovering
> > > status update manager
> > > I0125 15:19:40.871606 25317 containerizer.cpp:599] Recovering
> > containerizer
> > > I0125 15:19:40.872221 25317 provisioner.cpp:251] Provisioner recovery
> > > complete
> > > I0125 15:19:40.872437 25317 slave.cpp:5422] Finished recovery
> > > I0125 15:19:40.873061 25317 slave.cpp:5596] Querying resource estimator
> > > for oversubscribable resources
> > > I0125 15:19:40.873262 25317 slave.cpp:5610] Received oversubscribable
> > > resources {} from the resource estimator
> > > I0125 15:19:40.877560 25324 process.cpp:3697] Handling HTTP event for
> > > process 'slave(685)' with path: '/slave(685)/monitor/statistics'
> > > I0125 15:19:40.878199 25324 http.cpp:874] Authorizing principal
> > > 'test-principal' to GET the '/monitor/statistics' endpoint
> > > I0125 15:19:40.880156 25327 slave.cpp:801] Agent terminating
> > > [       OK ] Endpoint/SlaveEndpointTest.NoAuthorizer/0 (25 ms)
> > > [ RUN      ] Endpoint/SlaveEndpointTest.NoAuthorizer/1
> > > I0125 15:19:40.893913 25314 containerizer.cpp:220] Using isolation:
> > > posix/cpu,posix/mem,filesystem/posix,network/cni
> > > W0125 15:19:40.894332 25314 backend.cpp:76] Failed to create 'aufs'
> > > backend: AufsBackend requires root privileges
> > > W0125 15:19:40.894373 25314 backend.cpp:76] Failed to create 'bind'
> > > backend: BindBackend requires root privileges
> > > I0125 15:19:40.895174 25314 cluster.cpp:446] Creating default 'local'
> > > authorizer
> > > I0125 15:19:40.896224 25323 slave.cpp:209] Mesos agent started on
> (686)@
> > > 172.17.0.3:57726
> > > I0125 15:19:40.896489 25323 slave.cpp:210] Flags at startup: --acls=""
> > > --appc_simple_discovery_uri_prefix="http://"
> > --appc_store_dir="/tmp/mesos/store/appc"
> > > --authenticate_http_readonly="true" --authenticate_http_readwrite=
> "true"
> > > --authenticatee="crammd5" --authentication_backoff_factor="1secs"
> > > --authorizer="local" --cgroups_cpu_enable_pids_and_tids_count="false"
> > > --cgroups_enable_cfs="false" --cgroups_hierarchy="/sys/fs/cgroup"
> > > --cgroups_limit_swap="false" --cgroups_root="mesos"
> > --container_disk_watch_interval="15secs"
> > > --containerizers="mesos" --credential="/tmp/Endpoint_
> SlaveEndpointTest_
> > > NoAuthorizer_1_p4O4oA/credential" --default_role="*"
> > > --disk_watch_interval="1mins" --docker="docker"
> > > --docker_kill_orphans="true" --docker_registry="https://
> > > registry-1.docker.io" --docker_remove_delay="6hrs"
> > > --docker_socket="/var/run/docker.sock" --docker_stop_timeout="0ns"
> > > --docker_store_dir="/tmp/mesos/store/docker"
> --docker_volume_checkpoint_
> > > dir="/var/run/mesos/isolators/docker/volume" --enforce_container_disk_
> > quota="false"
> > > --executor_registration_timeout="1mins" --executor_shutdown_grace_
> > period="5secs"
> > > --fetcher_cache_dir="/tmp/Endpoint_SlaveEndpointTest_
> > NoAuthorizer_1_p4O4oA/fetch"
> > > --fetcher_cache_size="2GB" --frameworks_home="" --gc_delay="1weeks"
> > > --gc_disk_headroom="0.1" --hadoop_home="" --help="false"
> > > --hostname_lookup="true" --http_authenticators="basic"
> > > --http_command_executor="false" --http_credentials="/tmp/
> > > Endpoint_SlaveEndpointTest_NoAuthorizer_1_p4O4oA/http_credentials"
> > > --http_heartbeat_interval="30secs" --image_provisioner_backend="copy"
> > > --initialize_driver_logging="true" --isolation="posix/cpu,posix/mem"
> > > --launcher="posix" --launcher_dir="/mesos/build/src" --logbufsecs="0"
> > > --logging_level="INFO" --max_completed_executors_per_framework="150"
> > > --oversubscribed_resources_interval="15secs" --perf_duration="10secs"
> > > --perf_interval="1mins" --qos_correction_interval_min="0ns"
> > > --quiet="false" --recover="reconnect" --recovery_timeout="15mins"
> > > --registration_backoff_factor="10ms" --resources="cpus:2;gpus:0;
> > > mem:1024;disk:1024;ports:[31000-32000]" --revocable_cpu_low_priority="
> > true"
> > > --runtime_dir="/tmp/Endpoint_SlaveEndpointTest_NoAuthorizer_1_p4O4oA"
> > > --sandbox_directory="/mnt/mesos/sandbox" --strict="true"
> > > --switch_user="true" --systemd_enable_support="true"
> > > --systemd_runtime_directory="/run/systemd/system" --version="false"
> > > --work_dir="/tmp/Endpoint_SlaveEndpointTest_NoAuthorizer_1_lSTXKR"
> > > I0125 15:19:40.897167 25323 credentials.hpp:86] Loading credential for
> > > authentication from '/tmp/Endpoint_SlaveEndpointTest_
> > > NoAuthorizer_1_p4O4oA/credential'
> > > I0125 15:19:40.897469 25323 slave.cpp:352] Agent using credential for:
> > > test-principal
> > > I0125 15:19:40.897675 25323 credentials.hpp:37] Loading credentials for
> > > authentication from '/tmp/Endpoint_SlaveEndpointTest_
> > > NoAuthorizer_1_p4O4oA/http_credentials'
> > > I0125 15:19:40.897963 25323 http.cpp:922] Using default 'basic' HTTP
> > > authenticator for realm 'mesos-agent-readonly'
> > > I0125 15:19:40.898180 25323 http.cpp:922] Using default 'basic' HTTP
> > > authenticator for realm 'mesos-agent-readwrite'
> > > I0125 15:19:40.898782 25323 slave.cpp:539] Agent resources: cpus(*):2;
> > > mem(*):1024; disk(*):1024; ports(*):[31000-32000]
> > > I0125 15:19:40.898993 25323 slave.cpp:547] Agent attributes: [  ]
> > > I0125 15:19:40.899157 25323 slave.cpp:552] Agent hostname: 9cdefe4ff6bc
> > > I0125 15:19:40.899389 25325 status_update_manager.cpp:177] Pausing
> > sending
> > > status updates
> > > I0125 15:19:40.899919 25330 state.cpp:60] Recovering state from
> > > '/tmp/Endpoint_SlaveEndpointTest_NoAuthorizer_1_lSTXKR/meta'
> > > I0125 15:19:40.900063 25330 status_update_manager.cpp:203] Recovering
> > > status update manager
> > > I0125 15:19:40.900123 25330 containerizer.cpp:599] Recovering
> > containerizer
> > > I0125 15:19:40.900602 25330 provisioner.cpp:251] Provisioner recovery
> > > complete
> > > I0125 15:19:40.900789 25330 slave.cpp:5422] Finished recovery
> > > I0125 15:19:40.901453 25330 slave.cpp:5596] Querying resource estimator
> > > for oversubscribable resources
> > > I0125 15:19:40.901562 25330 slave.cpp:5610] Received oversubscribable
> > > resources {} from the resource estimator
> > > I0125 15:19:40.902701 25315 process.cpp:3697] Handling HTTP event for
> > > process 'slave(686)' with path: '/slave(686)/monitor/statistics.json'
> > > I0125 15:19:40.903359 25315 http.cpp:874] Authorizing principal
> > > 'test-principal' to GET the '/monitor/statistics.json' endpoint
> > > I0125 15:19:40.909018 25317 slave.cpp:801] Agent terminating
> > > [       OK ] Endpoint/SlaveEndpointTest.NoAuthorizer/1 (21 ms)
> > > [ RUN      ] Endpoint/SlaveEndpointTest.NoAuthorizer/2
> > > I0125 15:19:40.916205 25314 containerizer.cpp:220] Using isolation:
> > > posix/cpu,posix/mem,filesystem/posix,network/cni
> > > W0125 15:19:40.916726 25314 backend.cpp:76] Failed to create 'aufs'
> > > backend: AufsBackend requires root privileges
> > > W0125 15:19:40.916777 25314 backend.cpp:76] Failed to create 'bind'
> > > backend: BindBackend requires root privileges
> > > I0125 15:19:40.917815 25314 cluster.cpp:446] Creating default 'local'
> > > authorizer
> > > I0125 15:19:40.918803 25317 slave.cpp:209] Mesos agent started on
> (687)@
> > > 172.17.0.3:57726
> > > I0125 15:19:40.918835 25317 slave.cpp:210] Flags at startup: --acls=""
> > > --appc_simple_discovery_uri_prefix="http://"
> > --appc_store_dir="/tmp/mesos/store/appc"
> > > --authenticate_http_readonly="true" --authenticate_http_readwrite=
> "true"
> > > --authenticatee="crammd5" --authentication_backoff_factor="1secs"
> > > --authorizer="local" --cgroups_cpu_enable_pids_and_tids_count="false"
> > > --cgroups_enable_cfs="false" --cgroups_hierarchy="/sys/fs/cgroup"
> > > --cgroups_limit_swap="false" --cgroups_root="mesos"
> > --container_disk_watch_interval="15secs"
> > > --containerizers="mesos" --credential="/tmp/Endpoint_
> SlaveEndpointTest_
> > > NoAuthorizer_2_pf7kbt/credential" --default_role="*"
> > > --disk_watch_interval="1mins" --docker="docker"
> > > --docker_kill_orphans="true" --docker_registry="https://
> > > registry-1.docker.io" --docker_remove_delay="6hrs"
> > > --docker_socket="/var/run/docker.sock" --docker_stop_timeout="0ns"
> > > --docker_store_dir="/tmp/mesos/store/docker"
> --docker_volume_checkpoint_
> > > dir="/var/run/mesos/isolators/docker/volume" --enforce_container_disk_
> > quota="false"
> > > --executor_registration_timeout="1mins" --executor_shutdown_grace_
> > period="5secs"
> > > --fetcher_cache_dir="/tmp/Endpoint_SlaveEndpointTest_
> > NoAuthorizer_2_pf7kbt/fetch"
> > > --fetcher_cache_size="2GB" --frameworks_home="" --gc_delay="1weeks"
> > > --gc_disk_headroom="0.1" --hadoop_home="" --help="false"
> > > --hostname_lookup="true" --http_authenticators="basic"
> > > --http_command_executor="false" --http_credentials="/tmp/
> > > Endpoint_SlaveEndpointTest_NoAuthorizer_2_pf7kbt/http_credentials"
> > > --http_heartbeat_interval="30secs" --image_provisioner_backend="copy"
> > > --initialize_driver_logging="true" --isolation="posix/cpu,posix/mem"
> > > --launcher="posix" --launcher_dir="/mesos/build/src" --logbufsecs="0"
> > > --logging_level="INFO" --max_completed_executors_per_framework="150"
> > > --oversubscribed_resources_interval="15secs" --perf_duration="10secs"
> > > --perf_interval="1mins" --qos_correction_interval_min="0ns"
> > > --quiet="false" --recover="reconnect" --recovery_timeout="15mins"
> > > --registration_backoff_factor="10ms" --resources="cpus:2;gpus:0;
> > > mem:1024;disk:1024;ports:[31000-32000]" --revocable_cpu_low_priority="
> > true"
> > > --runtime_dir="/tmp/Endpoint_SlaveEndpointTest_NoAuthorizer_2_pf7kbt"
> > > --sandbox_directory="/mnt/mesos/sandbox" --strict="true"
> > > --switch_user="true" --systemd_enable_support="true"
> > > --systemd_runtime_directory="/run/systemd/system" --version="false"
> > > --work_dir="/tmp/Endpoint_SlaveEndpointTest_NoAuthorizer_2_4paFtK"
> > > I0125 15:19:40.919351 25317 credentials.hpp:86] Loading credential for
> > > authentication from '/tmp/Endpoint_SlaveEndpointTest_
> > > NoAuthorizer_2_pf7kbt/credential'
> > > I0125 15:19:40.919473 25317 slave.cpp:352] Agent using credential for:
> > > test-principal
> > > I0125 15:19:40.919492 25317 credentials.hpp:37] Loading credentials for
> > > authentication from '/tmp/Endpoint_SlaveEndpointTest_
> > > NoAuthorizer_2_pf7kbt/http_credentials'
> > > I0125 15:19:40.919984 25317 http.cpp:922] Using default 'basic' HTTP
> > > authenticator for realm 'mesos-agent-readonly'
> > > I0125 15:19:40.920052 25317 http.cpp:922] Using default 'basic' HTTP
> > > authenticator for realm 'mesos-agent-readwrite'
> > > I0125 15:19:40.920728 25317 slave.cpp:539] Agent resources: cpus(*):2;
> > > mem(*):1024; disk(*):1024; ports(*):[31000-32000]
> > > I0125 15:19:40.920778 25317 slave.cpp:547] Agent attributes: [  ]
> > > I0125 15:19:40.920784 25317 slave.cpp:552] Agent hostname: 9cdefe4ff6bc
> > > I0125 15:19:40.920862 25328 status_update_manager.cpp:177] Pausing
> > sending
> > > status updates
> > > I0125 15:19:40.921483 25320 state.cpp:60] Recovering state from
> > > '/tmp/Endpoint_SlaveEndpointTest_NoAuthorizer_2_4paFtK/meta'
> > > I0125 15:19:40.921725 25317 status_update_manager.cpp:203] Recovering
> > > status update manager
> > > I0125 15:19:40.921974 25317 containerizer.cpp:599] Recovering
> > containerizer
> > > I0125 15:19:40.922626 25317 provisioner.cpp:251] Provisioner recovery
> > > complete
> > > I0125 15:19:40.922874 25317 slave.cpp:5422] Finished recovery
> > > I0125 15:19:40.923377 25317 slave.cpp:5596] Querying resource estimator
> > > for oversubscribable resources
> > > I0125 15:19:40.923647 25319 slave.cpp:5610] Received oversubscribable
> > > resources {} from the resource estimator
> > > I0125 15:19:40.924717 25316 process.cpp:3697] Handling HTTP event for
> > > process 'slave(687)' with path: '/slave(687)/containers'
> > > I0125 15:19:40.925271 25316 http.cpp:874] Authorizing principal
> > > 'test-principal' to GET the '/containers' endpoint
> > > I0125 15:19:40.929024 25329 slave.cpp:801] Agent terminating
> > > [       OK ] Endpoint/SlaveEndpointTest.NoAuthorizer/2 (22 ms)
> > > [----------] 9 tests from Endpoint/SlaveEndpointTest (177 ms total)
> > >
> > > [----------] Global test environment tear-down
> > > [==========] 1413 tests from 158 test cases ran. (208033 ms total)
> > > [  PASSED  ] 1412 tests.
> > > [  FAILED  ] 1 test, listed below:
> > > [  FAILED  ] PartitionTest.TaskCompletedOnPartitionedAgent
> > >
> > >  1 FAILED TEST
> > >   YOU HAVE 14 DISABLED TESTS
> > >
> > > make[3]: *** [CMakeFiles/check] Error 1
> > > make[3]: Leaving directory `/mesos/build'
> > > make[2]: Leaving directory `/mesos/build'
> > > make[2]: *** [CMakeFiles/check.dir/all] Error 2
> > > make[1]: *** [CMakeFiles/check.dir/rule] Error 2
> > > make[1]: Leaving directory `/mesos/build'
> > > make: *** [check] Error 2
> > > + docker rmi mesos-1485355251-32416
> > > Untagged: mesos-1485355251-32416:latest
> > > Deleted: sha256:e48244351ca5a478f4701f5c3ea733
> > > 1dd323d3661e0f8b46c1d440bbf3a522e9
> > > Deleted: sha256:bc7bc0917893f0d3c4f40e9254191c
> > > 60e78563a926b70a6a6cb1a8aa460b3784
> > > Deleted: sha256:60b943a6e8af5fe19c27294cac6b20
> > > 52f924a66332e38e7989240eaeb90ca3fb
> > > Deleted: sha256:df84976be40ca83ceb255139e94fd5
> > > 6b004561320571366f57c074198e56abd0
> > > Deleted: sha256:2f1f8bcfd95319bf404d79d44059c7
> > > e25ddb134391a50e7cdc7841800c7ac5a3
> > > Deleted: sha256:d17ca227a65f939c637e86b5512070
> > > 4717dfb6274519a12d29b9c221abd4d46b
> > > Deleted: sha256:00baf44934f00058d026ce767a35a6
> > > b0b0ab042b100f0dc23a73be6097b0abee
> > > Deleted: sha256:8637d2334d9f45edafc240c28188d9
> > > 302902d4139dab62f3ff037073f2a9a68b
> > > Deleted: sha256:8fb4db8d679c5a2d405d36ad258feb
> > > 72e860120c880969fd23d44ea61f553a12
> > > Deleted: sha256:fc85e937d93b33693190bd861315bd
> > > bad8ee3bda42fcbe7ec2f1ee441b04dab5
> > > Deleted: sha256:c28432b51172994ab677f347b2d48f
> > > 157f433698dd4c0a7f76cc1387bbf14c3d
> > > Deleted: sha256:fce18fd7ba4e97f39901b36ae14315
> > > 8b0250e36f8c1b3118824dfaf1b3680cec
> > > Deleted: sha256:eb9e6910703f479a2cef79122ec046
> > > fe82fe09232fbc99ea08991c9064b66428
> > > Deleted: sha256:7589c5ed686561a65bdec43eb65fc7
> > > 0ff45c46f6cc79db3b1406b9a1ed72ded5
> > > Deleted: sha256:07bcf7c429ae894ff8dbc3aa4c6f69
> > > bf94a43ffc5e583fa3fb2f5df73d9dd16e
> > > Deleted: sha256:7a8e9437e35ba5b573b5fb085a9121
> > > 567a651078d8785255a99bb60206101b42
> > > Deleted: sha256:a323d7d80ae8b53353380cb3f40814
> > > 308c783a3c25624dcec64a55dc9cfe0b53
> > > Deleted: sha256:e8d738a5e7c54efa439ac96541fd82
> > > 7c7268317f9cf745ced62e8a4d523bc445
> > > Deleted: sha256:95714d06120901fc509416d74df3cd
> > > ccecf9325857e0e4b426dc7a504c3ceb4f
> > > Deleted: sha256:4f717684cdb699d557c63af1ea6772
> > > 9bb06f752727d93f97f59a27c3d5539cbc
> > > Deleted: sha256:1e4d092380172e71af749f5885b759
> > > a53fc928a9317cd35b1d6105f430391de1
> > > Deleted: sha256:59b6b964d43fd55323acd62ee4547f
> > > 4d5531f9240d47f6410e78fa0a46768204
> > > Deleted: sha256:f21e87adeaa0c4d0473ff7f75fea81
> > > 94c1ca26c03cbcad27552702fa4c97ba5f
> > > Deleted: sha256:4b03d5c9bd08376561564c43cca00f
> > > de72ecc344757071a48361dbdf9a9cd168
> > > Build step 'Execute shell' marked build as failure
> > >
> >
>

Mime
  • Unnamed multipart/alternative (inline, None, 0 bytes)
View raw message