mesos-builds mailing list archives

Site index · List index
Message view « Date » · « Thread »
Top « Date » · « Thread »
From Apache Jenkins Server <jenk...@builds.apache.org>
Subject Build failed in Jenkins: Mesos » cmake,clang,--verbose --enable-libevent --enable-ssl,GLOG_v=1 MESOS_VERBOSE=1,ubuntu:14.04,(docker||Hadoop)&&(!ubuntu-us1)&&(!ubuntu-6)&&(!ubuntu-eu2) #3100
Date Wed, 11 Jan 2017 01:09:55 GMT
See <https://builds.apache.org/job/Mesos/BUILDTOOL=cmake,COMPILER=clang,CONFIGURATION=--verbose%20--enable-libevent%20--enable-ssl,ENVIRONMENT=GLOG_v=1%20MESOS_VERBOSE=1,OS=ubuntu%3A14.04,label_exp=(docker%7C%7CHadoop)&&(!ubuntu-us1)&&(!ubuntu-6)&&(!ubuntu-eu2)/3100/changes>

Changes:

[bmahler] Fixed a bug in URL::parse().

[anand] Fixed a bug in the default executor around not committing suicide.

[anand] Added MESOS-6848 to CHANGELOG for 1.1.1.

[mpark] Used `jsonify` in `operator<<` for `JSON::*` to reduce duplicate code.

[mpark] Fixed wrong float serialization in JSON in locales different from C.

------------------------------------------
[...truncated 8249 lines...]
make[3]: Leaving directory `/mesos/build'
/usr/bin/cmake -E cmake_progress_report /mesos/build/CMakeFiles  83 84 85
[ 38%] Built target process-0.0.1
make -f src/CMakeFiles/mesos-1.2.0.dir/build.make src/CMakeFiles/mesos-1.2.0.dir/depend
make -f 3rdparty/libprocess/src/tests/CMakeFiles/test-linkee.dir/build.make 3rdparty/libprocess/src/tests/CMakeFiles/test-linkee.dir/depend
make[3]: Entering directory `/mesos/build'
cd /mesos/build && /usr/bin/cmake -E cmake_depends "Unix Makefiles" /mesos /mesos/3rdparty/libprocess/src/tests /mesos/build /mesos/build/3rdparty/libprocess/src/tests /mesos/build/3rdparty/libprocess/src/tests/CMakeFiles/test-linkee.dir/DependInfo.cmake --color=
make[3]: Entering directory `/mesos/build'
cd /mesos/build && /usr/bin/cmake -E cmake_depends "Unix Makefiles" /mesos /mesos/src /mesos/build /mesos/build/src /mesos/build/src/CMakeFiles/mesos-1.2.0.dir/DependInfo.cmake --color=
Scanning dependencies of target test-linkee
make[3]: Leaving directory `/mesos/build'
make -f 3rdparty/libprocess/src/tests/CMakeFiles/test-linkee.dir/build.make 3rdparty/libprocess/src/tests/CMakeFiles/test-linkee.dir/build
make[3]: Entering directory `/mesos/build'
/usr/bin/cmake -E cmake_progress_report /mesos/build/CMakeFiles 
[ 38%] Building CXX object 3rdparty/libprocess/src/tests/CMakeFiles/test-linkee.dir/test_linkee.cpp.o
cd /mesos/build/3rdparty/libprocess/src/tests && /usr/bin/clang++-3.5   -DBUILD_DIR=\"/mesos/build/3rdparty/libprocess/src/tests\" -DHAS_AUTHENTICATION=1 -DLIBDIR=\"/usr/local/libmesos\" -DPICOJSON_USE_INT64 -DPKGDATADIR=\"/usr/local/share/mesos\" -DPKGLIBEXECDIR=\"/usr/local/libexec/mesos\" -DVERSION=\"1.2.0\" -D__STDC_FORMAT_MACROS -O2 -std=c++11 -g -fPIE -I/mesos/3rdparty/libprocess/src/tests/.. -I/mesos/3rdparty/stout/include -I/usr/include/apr-1.0 -I/mesos/build/3rdparty/boost-1.53.0/src/boost-1.53.0 -I/mesos/build/3rdparty/elfio-3.2/src/elfio-3.2 -I/mesos/build/3rdparty/glog-0.3.3/src/glog-0.3.3-lib/lib/include -I/mesos/build/3rdparty/nvml-352.79/src/nvml-352.79 -I/mesos/build/3rdparty/picojson-1.3.0/src/picojson-1.3.0 -I/mesos/build/3rdparty/protobuf-2.6.1/src/protobuf-2.6.1-lib/lib/include -I/usr/include/subversion-1 -I/mesos/3rdparty/libprocess/src/tests/src -I/mesos/3rdparty/libprocess/include -I/mesos/build/3rdparty/http_parser-2.6.2/src/http_parser-2.6.2 -I/mesos/build/3rdparty/libevent-2.1.5-beta/src/libevent-2.1.5-beta-lib/lib/include -I/mesos/build/3rdparty/gmock-1.7.0/src/gmock-1.7.0/include -I/mesos/build/3rdparty/gmock-1.7.0/src/gmock-1.7.0/gtest/include    -o CMakeFiles/test-linkee.dir/test_linkee.cpp.o -c /mesos/3rdparty/libprocess/src/tests/test_linkee.cpp
Scanning dependencies of target mesos-1.2.0
make[3]: Leaving directory `/mesos/build'
make -f src/CMakeFiles/mesos-1.2.0.dir/build.make src/CMakeFiles/mesos-1.2.0.dir/build
make[3]: Entering directory `/mesos/build'
/usr/bin/cmake -E cmake_progress_report /mesos/build/CMakeFiles 
[ 38%] /usr/bin/cmake -E cmake_progress_report /mesos/build/CMakeFiles 15
/usr/bin/cmake -E cmake_progress_report /mesos/build/CMakeFiles 
/usr/bin/cmake -E cmake_progress_report /mesos/build/CMakeFiles 
[ 39%] Building CXX object src/CMakeFiles/mesos-1.2.0.dir/slave/constants.cpp.o
[ 39%] cd /mesos/build/src && /usr/bin/clang++-3.5   -DBUILD_DATE="\"2016-3-3 10:20\"" -DBUILD_FLAGS=\"\" -DBUILD_JAVA_JVM_LIBRARY=\"\" -DBUILD_TIME=\"1111100\" -DBUILD_USER=\"frank\" -DHAS_AUTHENTICATION=1 -DLIBDIR=\"/usr/local/libmesos\" -DPICOJSON_USE_INT64 -DPKGDATADIR=\"/usr/local/share/mesos\" -DPKGLIBEXECDIR=\"/usr/local/libexec/mesos\" -DUSE_STATIC_LIB -DVERSION=\"1.2.0\" -D__STDC_FORMAT_MACROS -Dmesos_1_2_0_EXPORTS -O2 -std=c++11 -g -fPIC -I/mesos/build/include -I/mesos/build/include/mesos -I/mesos/build/src -I/mesos/src -I/mesos/build/3rdparty/protobuf-2.6.1/src/protobuf-2.6.1-lib/lib/include -I/mesos/include -I/mesos/3rdparty/stout/include -I/usr/include/apr-1.0 -I/mesos/build/3rdparty/boost-1.53.0/src/boost-1.53.0 -I/mesos/build/3rdparty/elfio-3.2/src/elfio-3.2 -I/mesos/build/3rdparty/glog-0.3.3/src/glog-0.3.3-lib/lib/include -I/mesos/build/3rdparty/nvml-352.79/src/nvml-352.79 -I/mesos/build/3rdparty/picojson-1.3.0/src/picojson-1.3.0 -I/usr/include/subversion-1 -I/mesos/src/src -I/mesos/3rdparty/libprocess/include -I/mesos/build/3rdparty/http_parser-2.6.2/src/http_parser-2.6.2 -I/mesos/build/3rdparty/libevent-2.1.5-beta/src/libevent-2.1.5-beta-lib/lib/include -I/mesos/build/3rdparty/zookeeper-3.4.8/src/zookeeper-3.4.8/src/c/include -I/mesos/build/3rdparty/zookeeper-3.4.8/src/zookeeper-3.4.8/src/c/generated -I/mesos/build/3rdparty/leveldb-1.4/src/leveldb-1.4/include    -o CMakeFiles/mesos-1.2.0.dir/slave/constants.cpp.o -c /mesos/src/slave/constants.cpp
/usr/bin/cmake -E cmake_progress_report /mesos/build/CMakeFiles 
[ 39%] [ 39%] Building CXX object src/CMakeFiles/mesos-1.2.0.dir/slave/gc.cpp.o
Building CXX object src/CMakeFiles/mesos-1.2.0.dir/slave/container_logger.cpp.o
cd /mesos/build/src && /usr/bin/clang++-3.5   -DBUILD_DATE="\"2016-3-3 10:20\"" -DBUILD_FLAGS=\"\" -DBUILD_JAVA_JVM_LIBRARY=\"\" -DBUILD_TIME=\"1111100\" -DBUILD_USER=\"frank\" -DHAS_AUTHENTICATION=1 -DLIBDIR=\"/usr/local/libmesos\" -DPICOJSON_USE_INT64 -DPKGDATADIR=\"/usr/local/share/mesos\" -DPKGLIBEXECDIR=\"/usr/local/libexec/mesos\" -DUSE_STATIC_LIB -DVERSION=\"1.2.0\" -D__STDC_FORMAT_MACROS -Dmesos_1_2_0_EXPORTS -O2 -std=c++11 -g -fPIC -I/mesos/build/include -I/mesos/build/include/mesos -I/mesos/build/src -I/mesos/src -I/mesos/build/3rdparty/protobuf-2.6.1/src/protobuf-2.6.1-lib/lib/include -I/mesos/include -I/mesos/3rdparty/stout/include -I/usr/include/apr-1.0 -I/mesos/build/3rdparty/boost-1.53.0/src/boost-1.53.0 -I/mesos/build/3rdparty/elfio-3.2/src/elfio-3.2 -I/mesos/build/3rdparty/glog-0.3.3/src/glog-0.3.3-lib/lib/include -I/mesos/build/3rdparty/nvml-352.79/src/nvml-352.79 -I/mesos/build/3rdparty/picojson-1.3.0/src/picojson-1.3.0 -I/usr/include/subversion-1 -I/mesos/src/src -I/mesos/3rdparty/libprocess/include -I/mesos/build/3rdparty/http_parser-2.6.2/src/http_parser-2.6.2 -I/mesos/build/3rdparty/libevent-2.1.5-beta/src/libevent-2.1.5-beta-lib/lib/include -I/mesos/build/3rdparty/zookeeper-3.4.8/src/zookeeper-3.4.8/src/c/include -I/mesos/build/3rdparty/zookeeper-3.4.8/src/zookeeper-3.4.8/src/c/generated -I/mesos/build/3rdparty/leveldb-1.4/src/leveldb-1.4/include    -o CMakeFiles/mesos-1.2.0.dir/slave/gc.cpp.o -c /mesos/src/slave/gc.cpp
Building CXX object src/CMakeFiles/mesos-1.2.0.dir/slave/flags.cpp.o
cd /mesos/build/src && /usr/bin/clang++-3.5   -DBUILD_DATE="\"2016-3-3 10:20\"" -DBUILD_FLAGS=\"\" -DBUILD_JAVA_JVM_LIBRARY=\"\" -DBUILD_TIME=\"1111100\" -DBUILD_USER=\"frank\" -DHAS_AUTHENTICATION=1 -DLIBDIR=\"/usr/local/libmesos\" -DPICOJSON_USE_INT64 -DPKGDATADIR=\"/usr/local/share/mesos\" -DPKGLIBEXECDIR=\"/usr/local/libexec/mesos\" -DUSE_STATIC_LIB -DVERSION=\"1.2.0\" -D__STDC_FORMAT_MACROS -Dmesos_1_2_0_EXPORTS -O2 -std=c++11 -g -fPIC -I/mesos/build/include -I/mesos/build/include/mesos -I/mesos/build/src -I/mesos/src -I/mesos/build/3rdparty/protobuf-2.6.1/src/protobuf-2.6.1-lib/lib/include -I/mesos/include -I/mesos/3rdparty/stout/include -I/usr/include/apr-1.0 -I/mesos/build/3rdparty/boost-1.53.0/src/boost-1.53.0 -I/mesos/build/3rdparty/elfio-3.2/src/elfio-3.2 -I/mesos/build/3rdparty/glog-0.3.3/src/glog-0.3.3-lib/lib/include -I/mesos/build/3rdparty/nvml-352.79/src/nvml-352.79 -I/mesos/build/3rdparty/picojson-1.3.0/src/picojson-1.3.0 -I/usr/include/subversion-1 -I/mesos/src/src -I/mesos/3rdparty/libprocess/include -I/mesos/build/3rdparty/http_parser-2.6.2/src/http_parser-2.6.2 -I/mesos/build/3rdparty/libevent-2.1.5-beta/src/libevent-2.1.5-beta-lib/lib/include -I/mesos/build/3rdparty/zookeeper-3.4.8/src/zookeeper-3.4.8/src/c/include -I/mesos/build/3rdparty/zookeeper-3.4.8/src/zookeeper-3.4.8/src/c/generated -I/mesos/build/3rdparty/leveldb-1.4/src/leveldb-1.4/include    -o CMakeFiles/mesos-1.2.0.dir/slave/container_logger.cpp.o -c /mesos/src/slave/container_logger.cpp
cd /mesos/build/src && /usr/bin/clang++-3.5   -DBUILD_DATE="\"2016-3-3 10:20\"" -DBUILD_FLAGS=\"\" -DBUILD_JAVA_JVM_LIBRARY=\"\" -DBUILD_TIME=\"1111100\" -DBUILD_USER=\"frank\" -DHAS_AUTHENTICATION=1 -DLIBDIR=\"/usr/local/libmesos\" -DPICOJSON_USE_INT64 -DPKGDATADIR=\"/usr/local/share/mesos\" -DPKGLIBEXECDIR=\"/usr/local/libexec/mesos\" -DUSE_STATIC_LIB -DVERSION=\"1.2.0\" -D__STDC_FORMAT_MACROS -Dmesos_1_2_0_EXPORTS -O2 -std=c++11 -g -fPIC -I/mesos/build/include -I/mesos/build/include/mesos -I/mesos/build/src -I/mesos/src -I/mesos/build/3rdparty/protobuf-2.6.1/src/protobuf-2.6.1-lib/lib/include -I/mesos/include -I/mesos/3rdparty/stout/include -I/usr/include/apr-1.0 -I/mesos/build/3rdparty/boost-1.53.0/src/boost-1.53.0 -I/mesos/build/3rdparty/elfio-3.2/src/elfio-3.2 -I/mesos/build/3rdparty/glog-0.3.3/src/glog-0.3.3-lib/lib/include -I/mesos/build/3rdparty/nvml-352.79/src/nvml-352.79 -I/mesos/build/3rdparty/picojson-1.3.0/src/picojson-1.3.0 -I/usr/include/subversion-1 -I/mesos/src/src -I/mesos/3rdparty/libprocess/include -I/mesos/build/3rdparty/http_parser-2.6.2/src/http_parser-2.6.2 -I/mesos/build/3rdparty/libevent-2.1.5-beta/src/libevent-2.1.5-beta-lib/lib/include -I/mesos/build/3rdparty/zookeeper-3.4.8/src/zookeeper-3.4.8/src/c/include -I/mesos/build/3rdparty/zookeeper-3.4.8/src/zookeeper-3.4.8/src/c/generated -I/mesos/build/3rdparty/leveldb-1.4/src/leveldb-1.4/include    -o CMakeFiles/mesos-1.2.0.dir/slave/flags.cpp.o -c /mesos/src/slave/flags.cpp
Building CXX object src/CMakeFiles/mesos-1.2.0.dir/slave/http.cpp.o
cd /mesos/build/src && /usr/bin/clang++-3.5   -DBUILD_DATE="\"2016-3-3 10:20\"" -DBUILD_FLAGS=\"\" -DBUILD_JAVA_JVM_LIBRARY=\"\" -DBUILD_TIME=\"1111100\" -DBUILD_USER=\"frank\" -DHAS_AUTHENTICATION=1 -DLIBDIR=\"/usr/local/libmesos\" -DPICOJSON_USE_INT64 -DPKGDATADIR=\"/usr/local/share/mesos\" -DPKGLIBEXECDIR=\"/usr/local/libexec/mesos\" -DUSE_STATIC_LIB -DVERSION=\"1.2.0\" -D__STDC_FORMAT_MACROS -Dmesos_1_2_0_EXPORTS -O2 -std=c++11 -g -fPIC -I/mesos/build/include -I/mesos/build/include/mesos -I/mesos/build/src -I/mesos/src -I/mesos/build/3rdparty/protobuf-2.6.1/src/protobuf-2.6.1-lib/lib/include -I/mesos/include -I/mesos/3rdparty/stout/include -I/usr/include/apr-1.0 -I/mesos/build/3rdparty/boost-1.53.0/src/boost-1.53.0 -I/mesos/build/3rdparty/elfio-3.2/src/elfio-3.2 -I/mesos/build/3rdparty/glog-0.3.3/src/glog-0.3.3-lib/lib/include -I/mesos/build/3rdparty/nvml-352.79/src/nvml-352.79 -I/mesos/build/3rdparty/picojson-1.3.0/src/picojson-1.3.0 -I/usr/include/subversion-1 -I/mesos/src/src -I/mesos/3rdparty/libprocess/include -I/mesos/build/3rdparty/http_parser-2.6.2/src/http_parser-2.6.2 -I/mesos/build/3rdparty/libevent-2.1.5-beta/src/libevent-2.1.5-beta-lib/lib/include -I/mesos/build/3rdparty/zookeeper-3.4.8/src/zookeeper-3.4.8/src/c/include -I/mesos/build/3rdparty/zookeeper-3.4.8/src/zookeeper-3.4.8/src/c/generated -I/mesos/build/3rdparty/leveldb-1.4/src/leveldb-1.4/include    -o CMakeFiles/mesos-1.2.0.dir/slave/http.cpp.o -c /mesos/src/slave/http.cpp
Linking CXX executable test-linkee
cd /mesos/build/3rdparty/libprocess/src/tests && /usr/bin/cmake -E cmake_link_script CMakeFiles/test-linkee.dir/link.txt --verbose=1
/usr/bin/clang++-3.5    -O2 -std=c++11 -g    CMakeFiles/test-linkee.dir/test_linkee.cpp.o  -o test-linkee  -L/mesos/build/3rdparty/glog-0.3.3/src/glog-0.3.3-lib/lib/lib  -L/mesos/build/3rdparty/protobuf-2.6.1/src/protobuf-2.6.1-lib/lib/lib  -L/mesos/build/3rdparty/http_parser-2.6.2/src/http_parser-2.6.2-build  -L/mesos/build/3rdparty/libevent-2.1.5-beta/src/libevent-2.1.5-beta-lib/lib/lib  -L/mesos/build/3rdparty/libprocess/..  -L/mesos/build/3rdparty/gmock-1.7.0/src/gmock-1.7.0-lib/lib  -L/mesos/build/3rdparty/gmock-1.7.0/src/gmock-1.7.0-build/gtest/lib/.libs -rdynamic ../libprocess-0.0.1.so.0.0.1 -lapr-1 -lcurl -lglog -lsvn_delta-1 -lsvn_diff-1 -lsvn_subr-1 -lprotobuf -ldl -lapr-1 -lrt -lhttp_parser -levent -lrt -lz -lpthread -lgmock -lgtest -lhttp_parser -levent -lz -lpthread -Wl,-rpath,/mesos/build/3rdparty/glog-0.3.3/src/glog-0.3.3-lib/lib/lib:/mesos/build/3rdparty/protobuf-2.6.1/src/protobuf-2.6.1-lib/lib/lib:/mesos/build/3rdparty/http_parser-2.6.2/src/http_parser-2.6.2-build:/mesos/build/3rdparty/libevent-2.1.5-beta/src/libevent-2.1.5-beta-lib/lib/lib:/mesos/build/3rdparty/libprocess/..:/mesos/build/3rdparty/gmock-1.7.0/src/gmock-1.7.0-lib/lib:/mesos/build/3rdparty/gmock-1.7.0/src/gmock-1.7.0-build/gtest/lib/.libs:/mesos/build/3rdparty/libprocess/src 
/usr/bin/cmake -E cmake_progress_report /mesos/build/CMakeFiles 
[ 39%] Building CXX object src/CMakeFiles/mesos-1.2.0.dir/slave/metrics.cpp.o
cd /mesos/build/src && /usr/bin/clang++-3.5   -DBUILD_DATE="\"2016-3-3 10:20\"" -DBUILD_FLAGS=\"\" -DBUILD_JAVA_JVM_LIBRARY=\"\" -DBUILD_TIME=\"1111100\" -DBUILD_USER=\"frank\" -DHAS_AUTHENTICATION=1 -DLIBDIR=\"/usr/local/libmesos\" -DPICOJSON_USE_INT64 -DPKGDATADIR=\"/usr/local/share/mesos\" -DPKGLIBEXECDIR=\"/usr/local/libexec/mesos\" -DUSE_STATIC_LIB -DVERSION=\"1.2.0\" -D__STDC_FORMAT_MACROS -Dmesos_1_2_0_EXPORTS -O2 -std=c++11 -g -fPIC -I/mesos/build/include -I/mesos/build/include/mesos -I/mesos/build/src -I/mesos/src -I/mesos/build/3rdparty/protobuf-2.6.1/src/protobuf-2.6.1-lib/lib/include -I/mesos/include -I/mesos/3rdparty/stout/include -I/usr/include/apr-1.0 -I/mesos/build/3rdparty/boost-1.53.0/src/boost-1.53.0 -I/mesos/build/3rdparty/elfio-3.2/src/elfio-3.2 -I/mesos/build/3rdparty/glog-0.3.3/src/glog-0.3.3-lib/lib/include -I/mesos/build/3rdparty/nvml-352.79/src/nvml-352.79 -I/mesos/build/3rdparty/picojson-1.3.0/src/picojson-1.3.0 -I/usr/include/subversion-1 -I/mesos/src/src -I/mesos/3rdparty/libprocess/include -I/mesos/build/3rdparty/http_parser-2.6.2/src/http_parser-2.6.2 -I/mesos/build/3rdparty/libevent-2.1.5-beta/src/libevent-2.1.5-beta-lib/lib/include -I/mesos/build/3rdparty/zookeeper-3.4.8/src/zookeeper-3.4.8/src/c/include -I/mesos/build/3rdparty/zookeeper-3.4.8/src/zookeeper-3.4.8/src/c/generated -I/mesos/build/3rdparty/leveldb-1.4/src/leveldb-1.4/include    -o CMakeFiles/mesos-1.2.0.dir/slave/metrics.cpp.o -c /mesos/src/slave/metrics.cpp
make[3]: Leaving directory `/mesos/build'
/usr/bin/cmake -E cmake_progress_report /mesos/build/CMakeFiles 
[ 39%] Built target test-linkee
/usr/bin/cmake -E cmake_progress_report /mesos/build/CMakeFiles 
[ 39%] Building CXX object src/CMakeFiles/mesos-1.2.0.dir/slave/paths.cpp.o
cd /mesos/build/src && /usr/bin/clang++-3.5   -DBUILD_DATE="\"2016-3-3 10:20\"" -DBUILD_FLAGS=\"\" -DBUILD_JAVA_JVM_LIBRARY=\"\" -DBUILD_TIME=\"1111100\" -DBUILD_USER=\"frank\" -DHAS_AUTHENTICATION=1 -DLIBDIR=\"/usr/local/libmesos\" -DPICOJSON_USE_INT64 -DPKGDATADIR=\"/usr/local/share/mesos\" -DPKGLIBEXECDIR=\"/usr/local/libexec/mesos\" -DUSE_STATIC_LIB -DVERSION=\"1.2.0\" -D__STDC_FORMAT_MACROS -Dmesos_1_2_0_EXPORTS -O2 -std=c++11 -g -fPIC -I/mesos/build/include -I/mesos/build/include/mesos -I/mesos/build/src -I/mesos/src -I/mesos/build/3rdparty/protobuf-2.6.1/src/protobuf-2.6.1-lib/lib/include -I/mesos/include -I/mesos/3rdparty/stout/include -I/usr/include/apr-1.0 -I/mesos/build/3rdparty/boost-1.53.0/src/boost-1.53.0 -I/mesos/build/3rdparty/elfio-3.2/src/elfio-3.2 -I/mesos/build/3rdparty/glog-0.3.3/src/glog-0.3.3-lib/lib/include -I/mesos/build/3rdparty/nvml-352.79/src/nvml-352.79 -I/mesos/build/3rdparty/picojson-1.3.0/src/picojson-1.3.0 -I/usr/include/subversion-1 -I/mesos/src/src -I/mesos/3rdparty/libprocess/include -I/mesos/build/3rdparty/http_parser-2.6.2/src/http_parser-2.6.2 -I/mesos/build/3rdparty/libevent-2.1.5-beta/src/libevent-2.1.5-beta-lib/lib/include -I/mesos/build/3rdparty/zookeeper-3.4.8/src/zookeeper-3.4.8/src/c/include -I/mesos/build/3rdparty/zookeeper-3.4.8/src/zookeeper-3.4.8/src/c/generated -I/mesos/build/3rdparty/leveldb-1.4/src/leveldb-1.4/include    -o CMakeFiles/mesos-1.2.0.dir/slave/paths.cpp.o -c /mesos/src/slave/paths.cpp
make -f 3rdparty/libprocess/src/tests/CMakeFiles/libprocess-tests.dir/build.make 3rdparty/libprocess/src/tests/CMakeFiles/libprocess-tests.dir/depend
make[3]: Entering directory `/mesos/build'
cd /mesos/build && /usr/bin/cmake -E cmake_depends "Unix Makefiles" /mesos /mesos/3rdparty/libprocess/src/tests /mesos/build /mesos/build/3rdparty/libprocess/src/tests /mesos/build/3rdparty/libprocess/src/tests/CMakeFiles/libprocess-tests.dir/DependInfo.cmake --color=
Scanning dependencies of target libprocess-tests
make[3]: Leaving directory `/mesos/build'
make -f 3rdparty/libprocess/src/tests/CMakeFiles/libprocess-tests.dir/build.make 3rdparty/libprocess/src/tests/CMakeFiles/libprocess-tests.dir/build
make[3]: Entering directory `/mesos/build'
/usr/bin/cmake -E cmake_progress_report /mesos/build/CMakeFiles 
[ 39%] Building CXX object 3rdparty/libprocess/src/tests/CMakeFiles/libprocess-tests.dir/main.cpp.o
cd /mesos/build/3rdparty/libprocess/src/tests && /usr/bin/clang++-3.5   -DBUILD_DIR=\"/mesos/build/3rdparty/libprocess/src/tests\" -DHAS_AUTHENTICATION=1 -DLIBDIR=\"/usr/local/libmesos\" -DPICOJSON_USE_INT64 -DPKGDATADIR=\"/usr/local/share/mesos\" -DPKGLIBEXECDIR=\"/usr/local/libexec/mesos\" -DVERSION=\"1.2.0\" -D__STDC_FORMAT_MACROS -O2 -std=c++11 -g -fPIE -I/mesos/3rdparty/libprocess/src/tests/.. -I/mesos/3rdparty/stout/include -I/usr/include/apr-1.0 -I/mesos/build/3rdparty/boost-1.53.0/src/boost-1.53.0 -I/mesos/build/3rdparty/elfio-3.2/src/elfio-3.2 -I/mesos/build/3rdparty/glog-0.3.3/src/glog-0.3.3-lib/lib/include -I/mesos/build/3rdparty/nvml-352.79/src/nvml-352.79 -I/mesos/build/3rdparty/picojson-1.3.0/src/picojson-1.3.0 -I/mesos/build/3rdparty/protobuf-2.6.1/src/protobuf-2.6.1-lib/lib/include -I/usr/include/subversion-1 -I/mesos/3rdparty/libprocess/src/tests/src -I/mesos/3rdparty/libprocess/include -I/mesos/build/3rdparty/http_parser-2.6.2/src/http_parser-2.6.2 -I/mesos/build/3rdparty/libevent-2.1.5-beta/src/libevent-2.1.5-beta-lib/lib/include -I/mesos/build/3rdparty/gmock-1.7.0/src/gmock-1.7.0/include -I/mesos/build/3rdparty/gmock-1.7.0/src/gmock-1.7.0/gtest/include    -o CMakeFiles/libprocess-tests.dir/main.cpp.o -c /mesos/3rdparty/libprocess/src/tests/main.cpp
/usr/bin/cmake -E cmake_progress_report /mesos/build/CMakeFiles 
/usr/bin/cmake -E cmake_progress_report /mesos/build/CMakeFiles 
[ 39%] [ 39%] Building CXX object src/CMakeFiles/mesos-1.2.0.dir/slave/qos_controller.cpp.o
Building CXX object 3rdparty/libprocess/src/tests/CMakeFiles/libprocess-tests.dir/collect_tests.cpp.o
cd /mesos/build/3rdparty/libprocess/src/tests && /usr/bin/clang++-3.5   -DBUILD_DIR=\"/mesos/build/3rdparty/libprocess/src/tests\" -DHAS_AUTHENTICATION=1 -DLIBDIR=\"/usr/local/libmesos\" -DPICOJSON_USE_INT64 -DPKGDATADIR=\"/usr/local/share/mesos\" -DPKGLIBEXECDIR=\"/usr/local/libexec/mesos\" -DVERSION=\"1.2.0\" -D__STDC_FORMAT_MACROS -O2 -std=c++11 -g -fPIE -I/mesos/3rdparty/libprocess/src/tests/.. -I/mesos/3rdparty/stout/include -I/usr/include/apr-1.0 -I/mesos/build/3rdparty/boost-1.53.0/src/boost-1.53.0 -I/mesos/build/3rdparty/elfio-3.2/src/elfio-3.2 -I/mesos/build/3rdparty/glog-0.3.3/src/glog-0.3.3-lib/lib/include -I/mesos/build/3rdparty/nvml-352.79/src/nvml-352.79 -I/mesos/build/3rdparty/picojson-1.3.0/src/picojson-1.3.0 -I/mesos/build/3rdparty/protobuf-2.6.1/src/protobuf-2.6.1-lib/lib/include -I/usr/include/subversion-1 -I/mesos/3rdparty/libprocess/src/tests/src -I/mesos/3rdparty/libprocess/include -I/mesos/build/3rdparty/http_parser-2.6.2/src/http_parser-2.6.2 -I/mesos/build/3rdparty/libevent-2.1.5-beta/src/libevent-2.1.5-beta-lib/lib/include -I/mesos/build/3rdparty/gmock-1.7.0/src/gmock-1.7.0/include -I/mesos/build/3rdparty/gmock-1.7.0/src/gmock-1.7.0/gtest/include    -o CMakeFiles/libprocess-tests.dir/collect_tests.cpp.o -c /mesos/3rdparty/libprocess/src/tests/collect_tests.cpp
cd /mesos/build/src && /usr/bin/clang++-3.5   -DBUILD_DATE="\"2016-3-3 10:20\"" -DBUILD_FLAGS=\"\" -DBUILD_JAVA_JVM_LIBRARY=\"\" -DBUILD_TIME=\"1111100\" -DBUILD_USER=\"frank\" -DHAS_AUTHENTICATION=1 -DLIBDIR=\"/usr/local/libmesos\" -DPICOJSON_USE_INT64 -DPKGDATADIR=\"/usr/local/share/mesos\" -DPKGLIBEXECDIR=\"/usr/local/libexec/mesos\" -DUSE_STATIC_LIB -DVERSION=\"1.2.0\" -D__STDC_FORMAT_MACROS -Dmesos_1_2_0_EXPORTS -O2 -std=c++11 -g -fPIC -I/mesos/build/include -I/mesos/build/include/mesos -I/mesos/build/src -I/mesos/src -I/mesos/build/3rdparty/protobuf-2.6.1/src/protobuf-2.6.1-lib/lib/include -I/mesos/include -I/mesos/3rdparty/stout/include -I/usr/include/apr-1.0 -I/mesos/build/3rdparty/boost-1.53.0/src/boost-1.53.0 -I/mesos/build/3rdparty/elfio-3.2/src/elfio-3.2 -I/mesos/build/3rdparty/glog-0.3.3/src/glog-0.3.3-lib/lib/include -I/mesos/build/3rdparty/nvml-352.79/src/nvml-352.79 -I/mesos/build/3rdparty/picojson-1.3.0/src/picojson-1.3.0 -I/usr/include/subversion-1 -I/mesos/src/src -I/mesos/3rdparty/libprocess/include -I/mesos/build/3rdparty/http_parser-2.6.2/src/http_parser-2.6.2 -I/mesos/build/3rdparty/libevent-2.1.5-beta/src/libevent-2.1.5-beta-lib/lib/include -I/mesos/build/3rdparty/zookeeper-3.4.8/src/zookeeper-3.4.8/src/c/include -I/mesos/build/3rdparty/zookeeper-3.4.8/src/zookeeper-3.4.8/src/c/generated -I/mesos/build/3rdparty/leveldb-1.4/src/leveldb-1.4/include    -o CMakeFiles/mesos-1.2.0.dir/slave/qos_controller.cpp.o -c /mesos/src/slave/qos_controller.cpp
/usr/bin/cmake -E cmake_progress_report /mesos/build/CMakeFiles 16
[ 40%] Building CXX object src/CMakeFiles/mesos-1.2.0.dir/slave/qos_controllers/noop.cpp.o
cd /mesos/build/src && /usr/bin/clang++-3.5   -DBUILD_DATE="\"2016-3-3 10:20\"" -DBUILD_FLAGS=\"\" -DBUILD_JAVA_JVM_LIBRARY=\"\" -DBUILD_TIME=\"1111100\" -DBUILD_USER=\"frank\" -DHAS_AUTHENTICATION=1 -DLIBDIR=\"/usr/local/libmesos\" -DPICOJSON_USE_INT64 -DPKGDATADIR=\"/usr/local/share/mesos\" -DPKGLIBEXECDIR=\"/usr/local/libexec/mesos\" -DUSE_STATIC_LIB -DVERSION=\"1.2.0\" -D__STDC_FORMAT_MACROS -Dmesos_1_2_0_EXPORTS -O2 -std=c++11 -g -fPIC -I/mesos/build/include -I/mesos/build/include/mesos -I/mesos/build/src -I/mesos/src -I/mesos/build/3rdparty/protobuf-2.6.1/src/protobuf-2.6.1-lib/lib/include -I/mesos/include -I/mesos/3rdparty/stout/include -I/usr/include/apr-1.0 -I/mesos/build/3rdparty/boost-1.53.0/src/boost-1.53.0 -I/mesos/build/3rdparty/elfio-3.2/src/elfio-3.2 -I/mesos/build/3rdparty/glog-0.3.3/src/glog-0.3.3-lib/lib/include -I/mesos/build/3rdparty/nvml-352.79/src/nvml-352.79 -I/mesos/build/3rdparty/picojson-1.3.0/src/picojson-1.3.0 -I/usr/include/subversion-1 -I/mesos/src/src -I/mesos/3rdparty/libprocess/include -I/mesos/build/3rdparty/http_parser-2.6.2/src/http_parser-2.6.2 -I/mesos/build/3rdparty/libevent-2.1.5-beta/src/libevent-2.1.5-beta-lib/lib/include -I/mesos/build/3rdparty/zookeeper-3.4.8/src/zookeeper-3.4.8/src/c/include -I/mesos/build/3rdparty/zookeeper-3.4.8/src/zookeeper-3.4.8/src/c/generated -I/mesos/build/3rdparty/leveldb-1.4/src/leveldb-1.4/include    -o CMakeFiles/mesos-1.2.0.dir/slave/qos_controllers/noop.cpp.o -c /mesos/src/slave/qos_controllers/noop.cpp
/usr/bin/cmake -E cmake_progress_report /mesos/build/CMakeFiles 
[ 40%] Building CXX object src/CMakeFiles/mesos-1.2.0.dir/slave/resource_estimator.cpp.o
cd /mesos/build/src && /usr/bin/clang++-3.5   -DBUILD_DATE="\"2016-3-3 10:20\"" -DBUILD_FLAGS=\"\" -DBUILD_JAVA_JVM_LIBRARY=\"\" -DBUILD_TIME=\"1111100\" -DBUILD_USER=\"frank\" -DHAS_AUTHENTICATION=1 -DLIBDIR=\"/usr/local/libmesos\" -DPICOJSON_USE_INT64 -DPKGDATADIR=\"/usr/local/share/mesos\" -DPKGLIBEXECDIR=\"/usr/local/libexec/mesos\" -DUSE_STATIC_LIB -DVERSION=\"1.2.0\" -D__STDC_FORMAT_MACROS -Dmesos_1_2_0_EXPORTS -O2 -std=c++11 -g -fPIC -I/mesos/build/include -I/mesos/build/include/mesos -I/mesos/build/src -I/mesos/src -I/mesos/build/3rdparty/protobuf-2.6.1/src/protobuf-2.6.1-lib/lib/include -I/mesos/include -I/mesos/3rdparty/stout/include -I/usr/include/apr-1.0 -I/mesos/build/3rdparty/boost-1.53.0/src/boost-1.53.0 -I/mesos/build/3rdparty/elfio-3.2/src/elfio-3.2 -I/mesos/build/3rdparty/glog-0.3.3/src/glog-0.3.3-lib/lib/include -I/mesos/build/3rdparty/nvml-352.79/src/nvml-352.79 -I/mesos/build/3rdparty/picojson-1.3.0/src/picojson-1.3.0 -I/usr/include/subversion-1 -I/mesos/src/src -I/mesos/3rdparty/libprocess/include -I/mesos/build/3rdparty/http_parser-2.6.2/src/http_parser-2.6.2 -I/mesos/build/3rdparty/libevent-2.1.5-beta/src/libevent-2.1.5-beta-lib/lib/include -I/mesos/build/3rdparty/zookeeper-3.4.8/src/zookeeper-3.4.8/src/c/include -I/mesos/build/3rdparty/zookeeper-3.4.8/src/zookeeper-3.4.8/src/c/generated -I/mesos/build/3rdparty/leveldb-1.4/src/leveldb-1.4/include    -o CMakeFiles/mesos-1.2.0.dir/slave/resource_estimator.cpp.o -c /mesos/src/slave/resource_estimator.cpp
/usr/bin/cmake -E cmake_progress_report /mesos/build/CMakeFiles 
[ 40%] Building CXX object 3rdparty/libprocess/src/tests/CMakeFiles/libprocess-tests.dir/decoder_tests.cpp.o
cd /mesos/build/3rdparty/libprocess/src/tests && /usr/bin/clang++-3.5   -DBUILD_DIR=\"/mesos/build/3rdparty/libprocess/src/tests\" -DHAS_AUTHENTICATION=1 -DLIBDIR=\"/usr/local/libmesos\" -DPICOJSON_USE_INT64 -DPKGDATADIR=\"/usr/local/share/mesos\" -DPKGLIBEXECDIR=\"/usr/local/libexec/mesos\" -DVERSION=\"1.2.0\" -D__STDC_FORMAT_MACROS -O2 -std=c++11 -g -fPIE -I/mesos/3rdparty/libprocess/src/tests/.. -I/mesos/3rdparty/stout/include -I/usr/include/apr-1.0 -I/mesos/build/3rdparty/boost-1.53.0/src/boost-1.53.0 -I/mesos/build/3rdparty/elfio-3.2/src/elfio-3.2 -I/mesos/build/3rdparty/glog-0.3.3/src/glog-0.3.3-lib/lib/include -I/mesos/build/3rdparty/nvml-352.79/src/nvml-352.79 -I/mesos/build/3rdparty/picojson-1.3.0/src/picojson-1.3.0 -I/mesos/build/3rdparty/protobuf-2.6.1/src/protobuf-2.6.1-lib/lib/include -I/usr/include/subversion-1 -I/mesos/3rdparty/libprocess/src/tests/src -I/mesos/3rdparty/libprocess/include -I/mesos/build/3rdparty/http_parser-2.6.2/src/http_parser-2.6.2 -I/mesos/build/3rdparty/libevent-2.1.5-beta/src/libevent-2.1.5-beta-lib/lib/include -I/mesos/build/3rdparty/gmock-1.7.0/src/gmock-1.7.0/include -I/mesos/build/3rdparty/gmock-1.7.0/src/gmock-1.7.0/gtest/include    -o CMakeFiles/libprocess-tests.dir/decoder_tests.cpp.o -c /mesos/3rdparty/libprocess/src/tests/decoder_tests.cpp
/usr/bin/cmake -E cmake_progress_report /mesos/build/CMakeFiles 
[ 40%] Building CXX object src/CMakeFiles/mesos-1.2.0.dir/slave/slave.cpp.o
cd /mesos/build/src && /usr/bin/clang++-3.5   -DBUILD_DATE="\"2016-3-3 10:20\"" -DBUILD_FLAGS=\"\" -DBUILD_JAVA_JVM_LIBRARY=\"\" -DBUILD_TIME=\"1111100\" -DBUILD_USER=\"frank\" -DHAS_AUTHENTICATION=1 -DLIBDIR=\"/usr/local/libmesos\" -DPICOJSON_USE_INT64 -DPKGDATADIR=\"/usr/local/share/mesos\" -DPKGLIBEXECDIR=\"/usr/local/libexec/mesos\" -DUSE_STATIC_LIB -DVERSION=\"1.2.0\" -D__STDC_FORMAT_MACROS -Dmesos_1_2_0_EXPORTS -O2 -std=c++11 -g -fPIC -I/mesos/build/include -I/mesos/build/include/mesos -I/mesos/build/src -I/mesos/src -I/mesos/build/3rdparty/protobuf-2.6.1/src/protobuf-2.6.1-lib/lib/include -I/mesos/include -I/mesos/3rdparty/stout/include -I/usr/include/apr-1.0 -I/mesos/build/3rdparty/boost-1.53.0/src/boost-1.53.0 -I/mesos/build/3rdparty/elfio-3.2/src/elfio-3.2 -I/mesos/build/3rdparty/glog-0.3.3/src/glog-0.3.3-lib/lib/include -I/mesos/build/3rdparty/nvml-352.79/src/nvml-352.79 -I/mesos/build/3rdparty/picojson-1.3.0/src/picojson-1.3.0 -I/usr/include/subversion-1 -I/mesos/src/src -I/mesos/3rdparty/libprocess/include -I/mesos/build/3rdparty/http_parser-2.6.2/src/http_parser-2.6.2 -I/mesos/build/3rdparty/libevent-2.1.5-beta/src/libevent-2.1.5-beta-lib/lib/include -I/mesos/build/3rdparty/zookeeper-3.4.8/src/zookeeper-3.4.8/src/c/include -I/mesos/build/3rdparty/zookeeper-3.4.8/src/zookeeper-3.4.8/src/c/generated -I/mesos/build/3rdparty/leveldb-1.4/src/leveldb-1.4/include    -o CMakeFiles/mesos-1.2.0.dir/slave/slave.cpp.o -c /mesos/src/slave/slave.cpp
/usr/bin/cmake -E cmake_progress_report /mesos/build/CMakeFiles 
[ 40%] Building CXX object src/CMakeFiles/mesos-1.2.0.dir/slave/state.cpp.o
cd /mesos/build/src && /usr/bin/clang++-3.5   -DBUILD_DATE="\"2016-3-3 10:20\"" -DBUILD_FLAGS=\"\" -DBUILD_JAVA_JVM_LIBRARY=\"\" -DBUILD_TIME=\"1111100\" -DBUILD_USER=\"frank\" -DHAS_AUTHENTICATION=1 -DLIBDIR=\"/usr/local/libmesos\" -DPICOJSON_USE_INT64 -DPKGDATADIR=\"/usr/local/share/mesos\" -DPKGLIBEXECDIR=\"/usr/local/libexec/mesos\" -DUSE_STATIC_LIB -DVERSION=\"1.2.0\" -D__STDC_FORMAT_MACROS -Dmesos_1_2_0_EXPORTS -O2 -std=c++11 -g -fPIC -I/mesos/build/include -I/mesos/build/include/mesos -I/mesos/build/src -I/mesos/src -I/mesos/build/3rdparty/protobuf-2.6.1/src/protobuf-2.6.1-lib/lib/include -I/mesos/include -I/mesos/3rdparty/stout/include -I/usr/include/apr-1.0 -I/mesos/build/3rdparty/boost-1.53.0/src/boost-1.53.0 -I/mesos/build/3rdparty/elfio-3.2/src/elfio-3.2 -I/mesos/build/3rdparty/glog-0.3.3/src/glog-0.3.3-lib/lib/include -I/mesos/build/3rdparty/nvml-352.79/src/nvml-352.79 -I/mesos/build/3rdparty/picojson-1.3.0/src/picojson-1.3.0 -I/usr/include/subversion-1 -I/mesos/src/src -I/mesos/3rdparty/libprocess/include -I/mesos/build/3rdparty/http_parser-2.6.2/src/http_parser-2.6.2 -I/mesos/build/3rdparty/libevent-2.1.5-beta/src/libevent-2.1.5-beta-lib/lib/include -I/mesos/build/3rdparty/zookeeper-3.4.8/src/zookeeper-3.4.8/src/c/include -I/mesos/build/3rdparty/zookeeper-3.4.8/src/zookeeper-3.4.8/src/c/generated -I/mesos/build/3rdparty/leveldb-1.4/src/leveldb-1.4/include    -o CMakeFiles/mesos-1.2.0.dir/slave/state.cpp.o -c /mesos/src/slave/state.cpp
/usr/bin/cmake -E cmake_progress_report /mesos/build/CMakeFiles 
[ 40%] Building CXX object src/CMakeFiles/mesos-1.2.0.dir/slave/status_update_manager.cpp.o
cd /mesos/build/src && /usr/bin/clang++-3.5   -DBUILD_DATE="\"2016-3-3 10:20\"" -DBUILD_FLAGS=\"\" -DBUILD_JAVA_JVM_LIBRARY=\"\" -DBUILD_TIME=\"1111100\" -DBUILD_USER=\"frank\" -DHAS_AUTHENTICATION=1 -DLIBDIR=\"/usr/local/libmesos\" -DPICOJSON_USE_INT64 -DPKGDATADIR=\"/usr/local/share/mesos\" -DPKGLIBEXECDIR=\"/usr/local/libexec/mesos\" -DUSE_STATIC_LIB -DVERSION=\"1.2.0\" -D__STDC_FORMAT_MACROS -Dmesos_1_2_0_EXPORTS -O2 -std=c++11 -g -fPIC -I/mesos/build/include -I/mesos/build/include/mesos -I/mesos/build/src -I/mesos/src -I/mesos/build/3rdparty/protobuf-2.6.1/src/protobuf-2.6.1-lib/lib/include -I/mesos/include -I/mesos/3rdparty/stout/include -I/usr/include/apr-1.0 -I/mesos/build/3rdparty/boost-1.53.0/src/boost-1.53.0 -I/mesos/build/3rdparty/elfio-3.2/src/elfio-3.2 -I/mesos/build/3rdparty/glog-0.3.3/src/glog-0.3.3-lib/lib/include -I/mesos/build/3rdparty/nvml-352.79/src/nvml-352.79 -I/mesos/build/3rdparty/picojson-1.3.0/src/picojson-1.3.0 -I/usr/include/subversion-1 -I/mesos/src/src -I/mesos/3rdparty/libprocess/include -I/mesos/build/3rdparty/http_parser-2.6.2/src/http_parser-2.6.2 -I/mesos/build/3rdparty/libevent-2.1.5-beta/src/libevent-2.1.5-beta-lib/lib/include -I/mesos/build/3rdparty/zookeeper-3.4.8/src/zookeeper-3.4.8/src/c/include -I/mesos/build/3rdparty/zookeeper-3.4.8/src/zookeeper-3.4.8/src/c/generated -I/mesos/build/3rdparty/leveldb-1.4/src/leveldb-1.4/include    -o CMakeFiles/mesos-1.2.0.dir/slave/status_update_manager.cpp.o -c /mesos/src/slave/status_update_manager.cpp
/usr/bin/cmake -E cmake_progress_report /mesos/build/CMakeFiles 
[ 40%] Building CXX object 3rdparty/libprocess/src/tests/CMakeFiles/libprocess-tests.dir/encoder_tests.cpp.o
cd /mesos/build/3rdparty/libprocess/src/tests && /usr/bin/clang++-3.5   -DBUILD_DIR=\"/mesos/build/3rdparty/libprocess/src/tests\" -DHAS_AUTHENTICATION=1 -DLIBDIR=\"/usr/local/libmesos\" -DPICOJSON_USE_INT64 -DPKGDATADIR=\"/usr/local/share/mesos\" -DPKGLIBEXECDIR=\"/usr/local/libexec/mesos\" -DVERSION=\"1.2.0\" -D__STDC_FORMAT_MACROS -O2 -std=c++11 -g -fPIE -I/mesos/3rdparty/libprocess/src/tests/.. -I/mesos/3rdparty/stout/include -I/usr/include/apr-1.0 -I/mesos/build/3rdparty/boost-1.53.0/src/boost-1.53.0 -I/mesos/build/3rdparty/elfio-3.2/src/elfio-3.2 -I/mesos/build/3rdparty/glog-0.3.3/src/glog-0.3.3-lib/lib/include -I/mesos/build/3rdparty/nvml-352.79/src/nvml-352.79 -I/mesos/build/3rdparty/picojson-1.3.0/src/picojson-1.3.0 -I/mesos/build/3rdparty/protobuf-2.6.1/src/protobuf-2.6.1-lib/lib/include -I/usr/include/subversion-1 -I/mesos/3rdparty/libprocess/src/tests/src -I/mesos/3rdparty/libprocess/include -I/mesos/build/3rdparty/http_parser-2.6.2/src/http_parser-2.6.2 -I/mesos/build/3rdparty/libevent-2.1.5-beta/src/libevent-2.1.5-beta-lib/lib/include -I/mesos/build/3rdparty/gmock-1.7.0/src/gmock-1.7.0/include -I/mesos/build/3rdparty/gmock-1.7.0/src/gmock-1.7.0/gtest/include    -o CMakeFiles/libprocess-tests.dir/encoder_tests.cpp.o -c /mesos/3rdparty/libprocess/src/tests/encoder_tests.cpp
/usr/bin/cmake -E cmake_progress_report /mesos/build/CMakeFiles 
[ 40%] Building CXX object 3rdparty/libprocess/src/tests/CMakeFiles/libprocess-tests.dir/future_tests.cpp.o
cd /mesos/build/3rdparty/libprocess/src/tests && /usr/bin/clang++-3.5   -DBUILD_DIR=\"/mesos/build/3rdparty/libprocess/src/tests\" -DHAS_AUTHENTICATION=1 -DLIBDIR=\"/usr/local/libmesos\" -DPICOJSON_USE_INT64 -DPKGDATADIR=\"/usr/local/share/mesos\" -DPKGLIBEXECDIR=\"/usr/local/libexec/mesos\" -DVERSION=\"1.2.0\" -D__STDC_FORMAT_MACROS -O2 -std=c++11 -g -fPIE -I/mesos/3rdparty/libprocess/src/tests/.. -I/mesos/3rdparty/stout/include -I/usr/include/apr-1.0 -I/mesos/build/3rdparty/boost-1.53.0/src/boost-1.53.0 -I/mesos/build/3rdparty/elfio-3.2/src/elfio-3.2 -I/mesos/build/3rdparty/glog-0.3.3/src/glog-0.3.3-lib/lib/include -I/mesos/build/3rdparty/nvml-352.79/src/nvml-352.79 -I/mesos/build/3rdparty/picojson-1.3.0/src/picojson-1.3.0 -I/mesos/build/3rdparty/protobuf-2.6.1/src/protobuf-2.6.1-lib/lib/include -I/usr/include/subversion-1 -I/mesos/3rdparty/libprocess/src/tests/src -I/mesos/3rdparty/libprocess/include -I/mesos/build/3rdparty/http_parser-2.6.2/src/http_parser-2.6.2 -I/mesos/build/3rdparty/libevent-2.1.5-beta/src/libevent-2.1.5-beta-lib/lib/include -I/mesos/build/3rdparty/gmock-1.7.0/src/gmock-1.7.0/include -I/mesos/build/3rdparty/gmock-1.7.0/src/gmock-1.7.0/gtest/include    -o CMakeFiles/libprocess-tests.dir/future_tests.cpp.o -c /mesos/3rdparty/libprocess/src/tests/future_tests.cpp
/usr/bin/cmake -E cmake_progress_report /mesos/build/CMakeFiles 11
[ 41%] Building CXX object 3rdparty/libprocess/src/tests/CMakeFiles/libprocess-tests.dir/http_tests.cpp.o
cd /mesos/build/3rdparty/libprocess/src/tests && /usr/bin/clang++-3.5   -DBUILD_DIR=\"/mesos/build/3rdparty/libprocess/src/tests\" -DHAS_AUTHENTICATION=1 -DLIBDIR=\"/usr/local/libmesos\" -DPICOJSON_USE_INT64 -DPKGDATADIR=\"/usr/local/share/mesos\" -DPKGLIBEXECDIR=\"/usr/local/libexec/mesos\" -DVERSION=\"1.2.0\" -D__STDC_FORMAT_MACROS -O2 -std=c++11 -g -fPIE -I/mesos/3rdparty/libprocess/src/tests/.. -I/mesos/3rdparty/stout/include -I/usr/include/apr-1.0 -I/mesos/build/3rdparty/boost-1.53.0/src/boost-1.53.0 -I/mesos/build/3rdparty/elfio-3.2/src/elfio-3.2 -I/mesos/build/3rdparty/glog-0.3.3/src/glog-0.3.3-lib/lib/include -I/mesos/build/3rdparty/nvml-352.79/src/nvml-352.79 -I/mesos/build/3rdparty/picojson-1.3.0/src/picojson-1.3.0 -I/mesos/build/3rdparty/protobuf-2.6.1/src/protobuf-2.6.1-lib/lib/include -I/usr/include/subversion-1 -I/mesos/3rdparty/libprocess/src/tests/src -I/mesos/3rdparty/libprocess/include -I/mesos/build/3rdparty/http_parser-2.6.2/src/http_parser-2.6.2 -I/mesos/build/3rdparty/libevent-2.1.5-beta/src/libevent-2.1.5-beta-lib/lib/include -I/mesos/build/3rdparty/gmock-1.7.0/src/gmock-1.7.0/include -I/mesos/build/3rdparty/gmock-1.7.0/src/gmock-1.7.0/gtest/include    -o CMakeFiles/libprocess-tests.dir/http_tests.cpp.o -c /mesos/3rdparty/libprocess/src/tests/http_tests.cpp
/usr/bin/cmake -E cmake_progress_report /mesos/build/CMakeFiles 
[ 41%] Building CXX object 3rdparty/libprocess/src/tests/CMakeFiles/libprocess-tests.dir/limiter_tests.cpp.o
cd /mesos/build/3rdparty/libprocess/src/tests && /usr/bin/clang++-3.5   -DBUILD_DIR=\"/mesos/build/3rdparty/libprocess/src/tests\" -DHAS_AUTHENTICATION=1 -DLIBDIR=\"/usr/local/libmesos\" -DPICOJSON_USE_INT64 -DPKGDATADIR=\"/usr/local/share/mesos\" -DPKGLIBEXECDIR=\"/usr/local/libexec/mesos\" -DVERSION=\"1.2.0\" -D__STDC_FORMAT_MACROS -O2 -std=c++11 -g -fPIE -I/mesos/3rdparty/libprocess/src/tests/.. -I/mesos/3rdparty/stout/include -I/usr/include/apr-1.0 -I/mesos/build/3rdparty/boost-1.53.0/src/boost-1.53.0 -I/mesos/build/3rdparty/elfio-3.2/src/elfio-3.2 -I/mesos/build/3rdparty/glog-0.3.3/src/glog-0.3.3-lib/lib/include -I/mesos/build/3rdparty/nvml-352.79/src/nvml-352.79 -I/mesos/build/3rdparty/picojson-1.3.0/src/picojson-1.3.0 -I/mesos/build/3rdparty/protobuf-2.6.1/src/protobuf-2.6.1-lib/lib/include -I/usr/include/subversion-1 -I/mesos/3rdparty/libprocess/src/tests/src -I/mesos/3rdparty/libprocess/include -I/mesos/build/3rdparty/http_parser-2.6.2/src/http_parser-2.6.2 -I/mesos/build/3rdparty/libevent-2.1.5-beta/src/libevent-2.1.5-beta-lib/lib/include -I/mesos/build/3rdparty/gmock-1.7.0/src/gmock-1.7.0/include -I/mesos/build/3rdparty/gmock-1.7.0/src/gmock-1.7.0/gtest/include    -o CMakeFiles/libprocess-tests.dir/limiter_tests.cpp.o -c /mesos/3rdparty/libprocess/src/tests/limiter_tests.cpp
/usr/bin/cmake -E cmake_progress_report /mesos/build/CMakeFiles 
[ 41%] Building CXX object src/CMakeFiles/mesos-1.2.0.dir/slave/validation.cpp.o
cd /mesos/build/src && /usr/bin/clang++-3.5   -DBUILD_DATE="\"2016-3-3 10:20\"" -DBUILD_FLAGS=\"\" -DBUILD_JAVA_JVM_LIBRARY=\"\" -DBUILD_TIME=\"1111100\" -DBUILD_USER=\"frank\" -DHAS_AUTHENTICATION=1 -DLIBDIR=\"/usr/local/libmesos\" -DPICOJSON_USE_INT64 -DPKGDATADIR=\"/usr/local/share/mesos\" -DPKGLIBEXECDIR=\"/usr/local/libexec/mesos\" -DUSE_STATIC_LIB -DVERSION=\"1.2.0\" -D__STDC_FORMAT_MACROS -Dmesos_1_2_0_EXPORTS -O2 -std=c++11 -g -fPIC -I/mesos/build/include -I/mesos/build/include/mesos -I/mesos/build/src -I/mesos/src -I/mesos/build/3rdparty/protobuf-2.6.1/src/protobuf-2.6.1-lib/lib/include -I/mesos/include -I/mesos/3rdparty/stout/include -I/usr/include/apr-1.0 -I/mesos/build/3rdparty/boost-1.53.0/src/boost-1.53.0 -I/mesos/build/3rdparty/elfio-3.2/src/elfio-3.2 -I/mesos/build/3rdparty/glog-0.3.3/src/glog-0.3.3-lib/lib/include -I/mesos/build/3rdparty/nvml-352.79/src/nvml-352.79 -I/mesos/build/3rdparty/picojson-1.3.0/src/picojson-1.3.0 -I/usr/include/subversion-1 -I/mesos/src/src -I/mesos/3rdparty/libprocess/include -I/mesos/build/3rdparty/http_parser-2.6.2/src/http_parser-2.6.2 -I/mesos/build/3rdparty/libevent-2.1.5-beta/src/libevent-2.1.5-beta-lib/lib/include -I/mesos/build/3rdparty/zookeeper-3.4.8/src/zookeeper-3.4.8/src/c/include -I/mesos/build/3rdparty/zookeeper-3.4.8/src/zookeeper-3.4.8/src/c/generated -I/mesos/build/3rdparty/leveldb-1.4/src/leveldb-1.4/include    -o CMakeFiles/mesos-1.2.0.dir/slave/validation.cpp.o -c /mesos/src/slave/validation.cpp
/usr/bin/cmake -E cmake_progress_report /mesos/build/CMakeFiles 17
[ 42%] Building CXX object src/CMakeFiles/mesos-1.2.0.dir/slave/container_loggers/sandbox.cpp.o
cd /mesos/build/src && /usr/bin/clang++-3.5   -DBUILD_DATE="\"2016-3-3 10:20\"" -DBUILD_FLAGS=\"\" -DBUILD_JAVA_JVM_LIBRARY=\"\" -DBUILD_TIME=\"1111100\" -DBUILD_USER=\"frank\" -DHAS_AUTHENTICATION=1 -DLIBDIR=\"/usr/local/libmesos\" -DPICOJSON_USE_INT64 -DPKGDATADIR=\"/usr/local/share/mesos\" -DPKGLIBEXECDIR=\"/usr/local/libexec/mesos\" -DUSE_STATIC_LIB -DVERSION=\"1.2.0\" -D__STDC_FORMAT_MACROS -Dmesos_1_2_0_EXPORTS -O2 -std=c++11 -g -fPIC -I/mesos/build/include -I/mesos/build/include/mesos -I/mesos/build/src -I/mesos/src -I/mesos/build/3rdparty/protobuf-2.6.1/src/protobuf-2.6.1-lib/lib/include -I/mesos/include -I/mesos/3rdparty/stout/include -I/usr/include/apr-1.0 -I/mesos/build/3rdparty/boost-1.53.0/src/boost-1.53.0 -I/mesos/build/3rdparty/elfio-3.2/src/elfio-3.2 -I/mesos/build/3rdparty/glog-0.3.3/src/glog-0.3.3-lib/lib/include -I/mesos/build/3rdparty/nvml-352.79/src/nvml-352.79 -I/mesos/build/3rdparty/picojson-1.3.0/src/picojson-1.3.0 -I/usr/include/subversion-1 -I/mesos/src/src -I/mesos/3rdparty/libprocess/include -I/mesos/build/3rdparty/http_parser-2.6.2/src/http_parser-2.6.2 -I/mesos/build/3rdparty/libevent-2.1.5-beta/src/libevent-2.1.5-beta-lib/lib/include -I/mesos/build/3rdparty/zookeeper-3.4.8/src/zookeeper-3.4.8/src/c/include -I/mesos/build/3rdparty/zookeeper-3.4.8/src/zookeeper-3.4.8/src/c/generated -I/mesos/build/3rdparty/leveldb-1.4/src/leveldb-1.4/include    -o CMakeFiles/mesos-1.2.0.dir/slave/container_loggers/sandbox.cpp.o -c /mesos/src/slave/container_loggers/sandbox.cpp
/usr/bin/cmake -E cmake_progress_report /mesos/build/CMakeFiles 
[ 42%] Building CXX object 3rdparty/libprocess/src/tests/CMakeFiles/libprocess-tests.dir/loop_tests.cpp.o
cd /mesos/build/3rdparty/libprocess/src/tests && /usr/bin/clang++-3.5   -DBUILD_DIR=\"/mesos/build/3rdparty/libprocess/src/tests\" -DHAS_AUTHENTICATION=1 -DLIBDIR=\"/usr/local/libmesos\" -DPICOJSON_USE_INT64 -DPKGDATADIR=\"/usr/local/share/mesos\" -DPKGLIBEXECDIR=\"/usr/local/libexec/mesos\" -DVERSION=\"1.2.0\" -D__STDC_FORMAT_MACROS -O2 -std=c++11 -g -fPIE -I/mesos/3rdparty/libprocess/src/tests/.. -I/mesos/3rdparty/stout/include -I/usr/include/apr-1.0 -I/mesos/build/3rdparty/boost-1.53.0/src/boost-1.53.0 -I/mesos/build/3rdparty/elfio-3.2/src/elfio-3.2 -I/mesos/build/3rdparty/glog-0.3.3/src/glog-0.3.3-lib/lib/include -I/mesos/build/3rdparty/nvml-352.79/src/nvml-352.79 -I/mesos/build/3rdparty/picojson-1.3.0/src/picojson-1.3.0 -I/mesos/build/3rdparty/protobuf-2.6.1/src/protobuf-2.6.1-lib/lib/include -I/usr/include/subversion-1 -I/mesos/3rdparty/libprocess/src/tests/src -I/mesos/3rdparty/libprocess/include -I/mesos/build/3rdparty/http_parser-2.6.2/src/http_parser-2.6.2 -I/mesos/build/3rdparty/libevent-2.1.5-beta/src/libevent-2.1.5-beta-lib/lib/include -I/mesos/build/3rdparty/gmock-1.7.0/src/gmock-1.7.0/include -I/mesos/build/3rdparty/gmock-1.7.0/src/gmock-1.7.0/gtest/include    -o CMakeFiles/libprocess-tests.dir/loop_tests.cpp.o -c /mesos/3rdparty/libprocess/src/tests/loop_tests.cpp
/usr/bin/cmake -E cmake_progress_report /mesos/build/CMakeFiles 
[ 42%] Building CXX object src/CMakeFiles/mesos-1.2.0.dir/slave/containerizer/composing.cpp.o
cd /mesos/build/src && /usr/bin/clang++-3.5   -DBUILD_DATE="\"2016-3-3 10:20\"" -DBUILD_FLAGS=\"\" -DBUILD_JAVA_JVM_LIBRARY=\"\" -DBUILD_TIME=\"1111100\" -DBUILD_USER=\"frank\" -DHAS_AUTHENTICATION=1 -DLIBDIR=\"/usr/local/libmesos\" -DPICOJSON_USE_INT64 -DPKGDATADIR=\"/usr/local/share/mesos\" -DPKGLIBEXECDIR=\"/usr/local/libexec/mesos\" -DUSE_STATIC_LIB -DVERSION=\"1.2.0\" -D__STDC_FORMAT_MACROS -Dmesos_1_2_0_EXPORTS -O2 -std=c++11 -g -fPIC -I/mesos/build/include -I/mesos/build/include/mesos -I/mesos/build/src -I/mesos/src -I/mesos/build/3rdparty/protobuf-2.6.1/src/protobuf-2.6.1-lib/lib/include -I/mesos/include -I/mesos/3rdparty/stout/include -I/usr/include/apr-1.0 -I/mesos/build/3rdparty/boost-1.53.0/src/boost-1.53.0 -I/mesos/build/3rdparty/elfio-3.2/src/elfio-3.2 -I/mesos/build/3rdparty/glog-0.3.3/src/glog-0.3.3-lib/lib/include -I/mesos/build/3rdparty/nvml-352.79/src/nvml-352.79 -I/mesos/build/3rdparty/picojson-1.3.0/src/picojson-1.3.0 -I/usr/include/subversion-1 -I/mesos/src/src -I/mesos/3rdparty/libprocess/include -I/mesos/build/3rdparty/http_parser-2.6.2/src/http_parser-2.6.2 -I/mesos/build/3rdparty/libevent-2.1.5-beta/src/libevent-2.1.5-beta-lib/lib/include -I/mesos/build/3rdparty/zookeeper-3.4.8/src/zookeeper-3.4.8/src/c/include -I/mesos/build/3rdparty/zookeeper-3.4.8/src/zookeeper-3.4.8/src/c/generated -I/mesos/build/3rdparty/leveldb-1.4/src/leveldb-1.4/include    -o CMakeFiles/mesos-1.2.0.dir/slave/containerizer/composing.cpp.o -c /mesos/src/slave/containerizer/composing.cpp
/usr/bin/cmake -E cmake_progress_report /mesos/build/CMakeFiles 
[ 42%] Building CXX object 3rdparty/libprocess/src/tests/CMakeFiles/libprocess-tests.dir/metrics_tests.cpp.o
cd /mesos/build/3rdparty/libprocess/src/tests && /usr/bin/clang++-3.5   -DBUILD_DIR=\"/mesos/build/3rdparty/libprocess/src/tests\" -DHAS_AUTHENTICATION=1 -DLIBDIR=\"/usr/local/libmesos\" -DPICOJSON_USE_INT64 -DPKGDATADIR=\"/usr/local/share/mesos\" -DPKGLIBEXECDIR=\"/usr/local/libexec/mesos\" -DVERSION=\"1.2.0\" -D__STDC_FORMAT_MACROS -O2 -std=c++11 -g -fPIE -I/mesos/3rdparty/libprocess/src/tests/.. -I/mesos/3rdparty/stout/include -I/usr/include/apr-1.0 -I/mesos/build/3rdparty/boost-1.53.0/src/boost-1.53.0 -I/mesos/build/3rdparty/elfio-3.2/src/elfio-3.2 -I/mesos/build/3rdparty/glog-0.3.3/src/glog-0.3.3-lib/lib/include -I/mesos/build/3rdparty/nvml-352.79/src/nvml-352.79 -I/mesos/build/3rdparty/picojson-1.3.0/src/picojson-1.3.0 -I/mesos/build/3rdparty/protobuf-2.6.1/src/protobuf-2.6.1-lib/lib/include -I/usr/include/subversion-1 -I/mesos/3rdparty/libprocess/src/tests/src -I/mesos/3rdparty/libprocess/include -I/mesos/build/3rdparty/http_parser-2.6.2/src/http_parser-2.6.2 -I/mesos/build/3rdparty/libevent-2.1.5-beta/src/libevent-2.1.5-beta-lib/lib/include -I/mesos/build/3rdparty/gmock-1.7.0/src/gmock-1.7.0/include -I/mesos/build/3rdparty/gmock-1.7.0/src/gmock-1.7.0/gtest/include    -o CMakeFiles/libprocess-tests.dir/metrics_tests.cpp.o -c /mesos/3rdparty/libprocess/src/tests/metrics_tests.cpp
/usr/bin/cmake -E cmake_progress_report /mesos/build/CMakeFiles 
[ 42%] Building CXX object src/CMakeFiles/mesos-1.2.0.dir/slave/containerizer/containerizer.cpp.o
cd /mesos/build/src && /usr/bin/clang++-3.5   -DBUILD_DATE="\"2016-3-3 10:20\"" -DBUILD_FLAGS=\"\" -DBUILD_JAVA_JVM_LIBRARY=\"\" -DBUILD_TIME=\"1111100\" -DBUILD_USER=\"frank\" -DHAS_AUTHENTICATION=1 -DLIBDIR=\"/usr/local/libmesos\" -DPICOJSON_USE_INT64 -DPKGDATADIR=\"/usr/local/share/mesos\" -DPKGLIBEXECDIR=\"/usr/local/libexec/mesos\" -DUSE_STATIC_LIB -DVERSION=\"1.2.0\" -D__STDC_FORMAT_MACROS -Dmesos_1_2_0_EXPORTS -O2 -std=c++11 -g -fPIC -I/mesos/build/include -I/mesos/build/include/mesos -I/mesos/build/src -I/mesos/src -I/mesos/build/3rdparty/protobuf-2.6.1/src/protobuf-2.6.1-lib/lib/include -I/mesos/include -I/mesos/3rdparty/stout/include -I/usr/include/apr-1.0 -I/mesos/build/3rdparty/boost-1.53.0/src/boost-1.53.0 -I/mesos/build/3rdparty/elfio-3.2/src/elfio-3.2 -I/mesos/build/3rdparty/glog-0.3.3/src/glog-0.3.3-lib/lib/include -I/mesos/build/3rdparty/nvml-352.79/src/nvml-352.79 -I/mesos/build/3rdparty/picojson-1.3.0/src/picojson-1.3.0 -I/usr/include/subversion-1 -I/mesos/src/src -I/mesos/3rdparty/libprocess/include -I/mesos/build/3rdparty/http_parser-2.6.2/src/http_parser-2.6.2 -I/mesos/build/3rdparty/libevent-2.1.5-beta/src/libevent-2.1.5-beta-lib/lib/include -I/mesos/build/3rdparty/zookeeper-3.4.8/src/zookeeper-3.4.8/src/c/include -I/mesos/build/3rdparty/zookeeper-3.4.8/src/zookeeper-3.4.8/src/c/generated -I/mesos/build/3rdparty/leveldb-1.4/src/leveldb-1.4/include    -o CMakeFiles/mesos-1.2.0.dir/slave/containerizer/containerizer.cpp.o -c /mesos/src/slave/containerizer/containerizer.cpp
/usr/bin/cmake -E cmake_progress_report /mesos/build/CMakeFiles 
[ 42%] Building CXX object 3rdparty/libprocess/src/tests/CMakeFiles/libprocess-tests.dir/mutex_tests.cpp.o
cd /mesos/build/3rdparty/libprocess/src/tests && /usr/bin/clang++-3.5   -DBUILD_DIR=\"/mesos/build/3rdparty/libprocess/src/tests\" -DHAS_AUTHENTICATION=1 -DLIBDIR=\"/usr/local/libmesos\" -DPICOJSON_USE_INT64 -DPKGDATADIR=\"/usr/local/share/mesos\" -DPKGLIBEXECDIR=\"/usr/local/libexec/mesos\" -DVERSION=\"1.2.0\" -D__STDC_FORMAT_MACROS -O2 -std=c++11 -g -fPIE -I/mesos/3rdparty/libprocess/src/tests/.. -I/mesos/3rdparty/stout/include -I/usr/include/apr-1.0 -I/mesos/build/3rdparty/boost-1.53.0/src/boost-1.53.0 -I/mesos/build/3rdparty/elfio-3.2/src/elfio-3.2 -I/mesos/build/3rdparty/glog-0.3.3/src/glog-0.3.3-lib/lib/include -I/mesos/build/3rdparty/nvml-352.79/src/nvml-352.79 -I/mesos/build/3rdparty/picojson-1.3.0/src/picojson-1.3.0 -I/mesos/build/3rdparty/protobuf-2.6.1/src/protobuf-2.6.1-lib/lib/include -I/usr/include/subversion-1 -I/mesos/3rdparty/libprocess/src/tests/src -I/mesos/3rdparty/libprocess/include -I/mesos/build/3rdparty/http_parser-2.6.2/src/http_parser-2.6.2 -I/mesos/build/3rdparty/libevent-2.1.5-beta/src/libevent-2.1.5-beta-lib/lib/include -I/mesos/build/3rdparty/gmock-1.7.0/src/gmock-1.7.0/include -I/mesos/build/3rdparty/gmock-1.7.0/src/gmock-1.7.0/gtest/include    -o CMakeFiles/libprocess-tests.dir/mutex_tests.cpp.o -c /mesos/3rdparty/libprocess/src/tests/mutex_tests.cpp
/usr/bin/cmake -E cmake_progress_report /mesos/build/CMakeFiles 
[ 42%] Building CXX object 3rdparty/libprocess/src/tests/CMakeFiles/libprocess-tests.dir/owned_tests.cpp.o
cd /mesos/build/3rdparty/libprocess/src/tests && /usr/bin/clang++-3.5   -DBUILD_DIR=\"/mesos/build/3rdparty/libprocess/src/tests\" -DHAS_AUTHENTICATION=1 -DLIBDIR=\"/usr/local/libmesos\" -DPICOJSON_USE_INT64 -DPKGDATADIR=\"/usr/local/share/mesos\" -DPKGLIBEXECDIR=\"/usr/local/libexec/mesos\" -DVERSION=\"1.2.0\" -D__STDC_FORMAT_MACROS -O2 -std=c++11 -g -fPIE -I/mesos/3rdparty/libprocess/src/tests/.. -I/mesos/3rdparty/stout/include -I/usr/include/apr-1.0 -I/mesos/build/3rdparty/boost-1.53.0/src/boost-1.53.0 -I/mesos/build/3rdparty/elfio-3.2/src/elfio-3.2 -I/mesos/build/3rdparty/glog-0.3.3/src/glog-0.3.3-lib/lib/include -I/mesos/build/3rdparty/nvml-352.79/src/nvml-352.79 -I/mesos/build/3rdparty/picojson-1.3.0/src/picojson-1.3.0 -I/mesos/build/3rdparty/protobuf-2.6.1/src/protobuf-2.6.1-lib/lib/include -I/usr/include/subversion-1 -I/mesos/3rdparty/libprocess/src/tests/src -I/mesos/3rdparty/libprocess/include -I/mesos/build/3rdparty/http_parser-2.6.2/src/http_parser-2.6.2 -I/mesos/build/3rdparty/libevent-2.1.5-beta/src/libevent-2.1.5-beta-lib/lib/include -I/mesos/build/3rdparty/gmock-1.7.0/src/gmock-1.7.0/include -I/mesos/build/3rdparty/gmock-1.7.0/src/gmock-1.7.0/gtest/include    -o CMakeFiles/libprocess-tests.dir/owned_tests.cpp.o -c /mesos/3rdparty/libprocess/src/tests/owned_tests.cpp
/usr/bin/cmake -E cmake_progress_report /mesos/build/CMakeFiles 
[ 42%] Building CXX object src/CMakeFiles/mesos-1.2.0.dir/slave/containerizer/docker.cpp.o
cd /mesos/build/src && /usr/bin/clang++-3.5   -DBUILD_DATE="\"2016-3-3 10:20\"" -DBUILD_FLAGS=\"\" -DBUILD_JAVA_JVM_LIBRARY=\"\" -DBUILD_TIME=\"1111100\" -DBUILD_USER=\"frank\" -DHAS_AUTHENTICATION=1 -DLIBDIR=\"/usr/local/libmesos\" -DPICOJSON_USE_INT64 -DPKGDATADIR=\"/usr/local/share/mesos\" -DPKGLIBEXECDIR=\"/usr/local/libexec/mesos\" -DUSE_STATIC_LIB -DVERSION=\"1.2.0\" -D__STDC_FORMAT_MACROS -Dmesos_1_2_0_EXPORTS -O2 -std=c++11 -g -fPIC -I/mesos/build/include -I/mesos/build/include/mesos -I/mesos/build/src -I/mesos/src -I/mesos/build/3rdparty/protobuf-2.6.1/src/protobuf-2.6.1-lib/lib/include -I/mesos/include -I/mesos/3rdparty/stout/include -I/usr/include/apr-1.0 -I/mesos/build/3rdparty/boost-1.53.0/src/boost-1.53.0 -I/mesos/build/3rdparty/elfio-3.2/src/elfio-3.2 -I/mesos/build/3rdparty/glog-0.3.3/src/glog-0.3.3-lib/lib/include -I/mesos/build/3rdparty/nvml-352.79/src/nvml-352.79 -I/mesos/build/3rdparty/picojson-1.3.0/src/picojson-1.3.0 -I/usr/include/subversion-1 -I/mesos/src/src -I/mesos/3rdparty/libprocess/include -I/mesos/build/3rdparty/http_parser-2.6.2/src/http_parser-2.6.2 -I/mesos/build/3rdparty/libevent-2.1.5-beta/src/libevent-2.1.5-beta-lib/lib/include -I/mesos/build/3rdparty/zookeeper-3.4.8/src/zookeeper-3.4.8/src/c/include -I/mesos/build/3rdparty/zookeeper-3.4.8/src/zookeeper-3.4.8/src/c/generated -I/mesos/build/3rdparty/leveldb-1.4/src/leveldb-1.4/include    -o CMakeFiles/mesos-1.2.0.dir/slave/containerizer/docker.cpp.o -c /mesos/src/slave/containerizer/docker.cpp
/usr/bin/cmake -E cmake_progress_report /mesos/build/CMakeFiles 
[ 42%] Building CXX object src/CMakeFiles/mesos-1.2.0.dir/slave/containerizer/fetcher.cpp.o
cd /mesos/build/src && /usr/bin/clang++-3.5   -DBUILD_DATE="\"2016-3-3 10:20\"" -DBUILD_FLAGS=\"\" -DBUILD_JAVA_JVM_LIBRARY=\"\" -DBUILD_TIME=\"1111100\" -DBUILD_USER=\"frank\" -DHAS_AUTHENTICATION=1 -DLIBDIR=\"/usr/local/libmesos\" -DPICOJSON_USE_INT64 -DPKGDATADIR=\"/usr/local/share/mesos\" -DPKGLIBEXECDIR=\"/usr/local/libexec/mesos\" -DUSE_STATIC_LIB -DVERSION=\"1.2.0\" -D__STDC_FORMAT_MACROS -Dmesos_1_2_0_EXPORTS -O2 -std=c++11 -g -fPIC -I/mesos/build/include -I/mesos/build/include/mesos -I/mesos/build/src -I/mesos/src -I/mesos/build/3rdparty/protobuf-2.6.1/src/protobuf-2.6.1-lib/lib/include -I/mesos/include -I/mesos/3rdparty/stout/include -I/usr/include/apr-1.0 -I/mesos/build/3rdparty/boost-1.53.0/src/boost-1.53.0 -I/mesos/build/3rdparty/elfio-3.2/src/elfio-3.2 -I/mesos/build/3rdparty/glog-0.3.3/src/glog-0.3.3-lib/lib/include -I/mesos/build/3rdparty/nvml-352.79/src/nvml-352.79 -I/mesos/build/3rdparty/picojson-1.3.0/src/picojson-1.3.0 -I/usr/include/subversion-1 -I/mesos/src/src -I/mesos/3rdparty/libprocess/include -I/mesos/build/3rdparty/http_parser-2.6.2/src/http_parser-2.6.2 -I/mesos/build/3rdparty/libevent-2.1.5-beta/src/libevent-2.1.5-beta-lib/lib/include -I/mesos/build/3rdparty/zookeeper-3.4.8/src/zookeeper-3.4.8/src/c/include -I/mesos/build/3rdparty/zookeeper-3.4.8/src/zookeeper-3.4.8/src/c/generated -I/mesos/build/3rdparty/leveldb-1.4/src/leveldb-1.4/include    -o CMakeFiles/mesos-1.2.0.dir/slave/containerizer/fetcher.cpp.o -c /mesos/src/slave/containerizer/fetcher.cpp
/usr/bin/cmake -E cmake_progress_report /mesos/build/CMakeFiles 
[ 42%] Building CXX object src/CMakeFiles/mesos-1.2.0.dir/slave/containerizer/mesos/containerizer.cpp.o
cd /mesos/build/src && /usr/bin/clang++-3.5   -DBUILD_DATE="\"2016-3-3 10:20\"" -DBUILD_FLAGS=\"\" -DBUILD_JAVA_JVM_LIBRARY=\"\" -DBUILD_TIME=\"1111100\" -DBUILD_USER=\"frank\" -DHAS_AUTHENTICATION=1 -DLIBDIR=\"/usr/local/libmesos\" -DPICOJSON_USE_INT64 -DPKGDATADIR=\"/usr/local/share/mesos\" -DPKGLIBEXECDIR=\"/usr/local/libexec/mesos\" -DUSE_STATIC_LIB -DVERSION=\"1.2.0\" -D__STDC_FORMAT_MACROS -Dmesos_1_2_0_EXPORTS -O2 -std=c++11 -g -fPIC -I/mesos/build/include -I/mesos/build/include/mesos -I/mesos/build/src -I/mesos/src -I/mesos/build/3rdparty/protobuf-2.6.1/src/protobuf-2.6.1-lib/lib/include -I/mesos/include -I/mesos/3rdparty/stout/include -I/usr/include/apr-1.0 -I/mesos/build/3rdparty/boost-1.53.0/src/boost-1.53.0 -I/mesos/build/3rdparty/elfio-3.2/src/elfio-3.2 -I/mesos/build/3rdparty/glog-0.3.3/src/glog-0.3.3-lib/lib/include -I/mesos/build/3rdparty/nvml-352.79/src/nvml-352.79 -I/mesos/build/3rdparty/picojson-1.3.0/src/picojson-1.3.0 -I/usr/include/subversion-1 -I/mesos/src/src -I/mesos/3rdparty/libprocess/include -I/mesos/build/3rdparty/http_parser-2.6.2/src/http_parser-2.6.2 -I/mesos/build/3rdparty/libevent-2.1.5-beta/src/libevent-2.1.5-beta-lib/lib/include -I/mesos/build/3rdparty/zookeeper-3.4.8/src/zookeeper-3.4.8/src/c/include -I/mesos/build/3rdparty/zookeeper-3.4.8/src/zookeeper-3.4.8/src/c/generated -I/mesos/build/3rdparty/leveldb-1.4/src/leveldb-1.4/include    -o CMakeFiles/mesos-1.2.0.dir/slave/containerizer/mesos/containerizer.cpp.o -c /mesos/src/slave/containerizer/mesos/containerizer.cpp
/usr/bin/cmake -E cmake_progress_report /mesos/build/CMakeFiles 12
[ 43%] Building CXX object 3rdparty/libprocess/src/tests/CMakeFiles/libprocess-tests.dir/process_tests.cpp.o
cd /mesos/build/3rdparty/libprocess/src/tests && /usr/bin/clang++-3.5   -DBUILD_DIR=\"/mesos/build/3rdparty/libprocess/src/tests\" -DHAS_AUTHENTICATION=1 -DLIBDIR=\"/usr/local/libmesos\" -DPICOJSON_USE_INT64 -DPKGDATADIR=\"/usr/local/share/mesos\" -DPKGLIBEXECDIR=\"/usr/local/libexec/mesos\" -DVERSION=\"1.2.0\" -D__STDC_FORMAT_MACROS -O2 -std=c++11 -g -fPIE -I/mesos/3rdparty/libprocess/src/tests/.. -I/mesos/3rdparty/stout/include -I/usr/include/apr-1.0 -I/mesos/build/3rdparty/boost-1.53.0/src/boost-1.53.0 -I/mesos/build/3rdparty/elfio-3.2/src/elfio-3.2 -I/mesos/build/3rdparty/glog-0.3.3/src/glog-0.3.3-lib/lib/include -I/mesos/build/3rdparty/nvml-352.79/src/nvml-352.79 -I/mesos/build/3rdparty/picojson-1.3.0/src/picojson-1.3.0 -I/mesos/build/3rdparty/protobuf-2.6.1/src/protobuf-2.6.1-lib/lib/include -I/usr/include/subversion-1 -I/mesos/3rdparty/libprocess/src/tests/src -I/mesos/3rdparty/libprocess/include -I/mesos/build/3rdparty/http_parser-2.6.2/src/http_parser-2.6.2 -I/mesos/build/3rdparty/libevent-2.1.5-beta/src/libevent-2.1.5-beta-lib/lib/include -I/mesos/build/3rdparty/gmock-1.7.0/src/gmock-1.7.0/include -I/mesos/build/3rdparty/gmock-1.7.0/src/gmock-1.7.0/gtest/include    -o CMakeFiles/libprocess-tests.dir/process_tests.cpp.o -c /mesos/3rdparty/libprocess/src/tests/process_tests.cpp
/usr/bin/cmake -E cmake_progress_report /mesos/build/CMakeFiles 18
[ 44%] Building CXX object src/CMakeFiles/mesos-1.2.0.dir/slave/containerizer/mesos/isolator.cpp.o
cd /mesos/build/src && /usr/bin/clang++-3.5   -DBUILD_DATE="\"2016-3-3 10:20\"" -DBUILD_FLAGS=\"\" -DBUILD_JAVA_JVM_LIBRARY=\"\" -DBUILD_TIME=\"1111100\" -DBUILD_USER=\"frank\" -DHAS_AUTHENTICATION=1 -DLIBDIR=\"/usr/local/libmesos\" -DPICOJSON_USE_INT64 -DPKGDATADIR=\"/usr/local/share/mesos\" -DPKGLIBEXECDIR=\"/usr/local/libexec/mesos\" -DUSE_STATIC_LIB -DVERSION=\"1.2.0\" -D__STDC_FORMAT_MACROS -Dmesos_1_2_0_EXPORTS -O2 -std=c++11 -g -fPIC -I/mesos/build/include -I/mesos/build/include/mesos -I/mesos/build/src -I/mesos/src -I/mesos/build/3rdparty/protobuf-2.6.1/src/protobuf-2.6.1-lib/lib/include -I/mesos/include -I/mesos/3rdparty/stout/include -I/usr/include/apr-1.0 -I/mesos/build/3rdparty/boost-1.53.0/src/boost-1.53.0 -I/mesos/build/3rdparty/elfio-3.2/src/elfio-3.2 -I/mesos/build/3rdparty/glog-0.3.3/src/glog-0.3.3-lib/lib/include -I/mesos/build/3rdparty/nvml-352.79/src/nvml-352.79 -I/mesos/build/3rdparty/picojson-1.3.0/src/picojson-1.3.0 -I/usr/include/subversion-1 -I/mesos/src/src -I/mesos/3rdparty/libprocess/include -I/mesos/build/3rdparty/http_parser-2.6.2/src/http_parser-2.6.2 -I/mesos/build/3rdparty/libevent-2.1.5-beta/src/libevent-2.1.5-beta-lib/lib/include -I/mesos/build/3rdparty/zookeeper-3.4.8/src/zookeeper-3.4.8/src/c/include -I/mesos/build/3rdparty/zookeeper-3.4.8/src/zookeeper-3.4.8/src/c/generated -I/mesos/build/3rdparty/leveldb-1.4/src/leveldb-1.4/include    -o CMakeFiles/mesos-1.2.0.dir/slave/containerizer/mesos/isolator.cpp.o -c /mesos/src/slave/containerizer/mesos/isolator.cpp
/usr/bin/cmake -E cmake_progress_report /mesos/build/CMakeFiles 
[ 44%] Building CXX object 3rdparty/libprocess/src/tests/CMakeFiles/libprocess-tests.dir/queue_tests.cpp.o
cd /mesos/build/3rdparty/libprocess/src/tests && /usr/bin/clang++-3.5   -DBUILD_DIR=\"/mesos/build/3rdparty/libprocess/src/tests\" -DHAS_AUTHENTICATION=1 -DLIBDIR=\"/usr/local/libmesos\" -DPICOJSON_USE_INT64 -DPKGDATADIR=\"/usr/local/share/mesos\" -DPKGLIBEXECDIR=\"/usr/local/libexec/mesos\" -DVERSION=\"1.2.0\" -D__STDC_FORMAT_MACROS -O2 -std=c++11 -g -fPIE -I/mesos/3rdparty/libprocess/src/tests/.. -I/mesos/3rdparty/stout/include -I/usr/include/apr-1.0 -I/mesos/build/3rdparty/boost-1.53.0/src/boost-1.53.0 -I/mesos/build/3rdparty/elfio-3.2/src/elfio-3.2 -I/mesos/build/3rdparty/glog-0.3.3/src/glog-0.3.3-lib/lib/include -I/mesos/build/3rdparty/nvml-352.79/src/nvml-352.79 -I/mesos/build/3rdparty/picojson-1.3.0/src/picojson-1.3.0 -I/mesos/build/3rdparty/protobuf-2.6.1/src/protobuf-2.6.1-lib/lib/include -I/usr/include/subversion-1 -I/mesos/3rdparty/libprocess/src/tests/src -I/mesos/3rdparty/libprocess/include -I/mesos/build/3rdparty/http_parser-2.6.2/src/http_parser-2.6.2 -I/mesos/build/3rdparty/libevent-2.1.5-beta/src/libevent-2.1.5-beta-lib/lib/include -I/mesos/build/3rdparty/gmock-1.7.0/src/gmock-1.7.0/include -I/mesos/build/3rdparty/gmock-1.7.0/src/gmock-1.7.0/gtest/include    -o CMakeFiles/libprocess-tests.dir/queue_tests.cpp.o -c /mesos/3rdparty/libprocess/src/tests/queue_tests.cpp
/usr/bin/cmake -E cmake_progress_report /mesos/build/CMakeFiles 
[ 44%] Building CXX object src/CMakeFiles/mesos-1.2.0.dir/slave/containerizer/mesos/launch.cpp.o
cd /mesos/build/src && /usr/bin/clang++-3.5   -DBUILD_DATE="\"2016-3-3 10:20\"" -DBUILD_FLAGS=\"\" -DBUILD_JAVA_JVM_LIBRARY=\"\" -DBUILD_TIME=\"1111100\" -DBUILD_USER=\"frank\" -DHAS_AUTHENTICATION=1 -DLIBDIR=\"/usr/local/libmesos\" -DPICOJSON_USE_INT64 -DPKGDATADIR=\"/usr/local/share/mesos\" -DPKGLIBEXECDIR=\"/usr/local/libexec/mesos\" -DUSE_STATIC_LIB -DVERSION=\"1.2.0\" -D__STDC_FORMAT_MACROS -Dmesos_1_2_0_EXPORTS -O2 -std=c++11 -g -fPIC -I/mesos/build/include -I/mesos/build/include/mesos -I/mesos/build/src -I/mesos/src -I/mesos/build/3rdparty/protobuf-2.6.1/src/protobuf-2.6.1-lib/lib/include -I/mesos/include -I/mesos/3rdparty/stout/include -I/usr/include/apr-1.0 -I/mesos/build/3rdparty/boost-1.53.0/src/boost-1.53.0 -I/mesos/build/3rdparty/elfio-3.2/src/elfio-3.2 -I/mesos/build/3rdparty/glog-0.3.3/src/glog-0.3.3-lib/lib/include -I/mesos/build/3rdparty/nvml-352.79/src/nvml-352.79 -I/mesos/build/3rdparty/picojson-1.3.0/src/picojson-1.3.0 -I/usr/include/subversion-1 -I/mesos/src/src -I/mesos/3rdparty/libprocess/include -I/mesos/build/3rdparty/http_parser-2.6.2/src/http_parser-2.6.2 -I/mesos/build/3rdparty/libevent-2.1.5-beta/src/libevent-2.1.5-beta-lib/lib/include -I/mesos/build/3rdparty/zookeeper-3.4.8/src/zookeeper-3.4.8/src/c/include -I/mesos/build/3rdparty/zookeeper-3.4.8/src/zookeeper-3.4.8/src/c/generated -I/mesos/build/3rdparty/leveldb-1.4/src/leveldb-1.4/include    -o CMakeFiles/mesos-1.2.0.dir/slave/containerizer/mesos/launch.cpp.o -c /mesos/src/slave/containerizer/mesos/launch.cpp
/usr/bin/cmake -E cmake_progress_report /mesos/build/CMakeFiles 
[ 44%] Building CXX object src/CMakeFiles/mesos-1.2.0.dir/slave/containerizer/mesos/launcher.cpp.o
cd /mesos/build/src && /usr/bin/clang++-3.5   -DBUILD_DATE="\"2016-3-3 10:20\"" -DBUILD_FLAGS=\"\" -DBUILD_JAVA_JVM_LIBRARY=\"\" -DBUILD_TIME=\"1111100\" -DBUILD_USER=\"frank\" -DHAS_AUTHENTICATION=1 -DLIBDIR=\"/usr/local/libmesos\" -DPICOJSON_USE_INT64 -DPKGDATADIR=\"/usr/local/share/mesos\" -DPKGLIBEXECDIR=\"/usr/local/libexec/mesos\" -DUSE_STATIC_LIB -DVERSION=\"1.2.0\" -D__STDC_FORMAT_MACROS -Dmesos_1_2_0_EXPORTS -O2 -std=c++11 -g -fPIC -I/mesos/build/include -I/mesos/build/include/mesos -I/mesos/build/src -I/mesos/src -I/mesos/build/3rdparty/protobuf-2.6.1/src/protobuf-2.6.1-lib/lib/include -I/mesos/include -I/mesos/3rdparty/stout/include -I/usr/include/apr-1.0 -I/mesos/build/3rdparty/boost-1.53.0/src/boost-1.53.0 -I/mesos/build/3rdparty/elfio-3.2/src/elfio-3.2 -I/mesos/build/3rdparty/glog-0.3.3/src/glog-0.3.3-lib/lib/include -I/mesos/build/3rdparty/nvml-352.79/src/nvml-352.79 -I/mesos/build/3rdparty/picojson-1.3.0/src/picojson-1.3.0 -I/usr/include/subversion-1 -I/mesos/src/src -I/mesos/3rdparty/libprocess/include -I/mesos/build/3rdparty/http_parser-2.6.2/src/http_parser-2.6.2 -I/mesos/build/3rdparty/libevent-2.1.5-beta/src/libevent-2.1.5-beta-lib/lib/include -I/mesos/build/3rdparty/zookeeper-3.4.8/src/zookeeper-3.4.8/src/c/include -I/mesos/build/3rdparty/zookeeper-3.4.8/src/zookeeper-3.4.8/src/c/generated -I/mesos/build/3rdparty/leveldb-1.4/src/leveldb-1.4/include    -o CMakeFiles/mesos-1.2.0.dir/slave/containerizer/mesos/launcher.cpp.o -c /mesos/src/slave/containerizer/mesos/launcher.cpp
/usr/bin/cmake -E cmake_progress_report /mesos/build/CMakeFiles 
[ 44%] Building CXX object 3rdparty/libprocess/src/tests/CMakeFiles/libprocess-tests.dir/sequence_tests.cpp.o
cd /mesos/build/3rdparty/libprocess/src/tests && /usr/bin/clang++-3.5   -DBUILD_DIR=\"/mesos/build/3rdparty/libprocess/src/tests\" -DHAS_AUTHENTICATION=1 -DLIBDIR=\"/usr/local/libmesos\" -DPICOJSON_USE_INT64 -DPKGDATADIR=\"/usr/local/share/mesos\" -DPKGLIBEXECDIR=\"/usr/local/libexec/mesos\" -DVERSION=\"1.2.0\" -D__STDC_FORMAT_MACROS -O2 -std=c++11 -g -fPIE -I/mesos/3rdparty/libprocess/src/tests/.. -I/mesos/3rdparty/stout/include -I/usr/include/apr-1.0 -I/mesos/build/3rdparty/boost-1.53.0/src/boost-1.53.0 -I/mesos/build/3rdparty/elfio-3.2/src/elfio-3.2 -I/mesos/build/3rdparty/glog-0.3.3/src/glog-0.3.3-lib/lib/include -I/mesos/build/3rdparty/nvml-352.79/src/nvml-352.79 -I/mesos/build/3rdparty/picojson-1.3.0/src/picojson-1.3.0 -I/mesos/build/3rdparty/protobuf-2.6.1/src/protobuf-2.6.1-lib/lib/include -I/usr/include/subversion-1 -I/mesos/3rdparty/libprocess/src/tests/src -I/mesos/3rdparty/libprocess/include -I/mesos/build/3rdparty/http_parser-2.6.2/src/http_parser-2.6.2 -I/mesos/build/3rdparty/libevent-2.1.5-beta/src/libevent-2.1.5-beta-lib/lib/include -I/mesos/build/3rdparty/gmock-1.7.0/src/gmock-1.7.0/include -I/mesos/build/3rdparty/gmock-1.7.0/src/gmock-1.7.0/gtest/include    -o CMakeFiles/libprocess-tests.dir/sequence_tests.cpp.o -c /mesos/3rdparty/libprocess/src/tests/sequence_tests.cpp
/usr/bin/cmake -E cmake_progress_report /mesos/build/CMakeFiles 
[ 44%] Building CXX object src/CMakeFiles/mesos-1.2.0.dir/slave/containerizer/mesos/mount.cpp.o
cd /mesos/build/src && /usr/bin/clang++-3.5   -DBUILD_DATE="\"2016-3-3 10:20\"" -DBUILD_FLAGS=\"\" -DBUILD_JAVA_JVM_LIBRARY=\"\" -DBUILD_TIME=\"1111100\" -DBUILD_USER=\"frank\" -DHAS_AUTHENTICATION=1 -DLIBDIR=\"/usr/local/libmesos\" -DPICOJSON_USE_INT64 -DPKGDATADIR=\"/usr/local/share/mesos\" -DPKGLIBEXECDIR=\"/usr/local/libexec/mesos\" -DUSE_STATIC_LIB -DVERSION=\"1.2.0\" -D__STDC_FORMAT_MACROS -Dmesos_1_2_0_EXPORTS -O2 -std=c++11 -g -fPIC -I/mesos/build/include -I/mesos/build/include/mesos -I/mesos/build/src -I/mesos/src -I/mesos/build/3rdparty/protobuf-2.6.1/src/protobuf-2.6.1-lib/lib/include -I/mesos/include -I/mesos/3rdparty/stout/include -I/usr/include/apr-1.0 -I/mesos/build/3rdparty/boost-1.53.0/src/boost-1.53.0 -I/mesos/build/3rdparty/elfio-3.2/src/elfio-3.2 -I/mesos/build/3rdparty/glog-0.3.3/src/glog-0.3.3-lib/lib/include -I/mesos/build/3rdparty/nvml-352.79/src/nvml-352.79 -I/mesos/build/3rdparty/picojson-1.3.0/src/picojson-1.3.0 -I/usr/include/subversion-1 -I/mesos/src/src -I/mesos/3rdparty/libprocess/include -I/mesos/build/3rdparty/http_parser-2.6.2/src/http_parser-2.6.2 -I/mesos/build/3rdparty/libevent-2.1.5-beta/src/libevent-2.1.5-beta-lib/lib/include -I/mesos/build/3rdparty/zookeeper-3.4.8/src/zookeeper-3.4.8/src/c/include -I/mesos/build/3rdparty/zookeeper-3.4.8/src/zookeeper-3.4.8/src/c/generated -I/mesos/build/3rdparty/leveldb-1.4/src/leveldb-1.4/include    -o CMakeFiles/mesos-1.2.0.dir/slave/containerizer/mesos/mount.cpp.o -c /mesos/src/slave/containerizer/mesos/mount.cpp
/usr/bin/cmake -E cmake_progress_report /mesos/build/CMakeFiles 
[ 44%] Building CXX object src/CMakeFiles/mesos-1.2.0.dir/slave/containerizer/mesos/paths.cpp.o
cd /mesos/build/src && /usr/bin/clang++-3.5   -DBUILD_DATE="\"2016-3-3 10:20\"" -DBUILD_FLAGS=\"\" -DBUILD_JAVA_JVM_LIBRARY=\"\" -DBUILD_TIME=\"1111100\" -DBUILD_USER=\"frank\" -DHAS_AUTHENTICATION=1 -DLIBDIR=\"/usr/local/libmesos\" -DPICOJSON_USE_INT64 -DPKGDATADIR=\"/usr/local/share/mesos\" -DPKGLIBEXECDIR=\"/usr/local/libexec/mesos\" -DUSE_STATIC_LIB -DVERSION=\"1.2.0\" -D__STDC_FORMAT_MACROS -Dmesos_1_2_0_EXPORTS -O2 -std=c++11 -g -fPIC -I/mesos/build/include -I/mesos/build/include/mesos -I/mesos/build/src -I/mesos/src -I/mesos/build/3rdparty/protobuf-2.6.1/src/protobuf-2.6.1-lib/lib/include -I/mesos/include -I/mesos/3rdparty/stout/include -I/usr/include/apr-1.0 -I/mesos/build/3rdparty/boost-1.53.0/src/boost-1.53.0 -I/mesos/build/3rdparty/elfio-3.2/src/elfio-3.2 -I/mesos/build/3rdparty/glog-0.3.3/src/glog-0.3.3-lib/lib/include -I/mesos/build/3rdparty/nvml-352.79/src/nvml-352.79 -I/mesos/build/3rdparty/picojson-1.3.0/src/picojson-1.3.0 -I/usr/include/subversion-1 -I/mesos/src/src -I/mesos/3rdparty/libprocess/include -I/mesos/build/3rdparty/http_parser-2.6.2/src/http_parser-2.6.2 -I/mesos/build/3rdparty/libevent-2.1.5-beta/src/libevent-2.1.5-beta-lib/lib/include -I/mesos/build/3rdparty/zookeeper-3.4.8/src/zookeeper-3.4.8/src/c/include -I/mesos/build/3rdparty/zookeeper-3.4.8/src/zookeeper-3.4.8/src/c/generated -I/mesos/build/3rdparty/leveldb-1.4/src/leveldb-1.4/include    -o CMakeFiles/mesos-1.2.0.dir/slave/containerizer/mesos/paths.cpp.o -c /mesos/src/slave/containerizer/mesos/paths.cpp
/usr/bin/cmake -E cmake_progress_report /mesos/build/CMakeFiles 
[ 44%] Building CXX object src/CMakeFiles/mesos-1.2.0.dir/slave/containerizer/mesos/utils.cpp.o
cd /mesos/build/src && /usr/bin/clang++-3.5   -DBUILD_DATE="\"2016-3-3 10:20\"" -DBUILD_FLAGS=\"\" -DBUILD_JAVA_JVM_LIBRARY=\"\" -DBUILD_TIME=\"1111100\" -DBUILD_USER=\"frank\" -DHAS_AUTHENTICATION=1 -DLIBDIR=\"/usr/local/libmesos\" -DPICOJSON_USE_INT64 -DPKGDATADIR=\"/usr/local/share/mesos\" -DPKGLIBEXECDIR=\"/usr/local/libexec/mesos\" -DUSE_STATIC_LIB -DVERSION=\"1.2.0\" -D__STDC_FORMAT_MACROS -Dmesos_1_2_0_EXPORTS -O2 -std=c++11 -g -fPIC -I/mesos/build/include -I/mesos/build/include/mesos -I/mesos/build/src -I/mesos/src -I/mesos/build/3rdparty/protobuf-2.6.1/src/protobuf-2.6.1-lib/lib/include -I/mesos/include -I/mesos/3rdparty/stout/include -I/usr/include/apr-1.0 -I/mesos/build/3rdparty/boost-1.53.0/src/boost-1.53.0 -I/mesos/build/3rdparty/elfio-3.2/src/elfio-3.2 -I/mesos/build/3rdparty/glog-0.3.3/src/glog-0.3.3-lib/lib/include -I/mesos/build/3rdparty/nvml-352.79/src/nvml-352.79 -I/mesos/build/3rdparty/picojson-1.3.0/src/picojson-1.3.0 -I/usr/include/subversion-1 -I/mesos/src/src -I/mesos/3rdparty/libprocess/include -I/mesos/build/3rdparty/http_parser-2.6.2/src/http_parser-2.6.2 -I/mesos/build/3rdparty/libevent-2.1.5-beta/src/libevent-2.1.5-beta-lib/lib/include -I/mesos/build/3rdparty/zookeeper-3.4.8/src/zookeeper-3.4.8/src/c/include -I/mesos/build/3rdparty/zookeeper-3.4.8/src/zookeeper-3.4.8/src/c/generated -I/mesos/build/3rdparty/leveldb-1.4/src/leveldb-1.4/include    -o CMakeFiles/mesos-1.2.0.dir/slave/containerizer/mesos/utils.cpp.o -c /mesos/src/slave/containerizer/mesos/utils.cpp
/usr/bin/cmake -E cmake_progress_report /mesos/build/CMakeFiles 
[ 44%] Building CXX object 3rdparty/libprocess/src/tests/CMakeFiles/libprocess-tests.dir/shared_tests.cpp.o
cd /mesos/build/3rdparty/libprocess/src/tests && /usr/bin/clang++-3.5   -DBUILD_DIR=\"/mesos/build/3rdparty/libprocess/src/tests\" -DHAS_AUTHENTICATION=1 -DLIBDIR=\"/usr/local/libmesos\" -DPICOJSON_USE_INT64 -DPKGDATADIR=\"/usr/local/share/mesos\" -DPKGLIBEXECDIR=\"/usr/local/libexec/mesos\" -DVERSION=\"1.2.0\" -D__STDC_FORMAT_MACROS -O2 -std=c++11 -g -fPIE -I/mesos/3rdparty/libprocess/src/tests/.. -I/mesos/3rdparty/stout/include -I/usr/include/apr-1.0 -I/mesos/build/3rdparty/boost-1.53.0/src/boost-1.53.0 -I/mesos/build/3rdparty/elfio-3.2/src/elfio-3.2 -I/mesos/build/3rdparty/glog-0.3.3/src/glog-0.3.3-lib/lib/include -I/mesos/build/3rdparty/nvml-352.79/src/nvml-352.79 -I/mesos/build/3rdparty/picojson-1.3.0/src/picojson-1.3.0 -I/mesos/build/3rdparty/protobuf-2.6.1/src/protobuf-2.6.1-lib/lib/include -I/usr/include/subversion-1 -I/mesos/3rdparty/libprocess/src/tests/src -I/mesos/3rdparty/libprocess/include -I/mesos/build/3rdparty/http_parser-2.6.2/src/http_parser-2.6.2 -I/mesos/build/3rdparty/libevent-2.1.5-beta/src/libevent-2.1.5-beta-lib/lib/include -I/mesos/build/3rdparty/gmock-1.7.0/src/gmock-1.7.0/include -I/mesos/build/3rdparty/gmock-1.7.0/src/gmock-1.7.0/gtest/include    -o CMakeFiles/libprocess-tests.dir/shared_tests.cpp.o -c /mesos/3rdparty/libprocess/src/tests/shared_tests.cpp
/usr/bin/cmake -E cmake_progress_report /mesos/build/CMakeFiles 
[ 44%] Building CXX object 3rdparty/libprocess/src/tests/CMakeFiles/libprocess-tests.dir/socket_tests.cpp.o
cd /mesos/build/3rdparty/libprocess/src/tests && /usr/bin/clang++-3.5   -DBUILD_DIR=\"/mesos/build/3rdparty/libprocess/src/tests\" -DHAS_AUTHENTICATION=1 -DLIBDIR=\"/usr/local/libmesos\" -DPICOJSON_USE_INT64 -DPKGDATADIR=\"/usr/local/share/mesos\" -DPKGLIBEXECDIR=\"/usr/local/libexec/mesos\" -DVERSION=\"1.2.0\" -D__STDC_FORMAT_MACROS -O2 -std=c++11 -g -fPIE -I/mesos/3rdparty/libprocess/src/tests/.. -I/mesos/3rdparty/stout/include -I/usr/include/apr-1.0 -I/mesos/build/3rdparty/boost-1.53.0/src/boost-1.53.0 -I/mesos/build/3rdparty/elfio-3.2/src/elfio-3.2 -I/mesos/build/3rdparty/glog-0.3.3/src/glog-0.3.3-lib/lib/include -I/mesos/build/3rdparty/nvml-352.79/src/nvml-352.79 -I/mesos/build/3rdparty/picojson-1.3.0/src/picojson-1.3.0 -I/mesos/build/3rdparty/protobuf-2.6.1/src/protobuf-2.6.1-lib/lib/include -I/usr/include/subversion-1 -I/mesos/3rdparty/libprocess/src/tests/src -I/mesos/3rdparty/libprocess/include -I/mesos/build/3rdparty/http_parser-2.6.2/src/http_parser-2.6.2 -I/mesos/build/3rdparty/libevent-2.1.5-beta/src/libevent-2.1.5-beta-lib/lib/include -I/mesos/build/3rdparty/gmock-1.7.0/src/gmock-1.7.0/include -I/mesos/build/3rdparty/gmock-1.7.0/src/gmock-1.7.0/gtest/include    -o CMakeFiles/libprocess-tests.dir/socket_tests.cpp.o -c /mesos/3rdparty/libprocess/src/tests/socket_tests.cpp
/usr/bin/cmake -E cmake_progress_report /mesos/build/CMakeFiles 19
[ 45%] Building CXX object src/CMakeFiles/mesos-1.2.0.dir/slave/containerizer/mesos/io/switchboard.cpp.o
cd /mesos/build/src && /usr/bin/clang++-3.5   -DBUILD_DATE="\"2016-3-3 10:20\"" -DBUILD_FLAGS=\"\" -DBUILD_JAVA_JVM_LIBRARY=\"\" -DBUILD_TIME=\"1111100\" -DBUILD_USER=\"frank\" -DHAS_AUTHENTICATION=1 -DLIBDIR=\"/usr/local/libmesos\" -DPICOJSON_USE_INT64 -DPKGDATADIR=\"/usr/local/share/mesos\" -DPKGLIBEXECDIR=\"/usr/local/libexec/mesos\" -DUSE_STATIC_LIB -DVERSION=\"1.2.0\" -D__STDC_FORMAT_MACROS -Dmesos_1_2_0_EXPORTS -O2 -std=c++11 -g -fPIC -I/mesos/build/include -I/mesos/build/include/mesos -I/mesos/build/src -I/mesos/src -I/mesos/build/3rdparty/protobuf-2.6.1/src/protobuf-2.6.1-lib/lib/include -I/mesos/include -I/mesos/3rdparty/stout/include -I/usr/include/apr-1.0 -I/mesos/build/3rdparty/boost-1.53.0/src/boost-1.53.0 -I/mesos/build/3rdparty/elfio-3.2/src/elfio-3.2 -I/mesos/build/3rdparty/glog-0.3.3/src/glog-0.3.3-lib/lib/include -I/mesos/build/3rdparty/nvml-352.79/src/nvml-352.79 -I/mesos/build/3rdparty/picojson-1.3.0/src/picojson-1.3.0 -I/usr/include/subversion-1 -I/mesos/src/src -I/mesos/3rdparty/libprocess/include -I/mesos/build/3rdparty/http_parser-2.6.2/src/http_parser-2.6.2 -I/mesos/build/3rdparty/libevent-2.1.5-beta/src/libevent-2.1.5-beta-lib/lib/include -I/mesos/build/3rdparty/zookeeper-3.4.8/src/zookeeper-3.4.8/src/c/include -I/mesos/build/3rdparty/zookeeper-3.4.8/src/zookeeper-3.4.8/src/c/generated -I/mesos/build/3rdparty/leveldb-1.4/src/leveldb-1.4/include    -o CMakeFiles/mesos-1.2.0.dir/slave/containerizer/mesos/io/switchboard.cpp.o -c /mesos/src/slave/containerizer/mesos/io/switchboard.cpp
/usr/bin/cmake -E cmake_progress_report /mesos/build/CMakeFiles 
[ 45%] Building CXX object 3rdparty/libprocess/src/tests/CMakeFiles/libprocess-tests.dir/statistics_tests.cpp.o
cd /mesos/build/3rdparty/libprocess/src/tests && /usr/bin/clang++-3.5   -DBUILD_DIR=\"/mesos/build/3rdparty/libprocess/src/tests\" -DHAS_AUTHENTICATION=1 -DLIBDIR=\"/usr/local/libmesos\" -DPICOJSON_USE_INT64 -DPKGDATADIR=\"/usr/local/share/mesos\" -DPKGLIBEXECDIR=\"/usr/local/libexec/mesos\" -DVERSION=\"1.2.0\" -D__STDC_FORMAT_MACROS -O2 -std=c++11 -g -fPIE -I/mesos/3rdparty/libprocess/src/tests/.. -I/mesos/3rdparty/stout/include -I/usr/include/apr-1.0 -I/mesos/build/3rdparty/boost-1.53.0/src/boost-1.53.0 -I/mesos/build/3rdparty/elfio-3.2/src/elfio-3.2 -I/mesos/build/3rdparty/glog-0.3.3/src/glog-0.3.3-lib/lib/include -I/mesos/build/3rdparty/nvml-352.79/src/nvml-352.79 -I/mesos/build/3rdparty/picojson-1.3.0/src/picojson-1.3.0 -I/mesos/build/3rdparty/protobuf-2.6.1/src/protobuf-2.6.1-lib/lib/include -I/usr/include/subversion-1 -I/mesos/3rdparty/libprocess/src/tests/src -I/mesos/3rdparty/libprocess/include -I/mesos/build/3rdparty/http_parser-2.6.2/src/http_parser-2.6.2 -I/mesos/build/3rdparty/libevent-2.1.5-beta/src/libevent-2.1.5-beta-lib/lib/include -I/mesos/build/3rdparty/gmock-1.7.0/src/gmock-1.7.0/include -I/mesos/build/3rdparty/gmock-1.7.0/src/gmock-1.7.0/gtest/include    -o CMakeFiles/libprocess-tests.dir/statistics_tests.cpp.o -c /mesos/3rdparty/libprocess/src/tests/statistics_tests.cpp
/usr/bin/cmake -E cmake_progress_report /mesos/build/CMakeFiles 
[ 45%] Building CXX object src/CMakeFiles/mesos-1.2.0.dir/slave/containerizer/mesos/provisioner/backend.cpp.o
cd /mesos/build/src && /usr/bin/clang++-3.5   -DBUILD_DATE="\"2016-3-3 10:20\"" -DBUILD_FLAGS=\"\" -DBUILD_JAVA_JVM_LIBRARY=\"\" -DBUILD_TIME=\"1111100\" -DBUILD_USER=\"frank\" -DHAS_AUTHENTICATION=1 -DLIBDIR=\"/usr/local/libmesos\" -DPICOJSON_USE_INT64 -DPKGDATADIR=\"/usr/local/share/mesos\" -DPKGLIBEXECDIR=\"/usr/local/libexec/mesos\" -DUSE_STATIC_LIB -DVERSION=\"1.2.0\" -D__STDC_FORMAT_MACROS -Dmesos_1_2_0_EXPORTS -O2 -std=c++11 -g -fPIC -I/mesos/build/include -I/mesos/build/include/mesos -I/mesos/build/src -I/mesos/src -I/mesos/build/3rdparty/protobuf-2.6.1/src/protobuf-2.6.1-lib/lib/include -I/mesos/include -I/mesos/3rdparty/stout/include -I/usr/include/apr-1.0 -I/mesos/build/3rdparty/boost-1.53.0/src/boost-1.53.0 -I/mesos/build/3rdparty/elfio-3.2/src/elfio-3.2 -I/mesos/build/3rdparty/glog-0.3.3/src/glog-0.3.3-lib/lib/include -I/mesos/build/3rdparty/nvml-352.79/src/nvml-352.79 -I/mesos/build/3rdparty/picojson-1.3.0/src/picojson-1.3.0 -I/usr/include/subversion-1 -I/mesos/src/src -I/mesos/3rdparty/libprocess/include -I/mesos/build/3rdparty/http_parser-2.6.2/src/http_parser-2.6.2 -I/mesos/build/3rdparty/libevent-2.1.5-beta/src/libevent-2.1.5-beta-lib/lib/include -I/mesos/build/3rdparty/zookeeper-3.4.8/src/zookeeper-3.4.8/src/c/include -I/mesos/build/3rdparty/zookeeper-3.4.8/src/zookeeper-3.4.8/src/c/generated -I/mesos/build/3rdparty/leveldb-1.4/src/leveldb-1.4/include    -o CMakeFiles/mesos-1.2.0.dir/slave/containerizer/mesos/provisioner/backend.cpp.o -c /mesos/src/slave/containerizer/mesos/provisioner/backend.cpp
/usr/bin/cmake -E cmake_progress_report /mesos/build/CMakeFiles 13
[ 46%] Building CXX object 3rdparty/libprocess/src/tests/CMakeFiles/libprocess-tests.dir/subprocess_tests.cpp.o
cd /mesos/build/3rdparty/libprocess/src/tests && /usr/bin/clang++-3.5   -DBUILD_DIR=\"/mesos/build/3rdparty/libprocess/src/tests\" -DHAS_AUTHENTICATION=1 -DLIBDIR=\"/usr/local/libmesos\" -DPICOJSON_USE_INT64 -DPKGDATADIR=\"/usr/local/share/mesos\" -DPKGLIBEXECDIR=\"/usr/local/libexec/mesos\" -DVERSION=\"1.2.0\" -D__STDC_FORMAT_MACROS -O2 -std=c++11 -g -fPIE -I/mesos/3rdparty/libprocess/src/tests/.. -I/mesos/3rdparty/stout/include -I/usr/include/apr-1.0 -I/mesos/build/3rdparty/boost-1.53.0/src/boost-1.53.0 -I/mesos/build/3rdparty/elfio-3.2/src/elfio-3.2 -I/mesos/build/3rdparty/glog-0.3.3/src/glog-0.3.3-lib/lib/include -I/mesos/build/3rdparty/nvml-352.79/src/nvml-352.79 -I/mesos/build/3rdparty/picojson-1.3.0/src/picojson-1.3.0 -I/mesos/build/3rdparty/protobuf-2.6.1/src/protobuf-2.6.1-lib/lib/include -I/usr/include/subversion-1 -I/mesos/3rdparty/libprocess/src/tests/src -I/mesos/3rdparty/libprocess/include -I/mesos/build/3rdparty/http_parser-2.6.2/src/http_parser-2.6.2 -I/mesos/build/3rdparty/libevent-2.1.5-beta/src/libevent-2.1.5-beta-lib/lib/include -I/mesos/build/3rdparty/gmock-1.7.0/src/gmock-1.7.0/include -I/mesos/build/3rdparty/gmock-1.7.0/src/gmock-1.7.0/gtest/include    -o CMakeFiles/libprocess-tests.dir/subprocess_tests.cpp.o -c /mesos/3rdparty/libprocess/src/tests/subprocess_tests.cpp
/usr/bin/cmake -E cmake_progress_report /mesos/build/CMakeFiles 
[ 46%] Building CXX object 3rdparty/libprocess/src/tests/CMakeFiles/libprocess-tests.dir/system_tests.cpp.o
cd /mesos/build/3rdparty/libprocess/src/tests && /usr/bin/clang++-3.5   -DBUILD_DIR=\"/mesos/build/3rdparty/libprocess/src/tests\" -DHAS_AUTHENTICATION=1 -DLIBDIR=\"/usr/local/libmesos\" -DPICOJSON_USE_INT64 -DPKGDATADIR=\"/usr/local/share/mesos\" -DPKGLIBEXECDIR=\"/usr/local/libexec/mesos\" -DVERSION=\"1.2.0\" -D__STDC_FORMAT_MACROS -O2 -std=c++11 -g -fPIE -I/mesos/3rdparty/libprocess/src/tests/.. -I/mesos/3rdparty/stout/include -I/usr/include/apr-1.0 -I/mesos/build/3rdparty/boost-1.53.0/src/boost-1.53.0 -I/mesos/build/3rdparty/elfio-3.2/src/elfio-3.2 -I/mesos/build/3rdparty/glog-0.3.3/src/glog-0.3.3-lib/lib/include -I/mesos/build/3rdparty/nvml-352.79/src/nvml-352.79 -I/mesos/build/3rdparty/picojson-1.3.0/src/picojson-1.3.0 -I/mesos/build/3rdparty/protobuf-2.6.1/src/protobuf-2.6.1-lib/lib/include -I/usr/include/subversion-1 -I/mesos/3rdparty/libprocess/src/tests/src -I/mesos/3rdparty/libprocess/include -I/mesos/build/3rdparty/http_parser-2.6.2/src/http_parser-2.6.2 -I/mesos/build/3rdparty/libevent-2.1.5-beta/src/libevent-2.1.5-beta-lib/lib/include -I/mesos/build/3rdparty/gmock-1.7.0/src/gmock-1.7.0/include -I/mesos/build/3rdparty/gmock-1.7.0/src/gmock-1.7.0/gtest/include    -o CMakeFiles/libprocess-tests.dir/system_tests.cpp.o -c /mesos/3rdparty/libprocess/src/tests/system_tests.cpp
/usr/bin/cmake -E cmake_progress_report /mesos/build/CMakeFiles 
[ 46%] Building CXX object src/CMakeFiles/mesos-1.2.0.dir/slave/containerizer/mesos/provisioner/paths.cpp.o
cd /mesos/build/src && /usr/bin/clang++-3.5   -DBUILD_DATE="\"2016-3-3 10:20\"" -DBUILD_FLAGS=\"\" -DBUILD_JAVA_JVM_LIBRARY=\"\" -DBUILD_TIME=\"1111100\" -DBUILD_USER=\"frank\" -DHAS_AUTHENTICATION=1 -DLIBDIR=\"/usr/local/libmesos\" -DPICOJSON_USE_INT64 -DPKGDATADIR=\"/usr/local/share/mesos\" -DPKGLIBEXECDIR=\"/usr/local/libexec/mesos\" -DUSE_STATIC_LIB -DVERSION=\"1.2.0\" -D__STDC_FORMAT_MACROS -Dmesos_1_2_0_EXPORTS -O2 -std=c++11 -g -fPIC -I/mesos/build/include -I/mesos/build/include/mesos -I/mesos/build/src -I/mesos/src -I/mesos/build/3rdparty/protobuf-2.6.1/src/protobuf-2.6.1-lib/lib/include -I/mesos/include -I/mesos/3rdparty/stout/include -I/usr/include/apr-1.0 -I/mesos/build/3rdparty/boost-1.53.0/src/boost-1.53.0 -I/mesos/build/3rdparty/elfio-3.2/src/elfio-3.2 -I/mesos/build/3rdparty/glog-0.3.3/src/glog-0.3.3-lib/lib/include -I/mesos/build/3rdparty/nvml-352.79/src/nvml-352.79 -I/mesos/build/3rdparty/picojson-1.3.0/src/picojson-1.3.0 -I/usr/include/subversion-1 -I/mesos/src/src -I/mesos/3rdparty/libprocess/include -I/mesos/build/3rdparty/http_parser-2.6.2/src/http_parser-2.6.2 -I/mesos/build/3rdparty/libevent-2.1.5-beta/src/libevent-2.1.5-beta-lib/lib/include -I/mesos/build/3rdparty/zookeeper-3.4.8/src/zookeeper-3.4.8/src/c/include -I/mesos/build/3rdparty/zookeeper-3.4.8/src/zookeeper-3.4.8/src/c/generated -I/mesos/build/3rdparty/leveldb-1.4/src/leveldb-1.4/include    -o CMakeFiles/mesos-1.2.0.dir/slave/containerizer/mesos/provisioner/paths.cpp.o -c /mesos/src/slave/containerizer/mesos/provisioner/paths.cpp
/usr/bin/cmake -E cmake_progress_report /mesos/build/CMakeFiles 
[ 46%] Building CXX object src/CMakeFiles/mesos-1.2.0.dir/slave/containerizer/mesos/provisioner/provisioner.cpp.o
cd /mesos/build/src && /usr/bin/clang++-3.5   -DBUILD_DATE="\"2016-3-3 10:20\"" -DBUILD_FLAGS=\"\" -DBUILD_JAVA_JVM_LIBRARY=\"\" -DBUILD_TIME=\"1111100\" -DBUILD_USER=\"frank\" -DHAS_AUTHENTICATION=1 -DLIBDIR=\"/usr/local/libmesos\" -DPICOJSON_USE_INT64 -DPKGDATADIR=\"/usr/local/share/mesos\" -DPKGLIBEXECDIR=\"/usr/local/libexec/mesos\" -DUSE_STATIC_LIB -DVERSION=\"1.2.0\" -D__STDC_FORMAT_MACROS -Dmesos_1_2_0_EXPORTS -O2 -std=c++11 -g -fPIC -I/mesos/build/include -I/mesos/build/include/mesos -I/mesos/build/src -I/mesos/src -I/mesos/build/3rdparty/protobuf-2.6.1/src/protobuf-2.6.1-lib/lib/include -I/mesos/include -I/mesos/3rdparty/stout/include -I/usr/include/apr-1.0 -I/mesos/build/3rdparty/boost-1.53.0/src/boost-1.53.0 -I/mesos/build/3rdparty/elfio-3.2/src/elfio-3.2 -I/mesos/build/3rdparty/glog-0.3.3/src/glog-0.3.3-lib/lib/include -I/mesos/build/3rdparty/nvml-352.79/src/nvml-352.79 -I/mesos/build/3rdparty/picojson-1.3.0/src/picojson-1.3.0 -I/usr/include/subversion-1 -I/mesos/src/src -I/mesos/3rdparty/libprocess/include -I/mesos/build/3rdparty/http_parser-2.6.2/src/http_parser-2.6.2 -I/mesos/build/3rdparty/libevent-2.1.5-beta/src/libevent-2.1.5-beta-lib/lib/include -I/mesos/build/3rdparty/zookeeper-3.4.8/src/zookeeper-3.4.8/src/c/include -I/mesos/build/3rdparty/zookeeper-3.4.8/src/zookeeper-3.4.8/src/c/generated -I/mesos/build/3rdparty/leveldb-1.4/src/leveldb-1.4/include    -o CMakeFiles/mesos-1.2.0.dir/slave/containerizer/mesos/provisioner/provisioner.cpp.o -c /mesos/src/slave/containerizer/mesos/provisioner/provisioner.cpp
In file included from /mesos/src/slave/containerizer/mesos/io/switchboard.cpp:27:
In file included from /mesos/3rdparty/libprocess/include/process/collect.hpp:20:
In file included from /mesos/3rdparty/libprocess/include/process/check.hpp:21:
/mesos/3rdparty/libprocess/include/process/future.hpp:940:3: error: no matching member function for call to 'set'
  set(u);
  ^~~
/mesos/src/slave/containerizer/mesos/io/switchboard.cpp:1499:10: note: in instantiation of function template specialization 'process::Future<process::http::Response>::Future<process::Future<const process::http::Response> >' requested here
  return loop(
         ^
/mesos/3rdparty/libprocess/include/process/future.hpp:468:8: note: candidate function not viable: no known conversion from 'const process::Future<const process::http::Response>' to 'const process::http::Response' for 1st argument
  bool set(const T& _t);
       ^
/mesos/3rdparty/libprocess/include/process/future.hpp:469:8: note: candidate function not viable: no known conversion from 'const process::Future<const process::http::Response>' to 'process::http::Response' for 1st argument
  bool set(T&& _t);
       ^
1 error generated.
make[3]: *** [src/CMakeFiles/mesos-1.2.0.dir/slave/containerizer/mesos/io/switchboard.cpp.o] Error 1
make[3]: *** Waiting for unfinished jobs....
/usr/bin/cmake -E cmake_progress_report /mesos/build/CMakeFiles 
[ 46%] Building CXX object 3rdparty/libprocess/src/tests/CMakeFiles/libprocess-tests.dir/time_tests.cpp.o
cd /mesos/build/3rdparty/libprocess/src/tests && /usr/bin/clang++-3.5   -DBUILD_DIR=\"/mesos/build/3rdparty/libprocess/src/tests\" -DHAS_AUTHENTICATION=1 -DLIBDIR=\"/usr/local/libmesos\" -DPICOJSON_USE_INT64 -DPKGDATADIR=\"/usr/local/share/mesos\" -DPKGLIBEXECDIR=\"/usr/local/libexec/mesos\" -DVERSION=\"1.2.0\" -D__STDC_FORMAT_MACROS -O2 -std=c++11 -g -fPIE -I/mesos/3rdparty/libprocess/src/tests/.. -I/mesos/3rdparty/stout/include -I/usr/include/apr-1.0 -I/mesos/build/3rdparty/boost-1.53.0/src/boost-1.53.0 -I/mesos/build/3rdparty/elfio-3.2/src/elfio-3.2 -I/mesos/build/3rdparty/glog-0.3.3/src/glog-0.3.3-lib/lib/include -I/mesos/build/3rdparty/nvml-352.79/src/nvml-352.79 -I/mesos/build/3rdparty/picojson-1.3.0/src/picojson-1.3.0 -I/mesos/build/3rdparty/protobuf-2.6.1/src/protobuf-2.6.1-lib/lib/include -I/usr/include/subversion-1 -I/mesos/3rdparty/libprocess/src/tests/src -I/mesos/3rdparty/libprocess/include -I/mesos/build/3rdparty/http_parser-2.6.2/src/http_parser-2.6.2 -I/mesos/build/3rdparty/libevent-2.1.5-beta/src/libevent-2.1.5-beta-lib/lib/include -I/mesos/build/3rdparty/gmock-1.7.0/src/gmock-1.7.0/include -I/mesos/build/3rdparty/gmock-1.7.0/src/gmock-1.7.0/gtest/include    -o CMakeFiles/libprocess-tests.dir/time_tests.cpp.o -c /mesos/3rdparty/libprocess/src/tests/time_tests.cpp
/usr/bin/cmake -E cmake_progress_report /mesos/build/CMakeFiles 
[ 46%] Building CXX object 3rdparty/libprocess/src/tests/CMakeFiles/libprocess-tests.dir/timeseries_tests.cpp.o
cd /mesos/build/3rdparty/libprocess/src/tests && /usr/bin/clang++-3.5   -DBUILD_DIR=\"/mesos/build/3rdparty/libprocess/src/tests\" -DHAS_AUTHENTICATION=1 -DLIBDIR=\"/usr/local/libmesos\" -DPICOJSON_USE_INT64 -DPKGDATADIR=\"/usr/local/share/mesos\" -DPKGLIBEXECDIR=\"/usr/local/libexec/mesos\" -DVERSION=\"1.2.0\" -D__STDC_FORMAT_MACROS -O2 -std=c++11 -g -fPIE -I/mesos/3rdparty/libprocess/src/tests/.. -I/mesos/3rdparty/stout/include -I/usr/include/apr-1.0 -I/mesos/build/3rdparty/boost-1.53.0/src/boost-1.53.0 -I/mesos/build/3rdparty/elfio-3.2/src/elfio-3.2 -I/mesos/build/3rdparty/glog-0.3.3/src/glog-0.3.3-lib/lib/include -I/mesos/build/3rdparty/nvml-352.79/src/nvml-352.79 -I/mesos/build/3rdparty/picojson-1.3.0/src/picojson-1.3.0 -I/mesos/build/3rdparty/protobuf-2.6.1/src/protobuf-2.6.1-lib/lib/include -I/usr/include/subversion-1 -I/mesos/3rdparty/libprocess/src/tests/src -I/mesos/3rdparty/libprocess/include -I/mesos/build/3rdparty/http_parser-2.6.2/src/http_parser-2.6.2 -I/mesos/build/3rdparty/libevent-2.1.5-beta/src/libevent-2.1.5-beta-lib/lib/include -I/mesos/build/3rdparty/gmock-1.7.0/src/gmock-1.7.0/include -I/mesos/build/3rdparty/gmock-1.7.0/src/gmock-1.7.0/gtest/include    -o CMakeFiles/libprocess-tests.dir/timeseries_tests.cpp.o -c /mesos/3rdparty/libprocess/src/tests/timeseries_tests.cpp
/usr/bin/cmake -E cmake_progress_report /mesos/build/CMakeFiles 
[ 46%] Building CXX object 3rdparty/libprocess/src/tests/CMakeFiles/libprocess-tests.dir/io_tests.cpp.o
cd /mesos/build/3rdparty/libprocess/src/tests && /usr/bin/clang++-3.5   -DBUILD_DIR=\"/mesos/build/3rdparty/libprocess/src/tests\" -DHAS_AUTHENTICATION=1 -DLIBDIR=\"/usr/local/libmesos\" -DPICOJSON_USE_INT64 -DPKGDATADIR=\"/usr/local/share/mesos\" -DPKGLIBEXECDIR=\"/usr/local/libexec/mesos\" -DVERSION=\"1.2.0\" -D__STDC_FORMAT_MACROS -O2 -std=c++11 -g -fPIE -I/mesos/3rdparty/libprocess/src/tests/.. -I/mesos/3rdparty/stout/include -I/usr/include/apr-1.0 -I/mesos/build/3rdparty/boost-1.53.0/src/boost-1.53.0 -I/mesos/build/3rdparty/elfio-3.2/src/elfio-3.2 -I/mesos/build/3rdparty/glog-0.3.3/src/glog-0.3.3-lib/lib/include -I/mesos/build/3rdparty/nvml-352.79/src/nvml-352.79 -I/mesos/build/3rdparty/picojson-1.3.0/src/picojson-1.3.0 -I/mesos/build/3rdparty/protobuf-2.6.1/src/protobuf-2.6.1-lib/lib/include -I/usr/include/subversion-1 -I/mesos/3rdparty/libprocess/src/tests/src -I/mesos/3rdparty/libprocess/include -I/mesos/build/3rdparty/http_parser-2.6.2/src/http_parser-2.6.2 -I/mesos/build/3rdparty/libevent-2.1.5-beta/src/libevent-2.1.5-beta-lib/lib/include -I/mesos/build/3rdparty/gmock-1.7.0/src/gmock-1.7.0/include -I/mesos/build/3rdparty/gmock-1.7.0/src/gmock-1.7.0/gtest/include    -o CMakeFiles/libprocess-tests.dir/io_tests.cpp.o -c /mesos/3rdparty/libprocess/src/tests/io_tests.cpp
/usr/bin/cmake -E cmake_progress_report /mesos/build/CMakeFiles 
[ 46%] Building CXX object 3rdparty/libprocess/src/tests/CMakeFiles/libprocess-tests.dir/reap_tests.cpp.o
cd /mesos/build/3rdparty/libprocess/src/tests && /usr/bin/clang++-3.5   -DBUILD_DIR=\"/mesos/build/3rdparty/libprocess/src/tests\" -DHAS_AUTHENTICATION=1 -DLIBDIR=\"/usr/local/libmesos\" -DPICOJSON_USE_INT64 -DPKGDATADIR=\"/usr/local/share/mesos\" -DPKGLIBEXECDIR=\"/usr/local/libexec/mesos\" -DVERSION=\"1.2.0\" -D__STDC_FORMAT_MACROS -O2 -std=c++11 -g -fPIE -I/mesos/3rdparty/libprocess/src/tests/.. -I/mesos/3rdparty/stout/include -I/usr/include/apr-1.0 -I/mesos/build/3rdparty/boost-1.53.0/src/boost-1.53.0 -I/mesos/build/3rdparty/elfio-3.2/src/elfio-3.2 -I/mesos/build/3rdparty/glog-0.3.3/src/glog-0.3.3-lib/lib/include -I/mesos/build/3rdparty/nvml-352.79/src/nvml-352.79 -I/mesos/build/3rdparty/picojson-1.3.0/src/picojson-1.3.0 -I/mesos/build/3rdparty/protobuf-2.6.1/src/protobuf-2.6.1-lib/lib/include -I/usr/include/subversion-1 -I/mesos/3rdparty/libprocess/src/tests/src -I/mesos/3rdparty/libprocess/include -I/mesos/build/3rdparty/http_parser-2.6.2/src/http_parser-2.6.2 -I/mesos/build/3rdparty/libevent-2.1.5-beta/src/libevent-2.1.5-beta-lib/lib/include -I/mesos/build/3rdparty/gmock-1.7.0/src/gmock-1.7.0/include -I/mesos/build/3rdparty/gmock-1.7.0/src/gmock-1.7.0/gtest/include    -o CMakeFiles/libprocess-tests.dir/reap_tests.cpp.o -c /mesos/3rdparty/libprocess/src/tests/reap_tests.cpp
Linking CXX executable libprocess-tests
cd /mesos/build/3rdparty/libprocess/src/tests && /usr/bin/cmake -E cmake_link_script CMakeFiles/libprocess-tests.dir/link.txt --verbose=1
/usr/bin/clang++-3.5    -O2 -std=c++11 -g    CMakeFiles/libprocess-tests.dir/main.cpp.o CMakeFiles/libprocess-tests.dir/collect_tests.cpp.o CMakeFiles/libprocess-tests.dir/decoder_tests.cpp.o CMakeFiles/libprocess-tests.dir/encoder_tests.cpp.o CMakeFiles/libprocess-tests.dir/future_tests.cpp.o CMakeFiles/libprocess-tests.dir/http_tests.cpp.o CMakeFiles/libprocess-tests.dir/limiter_tests.cpp.o CMakeFiles/libprocess-tests.dir/loop_tests.cpp.o CMakeFiles/libprocess-tests.dir/metrics_tests.cpp.o CMakeFiles/libprocess-tests.dir/mutex_tests.cpp.o CMakeFiles/libprocess-tests.dir/owned_tests.cpp.o CMakeFiles/libprocess-tests.dir/process_tests.cpp.o CMakeFiles/libprocess-tests.dir/queue_tests.cpp.o CMakeFiles/libprocess-tests.dir/sequence_tests.cpp.o CMakeFiles/libprocess-tests.dir/shared_tests.cpp.o CMakeFiles/libprocess-tests.dir/socket_tests.cpp.o CMakeFiles/libprocess-tests.dir/statistics_tests.cpp.o CMakeFiles/libprocess-tests.dir/subprocess_tests.cpp.o CMakeFiles/libprocess-tests.dir/system_tests.cpp.o CMakeFiles/libprocess-tests.dir/time_tests.cpp.o CMakeFiles/libprocess-tests.dir/timeseries_tests.cpp.o CMakeFiles/libprocess-tests.dir/io_tests.cpp.o CMakeFiles/libprocess-tests.dir/reap_tests.cpp.o  -o libprocess-tests  -L/mesos/build/3rdparty/glog-0.3.3/src/glog-0.3.3-lib/lib/lib  -L/mesos/build/3rdparty/protobuf-2.6.1/src/protobuf-2.6.1-lib/lib/lib  -L/mesos/build/3rdparty/http_parser-2.6.2/src/http_parser-2.6.2-build  -L/mesos/build/3rdparty/libevent-2.1.5-beta/src/libevent-2.1.5-beta-lib/lib/lib  -L/mesos/build/3rdparty/libprocess/..  -L/mesos/build/3rdparty/gmock-1.7.0/src/gmock-1.7.0-lib/lib  -L/mesos/build/3rdparty/gmock-1.7.0/src/gmock-1.7.0-build/gtest/lib/.libs -rdynamic ../libprocess-0.0.1.so.0.0.1 -lapr-1 -lcurl -lglog -lsvn_delta-1 -lsvn_diff-1 -lsvn_subr-1 -lprotobuf -ldl -lapr-1 -lrt -lhttp_parser -levent -lrt -lz -lpthread -lgmock -lgtest -lhttp_parser -levent -lz -lpthread -Wl,-rpath,/mesos/build/3rdparty/glog-0.3.3/src/glog-0.3.3-lib/lib/lib:/mesos/build/3rdparty/protobuf-2.6.1/src/protobuf-2.6.1-lib/lib/lib:/mesos/build/3rdparty/http_parser-2.6.2/src/http_parser-2.6.2-build:/mesos/build/3rdparty/libevent-2.1.5-beta/src/libevent-2.1.5-beta-lib/lib/lib:/mesos/build/3rdparty/libprocess/..:/mesos/build/3rdparty/gmock-1.7.0/src/gmock-1.7.0-lib/lib:/mesos/build/3rdparty/gmock-1.7.0/src/gmock-1.7.0-build/gtest/lib/.libs:/mesos/build/3rdparty/libprocess/src 
make[3]: Leaving directory `/mesos/build'
/usr/bin/cmake -E cmake_progress_report /mesos/build/CMakeFiles  11 12 13
[ 46%] Built target libprocess-tests
make[3]: Leaving directory `/mesos/build'
make[2]: *** [src/CMakeFiles/mesos-1.2.0.dir/all] Error 2
make[2]: Leaving directory `/mesos/build'
make[1]: *** [CMakeFiles/check.dir/rule] Error 2
make: *** [check] Error 2
make[1]: Leaving directory `/mesos/build'
+ docker rmi mesos-1484095766-2512
Untagged: mesos-1484095766-2512:latest
Deleted: sha256:11746ab0390cdd00b8dc7bb83c1d78d9079127b91c0c7240f8f3ea04e5b3448d
Deleted: sha256:9b816b6cdce2404d040501e28f1c55dbd85e7d62c8756247d049e0a90faf622c
Deleted: sha256:ebd3f742585a9c48025dd9a586e372705ab2f78b6e049dc40ca7dae1eb38ed10
Deleted: sha256:d90bb8ca5085f071bb29ff1ad5b2aa890cba7e0996d36ffed2d984e188692a37
Deleted: sha256:d7d8d6e1d4c045a072b06baf1948551f74481fcdeecb3725ba925b0f004a1d58
Deleted: sha256:77298f74a106bec97315841b598a27d3743c7b1e3c920c330ba6270434277db8
Deleted: sha256:97c432eb751d527d9f7d06fa3b2e4450e33f34ee028b9e4ea773cd427287c088
Deleted: sha256:4e13b2989668755e22ef28b7755eccd6414872b555a4aebf543e3813a585a7de
Deleted: sha256:06729bc322a9635e4ad9805bccf87075acae2a8521e59f920e7ac03306b61178
Deleted: sha256:b2594883d18ef5218d774f0b31419b676e51af1e0663257d7eeb220318248b90
Deleted: sha256:01574cac6ffa5fe84aec28e130dcf0715b01998621e6d1025b32edbe33205eeb
Deleted: sha256:9803dc1900dac9a06e37b7f05adf81ff0475eba8ee993d3087654c5bf270ae54
Deleted: sha256:55edb8dcfdc0adeb3afe394c423e5a8a6ceff616c2cca0681404e94b771ddfec
Deleted: sha256:06501e4464cbf8ab549a6706488974c7a83da4d24a775239304fbd032aad218d
Deleted: sha256:e867b6ac29426b78b484c0f139e68a5240420ae204b41ae761f97d97cb0d8107
Deleted: sha256:2fc9fa47d9acb82283230dd62364c730359c7157819c7649f4a72d0e8636c328
Deleted: sha256:48db94e69f4c5722e61baa59c637ab7aa8bce600c1db318fd8ef8580398347f9
Deleted: sha256:5f5726fab49ab3e5fceb78ac3e76f9a03152bfd15aa8174ebc48d7ba74d9abab
Deleted: sha256:e2b358078f2218f78785ad6389790a435f9f12be35ec3839a496d8dc55c280db
Deleted: sha256:9119b63a4e430f39be0316508fb79cbd0942ab9a34830e1d7fad0efa8eadf8ba
Deleted: sha256:fc596d88b77ba828d569cc08d27047064f2a13d8789ee4579295cf393bd442ca
Deleted: sha256:65b19e08a54c1785e28564c0674dbaf740e0835d57722853bcdb3a229fbfd3c5
Deleted: sha256:7e48f0ebc61194bfc9889fa3042c6f18dfdc555aad3ce72ac2711ac300fa6aef
Deleted: sha256:8d5bb776d9f58190c5bcd1a3740f8fb37053feb67e6a0ac7adc71b3b0d8d093b
Build step 'Execute shell' marked build as failure

Mime
View raw message