mesos-builds mailing list archives

Site index · List index
Message view « Date » · « Thread »
Top « Date » · « Thread »
From Apache Jenkins Server <jenk...@builds.apache.org>
Subject Build failed in Jenkins: Mesos » cmake,gcc,--verbose,GLOG_v=1 MESOS_VERBOSE=1,centos:7,(docker||Hadoop)&&(!ubuntu-us1)&&(!ubuntu-6)&&(!ubuntu-eu2) #3102
Date Wed, 11 Jan 2017 11:22:06 GMT
See <https://builds.apache.org/job/Mesos/BUILDTOOL=cmake,COMPILER=gcc,CONFIGURATION=--verbose,ENVIRONMENT=GLOG_v=1%20MESOS_VERBOSE=1,OS=centos%3A7,label_exp=(docker%7C%7CHadoop)&&(!ubuntu-us1)&&(!ubuntu-6)&&(!ubuntu-eu2)/3102/changes>

Changes:

[benjamin.hindman] Eliminated an EOF race condition in libprocess SSL socket.

[benjamin.hindman] Future::after memory leak fix.

[benjamin.hindman] Used loop in Pipe::Reader::readAll.

[mpark] Removed unused peek function.

[mpark] Fix compilation error for `clang-3.5` type deduction error.

------------------------------------------
[...truncated 159418 lines...]
I0111 11:20:52.693024 25403 containerizer.cpp:220] Using isolation: posix/cpu,posix/mem,filesystem/posix,network/cni
W0111 11:20:52.693409 25403 backend.cpp:76] Failed to create 'aufs' backend: AufsBackend requires
root privileges, but is running as user mesos
W0111 11:20:52.693485 25403 backend.cpp:76] Failed to create 'bind' backend: BindBackend requires
root privileges
I0111 11:20:52.695430 25405 slave.cpp:209] Mesos agent started on (676)@172.17.0.3:36368
I0111 11:20:52.695447 25405 slave.cpp:210] Flags at startup: --acls="" --appc_simple_discovery_uri_prefix="http://"
--appc_store_dir="/tmp/mesos/store/appc" --authenticate_http_readonly="true" --authenticate_http_readwrite="true"
--authenticatee="crammd5" --authentication_backoff_factor="1secs" --authorizer="local" --cgroups_cpu_enable_pids_and_tids_count="false"
--cgroups_enable_cfs="false" --cgroups_hierarchy="/sys/fs/cgroup" --cgroups_limit_swap="false"
--cgroups_root="mesos" --container_disk_watch_interval="15secs" --containerizers="mesos" --credential="/tmp/Endpoint_SlaveEndpointTest_AuthorizedRequest_1_zR5KNc/credential"
--default_role="*" --disk_watch_interval="1mins" --docker="docker" --docker_kill_orphans="true"
--docker_registry="https://registry-1.docker.io" --docker_remove_delay="6hrs" --docker_socket="/var/run/docker.sock"
--docker_stop_timeout="0ns" --docker_store_dir="/tmp/mesos/store/docker" --docker_volume_checkpoint_dir="/var/run/mesos/isolators/docker/volume"
--enforce_container_disk_quota="false" --executor_registration_timeout="1mins" --executor_shutdown_grace_period="5secs"
--fetcher_cache_dir="/tmp/Endpoint_SlaveEndpointTest_AuthorizedRequest_1_zR5KNc/fetch" --fetcher_cache_size="2GB"
--frameworks_home="" --gc_delay="1weeks" --gc_disk_headroom="0.1" --hadoop_home="" --help="false"
--hostname_lookup="true" --http_authenticators="basic" --http_command_executor="false" --http_credentials="/tmp/Endpoint_SlaveEndpointTest_AuthorizedRequest_1_zR5KNc/http_credentials"
--http_heartbeat_interval="30secs" --image_provisioner_backend="copy" --initialize_driver_logging="true"
--isolation="posix/cpu,posix/mem" --launcher="posix" --launcher_dir="/mesos/build/src" --logbufsecs="0"
--logging_level="INFO" --max_completed_executors_per_framework="150" --oversubscribed_resources_interval="15secs"
--perf_duration="10secs" --perf_interval="1mins" --qos_correction_interval_min="0ns" --quiet="false"
--recover="reconnect" --recovery_timeout="15mins" --registration_backoff_factor="10ms" --resources="cpus:2;gpus:0;mem:1024;disk:1024;ports:[31000-32000]"
--revocable_cpu_low_priority="true" --runtime_dir="/tmp/Endpoint_SlaveEndpointTest_AuthorizedRequest_1_zR5KNc"
--sandbox_directory="/mnt/mesos/sandbox" --strict="true" --switch_user="true" --systemd_enable_support="true"
--systemd_runtime_directory="/run/systemd/system" --version="false" --work_dir="/tmp/Endpoint_SlaveEndpointTest_AuthorizedRequest_1_GOIwC1"
I0111 11:20:52.695776 25405 credentials.hpp:86] Loading credential for authentication from
'/tmp/Endpoint_SlaveEndpointTest_AuthorizedRequest_1_zR5KNc/credential'
I0111 11:20:52.695868 25405 slave.cpp:352] Agent using credential for: test-principal
I0111 11:20:52.695879 25405 credentials.hpp:37] Loading credentials for authentication from
'/tmp/Endpoint_SlaveEndpointTest_AuthorizedRequest_1_zR5KNc/http_credentials'
I0111 11:20:52.695983 25405 http.cpp:922] Using default 'basic' HTTP authenticator for realm
'mesos-agent-readonly'
I0111 11:20:52.696027 25405 http.cpp:922] Using default 'basic' HTTP authenticator for realm
'mesos-agent-readwrite'
I0111 11:20:52.696370 25405 slave.cpp:539] Agent resources: cpus(*):2; mem(*):1024; disk(*):1024;
ports(*):[31000-32000]
I0111 11:20:52.696413 25405 slave.cpp:547] Agent attributes: [  ]
I0111 11:20:52.696422 25405 slave.cpp:552] Agent hostname: 902a272655d4
I0111 11:20:52.697044 25405 state.cpp:60] Recovering state from '/tmp/Endpoint_SlaveEndpointTest_AuthorizedRequest_1_GOIwC1/meta'
I0111 11:20:52.697172 25405 status_update_manager.cpp:203] Recovering status update manager
I0111 11:20:52.697226 25405 containerizer.cpp:599] Recovering containerizer
I0111 11:20:52.697665 25405 provisioner.cpp:251] Provisioner recovery complete
I0111 11:20:52.697793 25405 slave.cpp:5421] Finished recovery
I0111 11:20:52.698194 25405 slave.cpp:5595] Querying resource estimator for oversubscribable
resources
I0111 11:20:52.698338 25405 slave.cpp:5609] Received oversubscribable resources {} from the
resource estimator
I0111 11:20:52.699291 25411 process.cpp:3676] Handling HTTP event for process 'slave(676)'
with path: '/slave(676)/monitor/statistics.json'
I0111 11:20:52.699659 25411 http.cpp:874] Authorizing principal 'test-principal' to GET the
'/monitor/statistics.json' endpoint
I0111 11:20:52.700841 25403 slave.cpp:796] Agent terminating
[       OK ] Endpoint/SlaveEndpointTest.AuthorizedRequest/1 (12 ms)
[ RUN      ] Endpoint/SlaveEndpointTest.AuthorizedRequest/2
I0111 11:20:52.705081 25403 containerizer.cpp:220] Using isolation: posix/cpu,posix/mem,filesystem/posix,network/cni
W0111 11:20:52.705361 25403 backend.cpp:76] Failed to create 'aufs' backend: AufsBackend requires
root privileges, but is running as user mesos
W0111 11:20:52.705433 25403 backend.cpp:76] Failed to create 'bind' backend: BindBackend requires
root privileges
I0111 11:20:52.706454 25414 slave.cpp:209] Mesos agent started on (677)@172.17.0.3:36368
I0111 11:20:52.706472 25414 slave.cpp:210] Flags at startup: --acls="" --appc_simple_discovery_uri_prefix="http://"
--appc_store_dir="/tmp/mesos/store/appc" --authenticate_http_readonly="true" --authenticate_http_readwrite="true"
--authenticatee="crammd5" --authentication_backoff_factor="1secs" --authorizer="local" --cgroups_cpu_enable_pids_and_tids_count="false"
--cgroups_enable_cfs="false" --cgroups_hierarchy="/sys/fs/cgroup" --cgroups_limit_swap="false"
--cgroups_root="mesos" --container_disk_watch_interval="15secs" --containerizers="mesos" --credential="/tmp/Endpoint_SlaveEndpointTest_AuthorizedRequest_2_rTLDDV/credential"
--default_role="*" --disk_watch_interval="1mins" --docker="docker" --docker_kill_orphans="true"
--docker_registry="https://registry-1.docker.io" --docker_remove_delay="6hrs" --docker_socket="/var/run/docker.sock"
--docker_stop_timeout="0ns" --docker_store_dir="/tmp/mesos/store/docker" --docker_volume_checkpoint_dir="/var/run/mesos/isolators/docker/volume"
--enforce_container_disk_quota="false" --executor_registration_timeout="1mins" --executor_shutdown_grace_period="5secs"
--fetcher_cache_dir="/tmp/Endpoint_SlaveEndpointTest_AuthorizedRequest_2_rTLDDV/fetch" --fetcher_cache_size="2GB"
--frameworks_home="" --gc_delay="1weeks" --gc_disk_headroom="0.1" --hadoop_home="" --help="false"
--hostname_lookup="true" --http_authenticators="basic" --http_command_executor="false" --http_credentials="/tmp/Endpoint_SlaveEndpointTest_AuthorizedRequest_2_rTLDDV/http_credentials"
--http_heartbeat_interval="30secs" --image_provisioner_backend="copy" --initialize_driver_logging="true"
--isolation="posix/cpu,posix/mem" --launcher="posix" --launcher_dir="/mesos/build/src" --logbufsecs="0"
--logging_level="INFO" --max_completed_executors_per_framework="150" --oversubscribed_resources_interval="15secs"
--perf_duration="10secs" --perf_interval="1mins" --qos_correction_interval_min="0ns" --quiet="false"
--recover="reconnect" --recovery_timeout="15mins" --registration_backoff_factor="10ms" --resources="cpus:2;gpus:0;mem:1024;disk:1024;ports:[31000-32000]"
--revocable_cpu_low_priority="true" --runtime_dir="/tmp/Endpoint_SlaveEndpointTest_AuthorizedRequest_2_rTLDDV"
--sandbox_directory="/mnt/mesos/sandbox" --strict="true" --switch_user="true" --systemd_enable_support="true"
--systemd_runtime_directory="/run/systemd/system" --version="false" --work_dir="/tmp/Endpoint_SlaveEndpointTest_AuthorizedRequest_2_QCaoqK"
I0111 11:20:52.706879 25414 credentials.hpp:86] Loading credential for authentication from
'/tmp/Endpoint_SlaveEndpointTest_AuthorizedRequest_2_rTLDDV/credential'
I0111 11:20:52.707016 25414 slave.cpp:352] Agent using credential for: test-principal
I0111 11:20:52.707034 25414 credentials.hpp:37] Loading credentials for authentication from
'/tmp/Endpoint_SlaveEndpointTest_AuthorizedRequest_2_rTLDDV/http_credentials'
I0111 11:20:52.707180 25414 http.cpp:922] Using default 'basic' HTTP authenticator for realm
'mesos-agent-readonly'
I0111 11:20:52.707264 25414 http.cpp:922] Using default 'basic' HTTP authenticator for realm
'mesos-agent-readwrite'
I0111 11:20:52.707677 25414 slave.cpp:539] Agent resources: cpus(*):2; mem(*):1024; disk(*):1024;
ports(*):[31000-32000]
I0111 11:20:52.707710 25414 slave.cpp:547] Agent attributes: [  ]
I0111 11:20:52.707715 25414 slave.cpp:552] Agent hostname: 902a272655d4
I0111 11:20:52.708086 25418 state.cpp:60] Recovering state from '/tmp/Endpoint_SlaveEndpointTest_AuthorizedRequest_2_QCaoqK/meta'
I0111 11:20:52.708220 25413 status_update_manager.cpp:203] Recovering status update manager
I0111 11:20:52.708358 25404 containerizer.cpp:599] Recovering containerizer
I0111 11:20:52.708834 25418 provisioner.cpp:251] Provisioner recovery complete
I0111 11:20:52.709005 25418 slave.cpp:5421] Finished recovery
I0111 11:20:52.709394 25418 slave.cpp:5595] Querying resource estimator for oversubscribable
resources
I0111 11:20:52.709522 25419 slave.cpp:5609] Received oversubscribable resources {} from the
resource estimator
I0111 11:20:52.710140 25411 process.cpp:3676] Handling HTTP event for process 'slave(677)'
with path: '/slave(677)/containers'
I0111 11:20:52.710592 25419 http.cpp:874] Authorizing principal 'test-principal' to GET the
'/containers' endpoint
I0111 11:20:52.711735 25404 slave.cpp:796] Agent terminating
[       OK ] Endpoint/SlaveEndpointTest.AuthorizedRequest/2 (10 ms)
[ RUN      ] Endpoint/SlaveEndpointTest.UnauthorizedRequest/0
I0111 11:20:52.715870 25403 containerizer.cpp:220] Using isolation: posix/cpu,posix/mem,filesystem/posix,network/cni
W0111 11:20:52.716156 25403 backend.cpp:76] Failed to create 'aufs' backend: AufsBackend requires
root privileges, but is running as user mesos
W0111 11:20:52.716234 25403 backend.cpp:76] Failed to create 'bind' backend: BindBackend requires
root privileges
I0111 11:20:52.717119 25409 slave.cpp:209] Mesos agent started on (678)@172.17.0.3:36368
I0111 11:20:52.717131 25409 slave.cpp:210] Flags at startup: --acls="" --appc_simple_discovery_uri_prefix="http://"
--appc_store_dir="/tmp/mesos/store/appc" --authenticate_http_readonly="true" --authenticate_http_readwrite="true"
--authenticatee="crammd5" --authentication_backoff_factor="1secs" --authorizer="local" --cgroups_cpu_enable_pids_and_tids_count="false"
--cgroups_enable_cfs="false" --cgroups_hierarchy="/sys/fs/cgroup" --cgroups_limit_swap="false"
--cgroups_root="mesos" --container_disk_watch_interval="15secs" --containerizers="mesos" --credential="/tmp/Endpoint_SlaveEndpointTest_UnauthorizedRequest_0_xBBCAE/credential"
--default_role="*" --disk_watch_interval="1mins" --docker="docker" --docker_kill_orphans="true"
--docker_registry="https://registry-1.docker.io" --docker_remove_delay="6hrs" --docker_socket="/var/run/docker.sock"
--docker_stop_timeout="0ns" --docker_store_dir="/tmp/mesos/store/docker" --docker_volume_checkpoint_dir="/var/run/mesos/isolators/docker/volume"
--enforce_container_disk_quota="false" --executor_registration_timeout="1mins" --executor_shutdown_grace_period="5secs"
--fetcher_cache_dir="/tmp/Endpoint_SlaveEndpointTest_UnauthorizedRequest_0_xBBCAE/fetch" --fetcher_cache_size="2GB"
--frameworks_home="" --gc_delay="1weeks" --gc_disk_headroom="0.1" --hadoop_home="" --help="false"
--hostname_lookup="true" --http_authenticators="basic" --http_command_executor="false" --http_credentials="/tmp/Endpoint_SlaveEndpointTest_UnauthorizedRequest_0_xBBCAE/http_credentials"
--http_heartbeat_interval="30secs" --image_provisioner_backend="copy" --initialize_driver_logging="true"
--isolation="posix/cpu,posix/mem" --launcher="posix" --launcher_dir="/mesos/build/src" --logbufsecs="0"
--logging_level="INFO" --max_completed_executors_per_framework="150" --oversubscribed_resources_interval="15secs"
--perf_duration="10secs" --perf_interval="1mins" --qos_correction_interval_min="0ns" --quiet="false"
--recover="reconnect" --recovery_timeout="15mins" --registration_backoff_factor="10ms" --resources="cpus:2;gpus:0;mem:1024;disk:1024;ports:[31000-32000]"
--revocable_cpu_low_priority="true" --runtime_dir="/tmp/Endpoint_SlaveEndpointTest_UnauthorizedRequest_0_xBBCAE"
--sandbox_directory="/mnt/mesos/sandbox" --strict="true" --switch_user="true" --systemd_enable_support="true"
--systemd_runtime_directory="/run/systemd/system" --version="false" --work_dir="/tmp/Endpoint_SlaveEndpointTest_UnauthorizedRequest_0_gsaClt"
I0111 11:20:52.717427 25409 credentials.hpp:86] Loading credential for authentication from
'/tmp/Endpoint_SlaveEndpointTest_UnauthorizedRequest_0_xBBCAE/credential'
I0111 11:20:52.717507 25409 slave.cpp:352] Agent using credential for: test-principal
I0111 11:20:52.717525 25409 credentials.hpp:37] Loading credentials for authentication from
'/tmp/Endpoint_SlaveEndpointTest_UnauthorizedRequest_0_xBBCAE/http_credentials'
I0111 11:20:52.717619 25409 http.cpp:922] Using default 'basic' HTTP authenticator for realm
'mesos-agent-readonly'
I0111 11:20:52.717658 25409 http.cpp:922] Using default 'basic' HTTP authenticator for realm
'mesos-agent-readwrite'
I0111 11:20:52.717962 25409 slave.cpp:539] Agent resources: cpus(*):2; mem(*):1024; disk(*):1024;
ports(*):[31000-32000]
I0111 11:20:52.717994 25409 slave.cpp:547] Agent attributes: [  ]
I0111 11:20:52.718004 25409 slave.cpp:552] Agent hostname: 902a272655d4
I0111 11:20:52.718317 25415 state.cpp:60] Recovering state from '/tmp/Endpoint_SlaveEndpointTest_UnauthorizedRequest_0_gsaClt/meta'
I0111 11:20:52.718528 25404 status_update_manager.cpp:203] Recovering status update manager
I0111 11:20:52.718614 25413 containerizer.cpp:599] Recovering containerizer
I0111 11:20:52.719112 25417 provisioner.cpp:251] Provisioner recovery complete
I0111 11:20:52.719254 25408 slave.cpp:5421] Finished recovery
I0111 11:20:52.719588 25408 slave.cpp:5595] Querying resource estimator for oversubscribable
resources
I0111 11:20:52.719655 25415 slave.cpp:5609] Received oversubscribable resources {} from the
resource estimator
I0111 11:20:52.720377 25418 process.cpp:3676] Handling HTTP event for process 'slave(678)'
with path: '/slave(678)/monitor/statistics'
I0111 11:20:52.720768 25406 http.cpp:874] Authorizing principal 'test-principal' to GET the
'/monitor/statistics' endpoint
I0111 11:20:52.721539 25406 slave.cpp:796] Agent terminating
[       OK ] Endpoint/SlaveEndpointTest.UnauthorizedRequest/0 (10 ms)
[ RUN      ] Endpoint/SlaveEndpointTest.UnauthorizedRequest/1
I0111 11:20:52.725443 25403 containerizer.cpp:220] Using isolation: posix/cpu,posix/mem,filesystem/posix,network/cni
W0111 11:20:52.725741 25403 backend.cpp:76] Failed to create 'aufs' backend: AufsBackend requires
root privileges, but is running as user mesos
W0111 11:20:52.725826 25403 backend.cpp:76] Failed to create 'bind' backend: BindBackend requires
root privileges
I0111 11:20:52.726811 25414 slave.cpp:209] Mesos agent started on (679)@172.17.0.3:36368
I0111 11:20:52.726826 25414 slave.cpp:210] Flags at startup: --acls="" --appc_simple_discovery_uri_prefix="http://"
--appc_store_dir="/tmp/mesos/store/appc" --authenticate_http_readonly="true" --authenticate_http_readwrite="true"
--authenticatee="crammd5" --authentication_backoff_factor="1secs" --authorizer="local" --cgroups_cpu_enable_pids_and_tids_count="false"
--cgroups_enable_cfs="false" --cgroups_hierarchy="/sys/fs/cgroup" --cgroups_limit_swap="false"
--cgroups_root="mesos" --container_disk_watch_interval="15secs" --containerizers="mesos" --credential="/tmp/Endpoint_SlaveEndpointTest_UnauthorizedRequest_1_dLdYDn/credential"
--default_role="*" --disk_watch_interval="1mins" --docker="docker" --docker_kill_orphans="true"
--docker_registry="https://registry-1.docker.io" --docker_remove_delay="6hrs" --docker_socket="/var/run/docker.sock"
--docker_stop_timeout="0ns" --docker_store_dir="/tmp/mesos/store/docker" --docker_volume_checkpoint_dir="/var/run/mesos/isolators/docker/volume"
--enforce_container_disk_quota="false" --executor_registration_timeout="1mins" --executor_shutdown_grace_period="5secs"
--fetcher_cache_dir="/tmp/Endpoint_SlaveEndpointTest_UnauthorizedRequest_1_dLdYDn/fetch" --fetcher_cache_size="2GB"
--frameworks_home="" --gc_delay="1weeks" --gc_disk_headroom="0.1" --hadoop_home="" --help="false"
--hostname_lookup="true" --http_authenticators="basic" --http_command_executor="false" --http_credentials="/tmp/Endpoint_SlaveEndpointTest_UnauthorizedRequest_1_dLdYDn/http_credentials"
--http_heartbeat_interval="30secs" --image_provisioner_backend="copy" --initialize_driver_logging="true"
--isolation="posix/cpu,posix/mem" --launcher="posix" --launcher_dir="/mesos/build/src" --logbufsecs="0"
--logging_level="INFO" --max_completed_executors_per_framework="150" --oversubscribed_resources_interval="15secs"
--perf_duration="10secs" --perf_interval="1mins" --qos_correction_interval_min="0ns" --quiet="false"
--recover="reconnect" --recovery_timeout="15mins" --registration_backoff_factor="10ms" --resources="cpus:2;gpus:0;mem:1024;disk:1024;ports:[31000-32000]"
--revocable_cpu_low_priority="true" --runtime_dir="/tmp/Endpoint_SlaveEndpointTest_UnauthorizedRequest_1_dLdYDn"
--sandbox_directory="/mnt/mesos/sandbox" --strict="true" --switch_user="true" --systemd_enable_support="true"
--systemd_runtime_directory="/run/systemd/system" --version="false" --work_dir="/tmp/Endpoint_SlaveEndpointTest_UnauthorizedRequest_1_88yonc"
I0111 11:20:52.727149 25414 credentials.hpp:86] Loading credential for authentication from
'/tmp/Endpoint_SlaveEndpointTest_UnauthorizedRequest_1_dLdYDn/credential'
I0111 11:20:52.727234 25414 slave.cpp:352] Agent using credential for: test-principal
I0111 11:20:52.727248 25414 credentials.hpp:37] Loading credentials for authentication from
'/tmp/Endpoint_SlaveEndpointTest_UnauthorizedRequest_1_dLdYDn/http_credentials'
I0111 11:20:52.727352 25414 http.cpp:922] Using default 'basic' HTTP authenticator for realm
'mesos-agent-readonly'
I0111 11:20:52.727398 25414 http.cpp:922] Using default 'basic' HTTP authenticator for realm
'mesos-agent-readwrite'
I0111 11:20:52.727799 25414 slave.cpp:539] Agent resources: cpus(*):2; mem(*):1024; disk(*):1024;
ports(*):[31000-32000]
I0111 11:20:52.727843 25414 slave.cpp:547] Agent attributes: [  ]
I0111 11:20:52.727850 25414 slave.cpp:552] Agent hostname: 902a272655d4
I0111 11:20:52.728144 25419 state.cpp:60] Recovering state from '/tmp/Endpoint_SlaveEndpointTest_UnauthorizedRequest_1_88yonc/meta'
I0111 11:20:52.728302 25408 status_update_manager.cpp:203] Recovering status update manager
I0111 11:20:52.728369 25408 containerizer.cpp:599] Recovering containerizer
I0111 11:20:52.728862 25410 provisioner.cpp:251] Provisioner recovery complete
I0111 11:20:52.729028 25412 slave.cpp:5421] Finished recovery
I0111 11:20:52.729343 25412 slave.cpp:5595] Querying resource estimator for oversubscribable
resources
I0111 11:20:52.729529 25409 slave.cpp:5609] Received oversubscribable resources {} from the
resource estimator
I0111 11:20:52.730079 25412 process.cpp:3676] Handling HTTP event for process 'slave(679)'
with path: '/slave(679)/monitor/statistics.json'
I0111 11:20:52.730517 25419 http.cpp:874] Authorizing principal 'test-principal' to GET the
'/monitor/statistics.json' endpoint
I0111 11:20:52.731216 25403 slave.cpp:796] Agent terminating
[       OK ] Endpoint/SlaveEndpointTest.UnauthorizedRequest/1 (9 ms)
[ RUN      ] Endpoint/SlaveEndpointTest.UnauthorizedRequest/2
I0111 11:20:52.735764 25403 containerizer.cpp:220] Using isolation: posix/cpu,posix/mem,filesystem/posix,network/cni
W0111 11:20:52.736201 25403 backend.cpp:76] Failed to create 'aufs' backend: AufsBackend requires
root privileges, but is running as user mesos
W0111 11:20:52.736335 25403 backend.cpp:76] Failed to create 'bind' backend: BindBackend requires
root privileges
I0111 11:20:52.737835 25407 slave.cpp:209] Mesos agent started on (680)@172.17.0.3:36368
I0111 11:20:52.737854 25407 slave.cpp:210] Flags at startup: --acls="" --appc_simple_discovery_uri_prefix="http://"
--appc_store_dir="/tmp/mesos/store/appc" --authenticate_http_readonly="true" --authenticate_http_readwrite="true"
--authenticatee="crammd5" --authentication_backoff_factor="1secs" --authorizer="local" --cgroups_cpu_enable_pids_and_tids_count="false"
--cgroups_enable_cfs="false" --cgroups_hierarchy="/sys/fs/cgroup" --cgroups_limit_swap="false"
--cgroups_root="mesos" --container_disk_watch_interval="15secs" --containerizers="mesos" --credential="/tmp/Endpoint_SlaveEndpointTest_UnauthorizedRequest_2_tp9AN6/credential"
--default_role="*" --disk_watch_interval="1mins" --docker="docker" --docker_kill_orphans="true"
--docker_registry="https://registry-1.docker.io" --docker_remove_delay="6hrs" --docker_socket="/var/run/docker.sock"
--docker_stop_timeout="0ns" --docker_store_dir="/tmp/mesos/store/docker" --docker_volume_checkpoint_dir="/var/run/mesos/isolators/docker/volume"
--enforce_container_disk_quota="false" --executor_registration_timeout="1mins" --executor_shutdown_grace_period="5secs"
--fetcher_cache_dir="/tmp/Endpoint_SlaveEndpointTest_UnauthorizedRequest_2_tp9AN6/fetch" --fetcher_cache_size="2GB"
--frameworks_home="" --gc_delay="1weeks" --gc_disk_headroom="0.1" --hadoop_home="" --help="false"
--hostname_lookup="true" --http_authenticators="basic" --http_command_executor="false" --http_credentials="/tmp/Endpoint_SlaveEndpointTest_UnauthorizedRequest_2_tp9AN6/http_credentials"
--http_heartbeat_interval="30secs" --image_provisioner_backend="copy" --initialize_driver_logging="true"
--isolation="posix/cpu,posix/mem" --launcher="posix" --launcher_dir="/mesos/build/src" --logbufsecs="0"
--logging_level="INFO" --max_completed_executors_per_framework="150" --oversubscribed_resources_interval="15secs"
--perf_duration="10secs" --perf_interval="1mins" --qos_correction_interval_min="0ns" --quiet="false"
--recover="reconnect" --recovery_timeout="15mins" --registration_backoff_factor="10ms" --resources="cpus:2;gpus:0;mem:1024;disk:1024;ports:[31000-32000]"
--revocable_cpu_low_priority="true" --runtime_dir="/tmp/Endpoint_SlaveEndpointTest_UnauthorizedRequest_2_tp9AN6"
--sandbox_directory="/mnt/mesos/sandbox" --strict="true" --switch_user="true" --systemd_enable_support="true"
--systemd_runtime_directory="/run/systemd/system" --version="false" --work_dir="/tmp/Endpoint_SlaveEndpointTest_UnauthorizedRequest_2_YRirvV"
I0111 11:20:52.738217 25407 credentials.hpp:86] Loading credential for authentication from
'/tmp/Endpoint_SlaveEndpointTest_UnauthorizedRequest_2_tp9AN6/credential'
I0111 11:20:52.738323 25407 slave.cpp:352] Agent using credential for: test-principal
I0111 11:20:52.738335 25407 credentials.hpp:37] Loading credentials for authentication from
'/tmp/Endpoint_SlaveEndpointTest_UnauthorizedRequest_2_tp9AN6/http_credentials'
I0111 11:20:52.738539 25407 http.cpp:922] Using default 'basic' HTTP authenticator for realm
'mesos-agent-readonly'
I0111 11:20:52.738590 25407 http.cpp:922] Using default 'basic' HTTP authenticator for realm
'mesos-agent-readwrite'
I0111 11:20:52.738960 25407 slave.cpp:539] Agent resources: cpus(*):2; mem(*):1024; disk(*):1024;
ports(*):[31000-32000]
I0111 11:20:52.739003 25407 slave.cpp:547] Agent attributes: [  ]
I0111 11:20:52.739012 25407 slave.cpp:552] Agent hostname: 902a272655d4
I0111 11:20:52.739645 25407 state.cpp:60] Recovering state from '/tmp/Endpoint_SlaveEndpointTest_UnauthorizedRequest_2_YRirvV/meta'
I0111 11:20:52.739784 25407 status_update_manager.cpp:203] Recovering status update manager
I0111 11:20:52.739838 25407 containerizer.cpp:599] Recovering containerizer
I0111 11:20:52.740321 25407 provisioner.cpp:251] Provisioner recovery complete
I0111 11:20:52.740456 25407 slave.cpp:5421] Finished recovery
I0111 11:20:52.740846 25407 slave.cpp:5595] Querying resource estimator for oversubscribable
resources
I0111 11:20:52.740993 25407 slave.cpp:5609] Received oversubscribable resources {} from the
resource estimator
I0111 11:20:52.742283 25415 process.cpp:3676] Handling HTTP event for process 'slave(680)'
with path: '/slave(680)/containers'
I0111 11:20:52.742710 25415 http.cpp:874] Authorizing principal 'test-principal' to GET the
'/containers' endpoint
I0111 11:20:52.743724 25403 slave.cpp:796] Agent terminating
[       OK ] Endpoint/SlaveEndpointTest.UnauthorizedRequest/2 (21 ms)
[ RUN      ] Endpoint/SlaveEndpointTest.NoAuthorizer/0
I0111 11:20:52.763742 25403 containerizer.cpp:220] Using isolation: posix/cpu,posix/mem,filesystem/posix,network/cni
W0111 11:20:52.764314 25403 backend.cpp:76] Failed to create 'aufs' backend: AufsBackend requires
root privileges, but is running as user mesos
W0111 11:20:52.764437 25403 backend.cpp:76] Failed to create 'bind' backend: BindBackend requires
root privileges
I0111 11:20:52.765175 25403 cluster.cpp:446] Creating default 'local' authorizer
I0111 11:20:52.766835 25404 slave.cpp:209] Mesos agent started on (681)@172.17.0.3:36368
I0111 11:20:52.766862 25404 slave.cpp:210] Flags at startup: --acls="" --appc_simple_discovery_uri_prefix="http://"
--appc_store_dir="/tmp/mesos/store/appc" --authenticate_http_readonly="true" --authenticate_http_readwrite="true"
--authenticatee="crammd5" --authentication_backoff_factor="1secs" --authorizer="local" --cgroups_cpu_enable_pids_and_tids_count="false"
--cgroups_enable_cfs="false" --cgroups_hierarchy="/sys/fs/cgroup" --cgroups_limit_swap="false"
--cgroups_root="mesos" --container_disk_watch_interval="15secs" --containerizers="mesos" --credential="/tmp/Endpoint_SlaveEndpointTest_NoAuthorizer_0_bhnX9P/credential"
--default_role="*" --disk_watch_interval="1mins" --docker="docker" --docker_kill_orphans="true"
--docker_registry="https://registry-1.docker.io" --docker_remove_delay="6hrs" --docker_socket="/var/run/docker.sock"
--docker_stop_timeout="0ns" --docker_store_dir="/tmp/mesos/store/docker" --docker_volume_checkpoint_dir="/var/run/mesos/isolators/docker/volume"
--enforce_container_disk_quota="false" --executor_registration_timeout="1mins" --executor_shutdown_grace_period="5secs"
--fetcher_cache_dir="/tmp/Endpoint_SlaveEndpointTest_NoAuthorizer_0_bhnX9P/fetch" --fetcher_cache_size="2GB"
--frameworks_home="" --gc_delay="1weeks" --gc_disk_headroom="0.1" --hadoop_home="" --help="false"
--hostname_lookup="true" --http_authenticators="basic" --http_command_executor="false" --http_credentials="/tmp/Endpoint_SlaveEndpointTest_NoAuthorizer_0_bhnX9P/http_credentials"
--http_heartbeat_interval="30secs" --image_provisioner_backend="copy" --initialize_driver_logging="true"
--isolation="posix/cpu,posix/mem" --launcher="posix" --launcher_dir="/mesos/build/src" --logbufsecs="0"
--logging_level="INFO" --max_completed_executors_per_framework="150" --oversubscribed_resources_interval="15secs"
--perf_duration="10secs" --perf_interval="1mins" --qos_correction_interval_min="0ns" --quiet="false"
--recover="reconnect" --recovery_timeout="15mins" --registration_backoff_factor="10ms" --resources="cpus:2;gpus:0;mem:1024;disk:1024;ports:[31000-32000]"
--revocable_cpu_low_priority="true" --runtime_dir="/tmp/Endpoint_SlaveEndpointTest_NoAuthorizer_0_bhnX9P"
--sandbox_directory="/mnt/mesos/sandbox" --strict="true" --switch_user="true" --systemd_enable_support="true"
--systemd_runtime_directory="/run/systemd/system" --version="false" --work_dir="/tmp/Endpoint_SlaveEndpointTest_NoAuthorizer_0_seZ9NE"
I0111 11:20:52.767282 25404 credentials.hpp:86] Loading credential for authentication from
'/tmp/Endpoint_SlaveEndpointTest_NoAuthorizer_0_bhnX9P/credential'
I0111 11:20:52.767413 25404 slave.cpp:352] Agent using credential for: test-principal
I0111 11:20:52.767426 25404 credentials.hpp:37] Loading credentials for authentication from
'/tmp/Endpoint_SlaveEndpointTest_NoAuthorizer_0_bhnX9P/http_credentials'
I0111 11:20:52.767554 25404 http.cpp:922] Using default 'basic' HTTP authenticator for realm
'mesos-agent-readonly'
I0111 11:20:52.767608 25404 http.cpp:922] Using default 'basic' HTTP authenticator for realm
'mesos-agent-readwrite'
I0111 11:20:52.768028 25404 slave.cpp:539] Agent resources: cpus(*):2; mem(*):1024; disk(*):1024;
ports(*):[31000-32000]
I0111 11:20:52.768074 25404 slave.cpp:547] Agent attributes: [  ]
I0111 11:20:52.768084 25404 slave.cpp:552] Agent hostname: 902a272655d4
I0111 11:20:52.768826 25404 state.cpp:60] Recovering state from '/tmp/Endpoint_SlaveEndpointTest_NoAuthorizer_0_seZ9NE/meta'
I0111 11:20:52.769032 25404 status_update_manager.cpp:203] Recovering status update manager
I0111 11:20:52.769095 25404 containerizer.cpp:599] Recovering containerizer
I0111 11:20:52.769614 25404 provisioner.cpp:251] Provisioner recovery complete
I0111 11:20:52.769754 25404 slave.cpp:5421] Finished recovery
I0111 11:20:52.770189 25404 slave.cpp:5595] Querying resource estimator for oversubscribable
resources
I0111 11:20:52.770356 25404 slave.cpp:5609] Received oversubscribable resources {} from the
resource estimator
I0111 11:20:52.777482 25418 process.cpp:3676] Handling HTTP event for process 'slave(681)'
with path: '/slave(681)/monitor/statistics'
I0111 11:20:52.777925 25418 http.cpp:874] Authorizing principal 'test-principal' to GET the
'/monitor/statistics' endpoint
I0111 11:20:52.798759 25407 slave.cpp:796] Agent terminating
[       OK ] Endpoint/SlaveEndpointTest.NoAuthorizer/0 (46 ms)
[ RUN      ] Endpoint/SlaveEndpointTest.NoAuthorizer/1
I0111 11:20:52.807610 25403 containerizer.cpp:220] Using isolation: posix/cpu,posix/mem,filesystem/posix,network/cni
W0111 11:20:52.808097 25403 backend.cpp:76] Failed to create 'aufs' backend: AufsBackend requires
root privileges, but is running as user mesos
W0111 11:20:52.808183 25403 backend.cpp:76] Failed to create 'bind' backend: BindBackend requires
root privileges
I0111 11:20:52.808827 25403 cluster.cpp:446] Creating default 'local' authorizer
I0111 11:20:52.811215 25409 slave.cpp:209] Mesos agent started on (682)@172.17.0.3:36368
I0111 11:20:52.811250 25409 slave.cpp:210] Flags at startup: --acls="" --appc_simple_discovery_uri_prefix="http://"
--appc_store_dir="/tmp/mesos/store/appc" --authenticate_http_readonly="true" --authenticate_http_readwrite="true"
--authenticatee="crammd5" --authentication_backoff_factor="1secs" --authorizer="local" --cgroups_cpu_enable_pids_and_tids_count="false"
--cgroups_enable_cfs="false" --cgroups_hierarchy="/sys/fs/cgroup" --cgroups_limit_swap="false"
--cgroups_root="mesos" --container_disk_watch_interval="15secs" --containerizers="mesos" --credential="/tmp/Endpoint_SlaveEndpointTest_NoAuthorizer_1_nXRNXz/credential"
--default_role="*" --disk_watch_interval="1mins" --docker="docker" --docker_kill_orphans="true"
--docker_registry="https://registry-1.docker.io" --docker_remove_delay="6hrs" --docker_socket="/var/run/docker.sock"
--docker_stop_timeout="0ns" --docker_store_dir="/tmp/mesos/store/docker" --docker_volume_checkpoint_dir="/var/run/mesos/isolators/docker/volume"
--enforce_container_disk_quota="false" --executor_registration_timeout="1mins" --executor_shutdown_grace_period="5secs"
--fetcher_cache_dir="/tmp/Endpoint_SlaveEndpointTest_NoAuthorizer_1_nXRNXz/fetch" --fetcher_cache_size="2GB"
--frameworks_home="" --gc_delay="1weeks" --gc_disk_headroom="0.1" --hadoop_home="" --help="false"
--hostname_lookup="true" --http_authenticators="basic" --http_command_executor="false" --http_credentials="/tmp/Endpoint_SlaveEndpointTest_NoAuthorizer_1_nXRNXz/http_credentials"
--http_heartbeat_interval="30secs" --image_provisioner_backend="copy" --initialize_driver_logging="true"
--isolation="posix/cpu,posix/mem" --launcher="posix" --launcher_dir="/mesos/build/src" --logbufsecs="0"
--logging_level="INFO" --max_completed_executors_per_framework="150" --oversubscribed_resources_interval="15secs"
--perf_duration="10secs" --perf_interval="1mins" --qos_correction_interval_min="0ns" --quiet="false"
--recover="reconnect" --recovery_timeout="15mins" --registration_backoff_factor="10ms" --resources="cpus:2;gpus:0;mem:1024;disk:1024;ports:[31000-32000]"
--revocable_cpu_low_priority="true" --runtime_dir="/tmp/Endpoint_SlaveEndpointTest_NoAuthorizer_1_nXRNXz"
--sandbox_directory="/mnt/mesos/sandbox" --strict="true" --switch_user="true" --systemd_enable_support="true"
--systemd_runtime_directory="/run/systemd/system" --version="false" --work_dir="/tmp/Endpoint_SlaveEndpointTest_NoAuthorizer_1_yn8quo"
I0111 11:20:52.811702 25409 credentials.hpp:86] Loading credential for authentication from
'/tmp/Endpoint_SlaveEndpointTest_NoAuthorizer_1_nXRNXz/credential'
I0111 11:20:52.811856 25409 slave.cpp:352] Agent using credential for: test-principal
I0111 11:20:52.811872 25409 credentials.hpp:37] Loading credentials for authentication from
'/tmp/Endpoint_SlaveEndpointTest_NoAuthorizer_1_nXRNXz/http_credentials'
I0111 11:20:52.812005 25409 http.cpp:922] Using default 'basic' HTTP authenticator for realm
'mesos-agent-readonly'
I0111 11:20:52.812062 25409 http.cpp:922] Using default 'basic' HTTP authenticator for realm
'mesos-agent-readwrite'
I0111 11:20:52.812470 25409 slave.cpp:539] Agent resources: cpus(*):2; mem(*):1024; disk(*):1024;
ports(*):[31000-32000]
I0111 11:20:52.812517 25409 slave.cpp:547] Agent attributes: [  ]
I0111 11:20:52.812525 25409 slave.cpp:552] Agent hostname: 902a272655d4
I0111 11:20:52.813442 25409 state.cpp:60] Recovering state from '/tmp/Endpoint_SlaveEndpointTest_NoAuthorizer_1_yn8quo/meta'
I0111 11:20:52.813596 25409 status_update_manager.cpp:203] Recovering status update manager
I0111 11:20:52.813657 25409 containerizer.cpp:599] Recovering containerizer
I0111 11:20:52.814162 25409 provisioner.cpp:251] Provisioner recovery complete
I0111 11:20:52.814296 25409 slave.cpp:5421] Finished recovery
I0111 11:20:52.814698 25409 slave.cpp:5595] Querying resource estimator for oversubscribable
resources
I0111 11:20:52.814851 25409 slave.cpp:5609] Received oversubscribable resources {} from the
resource estimator
I0111 11:20:52.816045 25404 process.cpp:3676] Handling HTTP event for process 'slave(682)'
with path: '/slave(682)/monitor/statistics.json'
I0111 11:20:52.816576 25404 http.cpp:874] Authorizing principal 'test-principal' to GET the
'/monitor/statistics.json' endpoint
I0111 11:20:52.824476 25415 slave.cpp:796] Agent terminating
[       OK ] Endpoint/SlaveEndpointTest.NoAuthorizer/1 (26 ms)
[ RUN      ] Endpoint/SlaveEndpointTest.NoAuthorizer/2
I0111 11:20:52.829907 25403 containerizer.cpp:220] Using isolation: posix/cpu,posix/mem,filesystem/posix,network/cni
W0111 11:20:52.830261 25403 backend.cpp:76] Failed to create 'aufs' backend: AufsBackend requires
root privileges, but is running as user mesos
W0111 11:20:52.830353 25403 backend.cpp:76] Failed to create 'bind' backend: BindBackend requires
root privileges
I0111 11:20:52.831182 25403 cluster.cpp:446] Creating default 'local' authorizer
I0111 11:20:52.831689 25410 slave.cpp:209] Mesos agent started on (683)@172.17.0.3:36368
I0111 11:20:52.831707 25410 slave.cpp:210] Flags at startup: --acls="" --appc_simple_discovery_uri_prefix="http://"
--appc_store_dir="/tmp/mesos/store/appc" --authenticate_http_readonly="true" --authenticate_http_readwrite="true"
--authenticatee="crammd5" --authentication_backoff_factor="1secs" --authorizer="local" --cgroups_cpu_enable_pids_and_tids_count="false"
--cgroups_enable_cfs="false" --cgroups_hierarchy="/sys/fs/cgroup" --cgroups_limit_swap="false"
--cgroups_root="mesos" --container_disk_watch_interval="15secs" --containerizers="mesos" --credential="/tmp/Endpoint_SlaveEndpointTest_NoAuthorizer_2_Lg5j5j/credential"
--default_role="*" --disk_watch_interval="1mins" --docker="docker" --docker_kill_orphans="true"
--docker_registry="https://registry-1.docker.io" --docker_remove_delay="6hrs" --docker_socket="/var/run/docker.sock"
--docker_stop_timeout="0ns" --docker_store_dir="/tmp/mesos/store/docker" --docker_volume_checkpoint_dir="/var/run/mesos/isolators/docker/volume"
--enforce_container_disk_quota="false" --executor_registration_timeout="1mins" --executor_shutdown_grace_period="5secs"
--fetcher_cache_dir="/tmp/Endpoint_SlaveEndpointTest_NoAuthorizer_2_Lg5j5j/fetch" --fetcher_cache_size="2GB"
--frameworks_home="" --gc_delay="1weeks" --gc_disk_headroom="0.1" --hadoop_home="" --help="false"
--hostname_lookup="true" --http_authenticators="basic" --http_command_executor="false" --http_credentials="/tmp/Endpoint_SlaveEndpointTest_NoAuthorizer_2_Lg5j5j/http_credentials"
--http_heartbeat_interval="30secs" --image_provisioner_backend="copy" --initialize_driver_logging="true"
--isolation="posix/cpu,posix/mem" --launcher="posix" --launcher_dir="/mesos/build/src" --logbufsecs="0"
--logging_level="INFO" --max_completed_executors_per_framework="150" --oversubscribed_resources_interval="15secs"
--perf_duration="10secs" --perf_interval="1mins" --qos_correction_interval_min="0ns" --quiet="false"
--recover="reconnect" --recovery_timeout="15mins" --registration_backoff_factor="10ms" --resources="cpus:2;gpus:0;mem:1024;disk:1024;ports:[31000-32000]"
--revocable_cpu_low_priority="true" --runtime_dir="/tmp/Endpoint_SlaveEndpointTest_NoAuthorizer_2_Lg5j5j"
--sandbox_directory="/mnt/mesos/sandbox" --strict="true" --switch_user="true" --systemd_enable_support="true"
--systemd_runtime_directory="/run/systemd/system" --version="false" --work_dir="/tmp/Endpoint_SlaveEndpointTest_NoAuthorizer_2_4mCPx8"
I0111 11:20:52.832070 25410 credentials.hpp:86] Loading credential for authentication from
'/tmp/Endpoint_SlaveEndpointTest_NoAuthorizer_2_Lg5j5j/credential'
I0111 11:20:52.832151 25410 slave.cpp:352] Agent using credential for: test-principal
I0111 11:20:52.832164 25410 credentials.hpp:37] Loading credentials for authentication from
'/tmp/Endpoint_SlaveEndpointTest_NoAuthorizer_2_Lg5j5j/http_credentials'
I0111 11:20:52.832258 25410 http.cpp:922] Using default 'basic' HTTP authenticator for realm
'mesos-agent-readonly'
I0111 11:20:52.832304 25410 http.cpp:922] Using default 'basic' HTTP authenticator for realm
'mesos-agent-readwrite'
I0111 11:20:52.832594 25410 slave.cpp:539] Agent resources: cpus(*):2; mem(*):1024; disk(*):1024;
ports(*):[31000-32000]
I0111 11:20:52.832628 25410 slave.cpp:547] Agent attributes: [  ]
I0111 11:20:52.832633 25410 slave.cpp:552] Agent hostname: 902a272655d4
I0111 11:20:52.832962 25410 state.cpp:60] Recovering state from '/tmp/Endpoint_SlaveEndpointTest_NoAuthorizer_2_4mCPx8/meta'
I0111 11:20:52.833148 25404 status_update_manager.cpp:203] Recovering status update manager
I0111 11:20:52.833308 25412 containerizer.cpp:599] Recovering containerizer
I0111 11:20:52.833850 25409 provisioner.cpp:251] Provisioner recovery complete
I0111 11:20:52.834002 25413 slave.cpp:5421] Finished recovery
I0111 11:20:52.834494 25413 slave.cpp:5595] Querying resource estimator for oversubscribable
resources
I0111 11:20:52.834624 25413 slave.cpp:5609] Received oversubscribable resources {} from the
resource estimator
I0111 11:20:52.835448 25405 process.cpp:3676] Handling HTTP event for process 'slave(683)'
with path: '/slave(683)/containers'
I0111 11:20:52.835990 25415 http.cpp:874] Authorizing principal 'test-principal' to GET the
'/containers' endpoint
I0111 11:20:52.837415 25406 slave.cpp:796] Agent terminating
[       OK ] Endpoint/SlaveEndpointTest.NoAuthorizer/2 (12 ms)
[----------] 9 tests from Endpoint/SlaveEndpointTest (214 ms total)

[----------] Global test environment tear-down
[==========] 1398 tests from 157 test cases ran. (199779 ms total)
[  PASSED  ] 1396 tests.
[  FAILED  ] 2 tests, listed below:
[  FAILED  ] SlaveRecoveryTest/0.RecoverTerminatedExecutor, where TypeParam = mesos::internal::slave::MesosContainerizer
[  FAILED  ] ContentType/AgentAPIStreamingTest.AttachContainerInput/0, where GetParam() =
application/x-protobuf+recordio

 2 FAILED TESTS
  YOU HAVE 9 DISABLED TESTS

make[3]: *** [CMakeFiles/check] Error 1
make[3]: Leaving directory `/mesos/build'
make[2]: *** [CMakeFiles/check.dir/all] Error 2
make[2]: Leaving directory `/mesos/build'
make[1]: *** [CMakeFiles/check.dir/rule] Error 2
make[1]: Leaving directory `/mesos/build'
make: *** [check] Error 2
+ docker rmi mesos-1484130677-31446
Untagged: mesos-1484130677-31446:latest
Deleted: sha256:5d467075ebcc0ec8ff9a0d99fec91742240def035c1334cefd55d363286cf39b
Deleted: sha256:fac55b1920ab6b605d7015aa09e5c15f7d35e318b7cad9f2e7dc71971c596950
Deleted: sha256:6b72f0f5cf3fd1f34432dace19393b95eb3aaae801c593083fc02d0660374aff
Deleted: sha256:5d7fdb75b74c5b0c1391de27d63e70ccb6803ed425d602aec0acd92d295de4ea
Deleted: sha256:8f5a8bd31db7ee61921d7bca7bb4899ab9919aec9638327354b20ff2b9598248
Deleted: sha256:f93cbb557cb30db7a0a8732350a5c141e611182eeb1d1b385681ef0f303efefe
Deleted: sha256:54a74b647954297410781a2e2f804135878183daa606b5ec00c1d527f73b147b
Deleted: sha256:860075b3035f93a436b2c3d0357fcac1047cf66f890f106d1362e803dca1aace
Deleted: sha256:118ddd45171efc568fdeaf14e5f6302b5e7bf80236dfe302686919052f6aae6b
Deleted: sha256:aa725e90cdbf37b3a44766822cbd0713d4f215576aab1fb85bb5f98eceab195e
Deleted: sha256:c6b39ee4733a68a5a31b9c0744d68709a48d6a4b024c32da37e3cfdae67fac97
Deleted: sha256:eecfd7a2d0489a89dea4a78c92acd61e00d7dafe75aaa9221fd97c5d66b986ad
Deleted: sha256:1ef712855f37bad87cad31e74894b1da1c865f8f5f97cfbe8148f89ec698c5fa
Deleted: sha256:268b1ab8a44f6ca78ec91681614f18a0f6e3820040d3fd25e08bf52bdd30c656
Deleted: sha256:6c2732fa79841bc2ca7e516d09886de63757b2caaa6911f9009d4101df7f0a00
Deleted: sha256:892034ce1092b3156329209dcc55c98f9c6a954afc1213c6ee4bb258b50d5a08
Deleted: sha256:545b7f922a4ca7acc0f20b8c7692b24bbe63773c5b27c3d3d9cd08f54ad84c0f
Deleted: sha256:d916c33a88061583924239e46fadf4826c6b8c9c0a3afe64b67d5cee59838b4b
Deleted: sha256:5d094549c50d8301c000eb10eeb1606f7cf04592a61b117d266ded597e888632
Deleted: sha256:80fb0e0b17c9370d751582aea66a38dd77ec453459899e32e40649a6f61d1ffd
Deleted: sha256:c8151b207b593e37e3006e9853056c566d00b5904ec72f5b85a7043c7e0ccfae
Deleted: sha256:259f392fbbf44e4fe4c732bc96b33badb7fb4f37e1d13aa4b05cd1376f40a9dc
Deleted: sha256:682ff2209d1836bcf3753e6c38216a3b5a64c2675b4d468c5e6c76f882d86ec1
Deleted: sha256:077bfd3401683acbe87fe32867312bf077d8192828ab2f309b0048eac0a58db2
Deleted: sha256:2bdaf1cde917a46b797b09e1d57b102f56caa14eab4a7bc855ad71ea7359de22
Build step 'Execute shell' marked build as failure

Mime
View raw message